{"text_format":"1","workbook":"xlsx","n_sheets":7,"sheets":["Toelichting & Leeswijzer","Schema"," Verbandscontrole","Openstaande punten","Updates","CSVoutput","Functielijst"],"not_rendered":{"charts":0,"images":2,"macros":1,"external_links":0,"defined_names":2,"comments":0,"pivot_tables":0},"unopened":[],"bounds":{"document_bytes":16777216,"sheet_cells":100000,"rows_first":2000,"rows_last":500,"rows_between":2000,"halvings":0,"cell_chars":16384,"cell_head_chars":4096},"cells_cut":0,"cells_raw":0,"read":"whole","date_system":"1900"}

{"sheet":"Toelichting & Leeswijzer","index":0,"n_rows":40,"n_cols":4,"rows_kept":40,"cut":false,"hidden":false,"merged":[]}
[null,"                           AFD Definitie"]
[null,"Toelichting"]
[null,"Leest u eerst de Instructie specificatie AFD-definitie voor u gebruik maakt van deze XLSM. U vindt de instructie op https://suiv.nl/instructies-en-templates/"]
[]
[null,"Deze XLS ondersteunt u bij het vaststellen van de specificaties voor de AFD-definitie. Hieronder staat uitgelegd hoe de XLSM is opgebouwd. "]
[]
[null,"De opbouw van deze XLSM"]
[null,"Deze XLSM bestaat uit 5 tabbladen:"]
[null,"1: Toelichting & Leeswijzer"]
[null,null,"U vindt hier in het kort informatie over het gebruik van deze XLSM en verwijzingen naar de Instructie specificatie AFD-definitie. "]
[null,"2: Schema"]
[null,null,"In het tabblad Schema meldt u de meta-gegevens voor de AFD-definitie en legt u de specificaties van de AFD-definitie vast. "]
[null,null,"Zie paragraven 3.1, 4.4 en 5.5 in Instructie specificatie AFD-definitie voor meer informatie. "]
[null,"3: Verbandscontroles"]
[null,null,"In het tabblad Verbandscontrole kunt u validatieregels opnemen. Deze verbandscontroles zorgen voor een snellere en betere kwaliteit van invoer door volmacht. "]
[null,null,"Zie paragraaf 3.2 in Instructie specificatie AFD-definitie voor meer informatie. "]
[null,"4: Openstaande punten"]
[null,null,"De tab Openstaande punten is opgenomen voor ondersteuning in interne communicatie over de specificaties van de AFD-definitie. "]
[null,"5: Updates"]
[null,null,"De tab Updates biedt u de optie om beheer te houden over versies in de geleverde AFD-definities."]
[]
[null,"Omzetten naar CSV voor importeren in de Online Samenstellen Tool"]
[null,"In de Online Samenstellen Tool is het mogelijk de benodigde entiteiten en attributen eenvoudig te importeren middels een CSV bestand. "]
[null,"Met onderstaande werkwijze kan dit XLSM omgezet worden naar een CSV bestand. "]
[null,"Verdere toelichting rond de import functie is te vinden in de documentatie van Online Samenstellen."]
[]
[null,null,"Optie 1: Automatisch (Let op, macro's moeten ingeschakeld zijn)"]
[null,null,"1. Druk op de knop 'CSV bestand'."]
[null,null,null,"(Een CSV bestand wordt automatisch opgeslagen in dezelfde map als dit XLSM.)"]
[null,null,"2. Open het CSV bestand."]
[null,null,"3. Gebruik de Excel functie 'Tekst naar kolommen' en kies de optie 'gescheiden' en selecter 'komma's'. Deze excelfunctie is te vinden onder het tabblad gegevens. "]
[null,null,"4. Het CSV vult automatisch de vijf functiekolommen. Is een functie ongebruikt? Verwijder dat kolom."]
[null,null,"5. Bestand is klaar voor importeren."]
[]
[null,null,"Optie 2: Handmatig (Indien macro's niet mogelijk zijn)"]
[null,null,"1. In dit XLS is een tabblad 'CSVoutput' verborgen. Klik met de rechtermuisknop op een bladwijzer en selecteer 'zichtbaar maken'. Kies vervolgens het tabblad 'CSVoutput'"]
[null,null,"2. Kopieer van tabblad 'CSVoutput' kolom I t/m O en plak de waarden in een nieuw Excel bestand."]
[null,null,"3. Sla dit bestand op als 'door komma gescheiden (* .csv)'."]
[null,null,"4. Is een functie ongebruikt? Verwijder dat kolom."]
[null,null,"5. Bestand is klaar voor importeren."]

{"sheet":"Schema","index":1,"n_rows":587,"n_cols":16,"rows_kept":587,"cut":false,"hidden":false,"merged":[[12,6,12,7]]}
["Inventarisatie noodzakelijke attributen "]
["Naam organisatie:"]
["Branche:"]
["POR maatschappij aanduiding:"]
["AFD Definitie naam:"]
["AFD Definitie versie nummer:"]
["Tag"]
["Commerciele productnaam:"]
["Bronnen:"]
["Contactpersoon:"]
["E-mail / Telefoon:"]
["Datum:",null,"27-10-2021",null,null,null,"Let op: Actuele versie NVGA Protocol"]
[null,null,null,null,null,null,"NVGA Protocol ",null,"AFD-definitie","AFD-definitie","AFD-definitie","AFD-definitie",null,"AFD-definitie"]
["Entiteit","Attribuut /\n subentiteit","Attribuut/ \nsubentiteit","Attribuut","Codelijst","Omschrijving","NVGA Protocol altijd opnemen","NVGA Protocol te beoordelen","premieBerekening_aanroep","premieBerekening_resultaat","Acceptatie_aanroep","Acceptatie_resultaat","Polis\nInformatie","kunnenAanleveren","Toegestane herhaling/ Waardebeperking","Bevindingen"]
["AL",null,null,null,"","BERICHT ALGEMEEN","V",null,null,null,null,null,null,{"$f":"IF(LEFT(G15,1)=\"X\",\"X\",IF(LEFT(G15,1)=\"V\",\"V\",IF(H15=\"V\",\"V\",IF(I15=\"V\",\"V\",IF(J15=\"V\",\"O\",IF(K15=\"V\",\"O\",IF(L15=\"V\",\"O\",IF(M15=\"V\",\"V\",IF(LEFT(G15,1)=\"O\",\"O\",IF(LEFT(H15,1)=\"O\",\"O\",IF(I15=\"O\",\"O\",IF(J15=\"O\",\"O\",IF(K15=\"O\",\"O\",IF(L15=\"O\",\"O\",IF(M15=\"O\",\"O\",\"LEEG\")))))))))))))))","v":"V"}]
[null,"ADATMSG",null,null,"","Datum aanmaak bericht","V",null,null,null,null,null,null,{"$f":"IF(LEFT(G16,1)=\"X\",\"X\",IF(LEFT(G16,1)=\"V\",\"V\",IF(H16=\"V\",\"V\",IF(I16=\"V\",\"V\",IF(J16=\"V\",\"O\",IF(K16=\"V\",\"O\",IF(L16=\"V\",\"O\",IF(M16=\"V\",\"V\",IF(LEFT(G16,1)=\"O\",\"O\",IF(LEFT(H16,1)=\"O\",\"O\",IF(I16=\"O\",\"O\",IF(J16=\"O\",\"O\",IF(K16=\"O\",\"O\",IF(L16=\"O\",\"O\",IF(M16=\"O\",\"O\",\"LEEG\")))))))))))))))","v":"V"}]
[null,"APPCODE",null,null,null,"Toegangscode",null,null,null,null,null,null,null,"LEEG"]
[null,"APPLNM",null,null,"","Naam verzendende applicatie","O",null,null,null,null,null,null,"O"]
[null,"APPLVS",null,null,"","Versie verzendende applicatie","O",null,null,null,null,null,null,"O"]
[null,"APPUSER",null,null,null,"Gebruikscode",null,null,null,null,null,null,null,"LEEG"]
[null,"BRONNM",null,null,null,"Naam vullende applicatie",null,null,null,null,null,null,null,"LEEG"]
[null,"CPREF",null,null,"","Referentie zender","V",null,null,null,null,null,null,"V"]
[null,"DATACAT",null,null,"ADNAFM","Versie datacatalogus",null,null,null,null,null,null,null,"LEEG"]
[null,"FUNCTIE",null,null,"ADNFUN","Berichtfunctie, code",null,null,null,null,null,null,null,"LEEG"]
[null,"INCLGP",null,null,"ADNLOG","Inclusief geroyeerde polissen J/N","V",null,null,null,null,null,null,"V"]
[null,"INCLOP",null,null,"ADNLOG","Inclusief opgeschorte polissen J/N","V",null,null,null,null,null,null,"V"]
[null,"INCLPP",null,null,"ADNLOG","Inclusief premievrij polissen J/N","V",null,null,null,null,null,null,"V"]
[null,"MNDGP",null,null,"","Max. aantal mnd. geroyeerde polissen","O",null,null,null,null,null,null,"O"]
[null,"VERSIEV",null,null,"ADNVER","Versienummer view, code","V",null,null,null,null,null,null,"V"]
[null,"VIEWCOD",null,null,"ADNVIE","Soort view, code",null,null,null,null,null,null,null,"LEEG"]
[null,"VRWRKCD",null,null,"ADNVRC","Verwerkingscode entiteit",null,null,null,null,null,null,null,"LEEG"]
["EL",null,null,null,null,"CONTRACT (ELDERS) (AF)LOPEND",null,null,null,null,null,null,null,"LEEG"]
[null,"VOLGNUM",null,null,null,"Volgnummer",null,null,null,null,null,null,null,"LEEG"]
[null,"VRWRKCD",null,null,"ADNVRC","Verwerkingscode entiteit",null,null,null,null,null,null,null,"LEEG"]
["PK",null,null,null,"","CONTRACT PAKKET","O",null,null,null,null,null,null,"O"]
[null,"NUMMER",null,null,"","Contractnummer","V",null,null,null,null,null,null,"V"]
[null,"VRWRKCD",null,null,"ADNVRC","Verwerkingscode entiteit",null,null,null,null,null,null,null,"LEEG"]
["RC",null,null,null,"","CONTRACT RAAMCONTRACT","O",null,null,null,null,null,null,"O"]
[null,"NUMMER",null,null,"","Contractnummer","V",null,null,null,null,null,null,"V"]
["PP",null,null,null,"","CONTRACT POLIS/ONDERDEEL","V",null,null,null,null,null,null,"V"]
[null,"ADEFVRS",null,null,"","AFD definitieversienummer","V",null,null,null,null,null,null,"V"]
[null,"AFDDEFN",null,null,"","AFD definitienaam","V",null,null,null,null,null,null,"V"]
[null,"BETTERM",null,null,"","Betaaltermijn in maanden","O",null,null,null,null,null,null,"O"]
[null,"BRANCHE",null,null,"ADNBRA","ADN branchecode","V",null,null,null,null,null,null,"V"]
[null,"BTP",null,null,null,"Termijnbedrag bruto premie",null,null,null,null,null,null,null,"LEEG"]
[null,"CDUUMND",null,null,"","Contractduur in maanden","O",null,null,null,null,null,null,"O"]
[null,"COASSJN",null,null,"ADNLOG","Polis ond. van verdeling/coass J/N","V",null,null,null,null,null,null,"V"]
[null,"ENDDATC",null,null,"","Beëindigingsdatum","O",null,null,null,null,null,null,"O"]
[null,"EXTERN",null,null,null,"Extern indicatief",null,null,null,null,null,null,null,"LEEG"]
[null,"FACTORS",null,null,null,"Rekenfactoren",null,null,null,null,null,null,null,"LEEG"]
[null,"GABRA",null,null,"","Volmacht branchecode","V",null,null,null,null,null,null,"V"]
[null,"GABRAO",null,null,"","Volmacht branchecode, omschr.","V",null,null,null,null,null,null,"V"]
[null,"GASBRA",null,null,"","Volmacht subbranchecode","V",null,null,null,null,null,null,"V"]
[null,"GASBRAO",null,null,"","Volmacht subbranchecode, omschr.","V",null,null,null,null,null,null,"V"]
[null,"HANDACC",null,null,"ADNLOG","Handmatige acceptatie J/N",null,null,null,null,null,null,null,"LEEG"]
[null,"HVVDAT",null,null,"","Hoofdvervaldatum","O",null,null,null,null,null,null,"O"]
[null,"INDEX",null,null,"ADNLOG","Geindexeerd J/N",null,null,null,null,null,null,null,"LEEG"]
[null,"INGDAT",null,null,"","Ingangsdatum","V",null,null,null,null,null,null,"V"]
[null,"INGDTW",null,null,null,"Ingangsdatum van de wijziging",null,null,null,null,null,null,null,"LEEG"]
[null,"INTKEY",null,null,"","Interne sleutel","O",null,null,null,null,null,null,"O"]
[null,"LWYZDAT",null,null,"","Datum laatste wijziging","O",null,null,null,null,null,null,"O"]
[null,"MYAAND",null,null,"PORMAA","POR Maatschappij aanduiding, code","V",null,null,null,null,null,null,"V"]
[null,"NJP",null,null,"","Netto jaarpremie","O",null,null,null,null,null,null,"O"]
[null,"NUMMER",null,null,"","Contractnummer","V",null,null,null,null,null,null,"V"]
[null,"POLPKJN",null,null,"ADNLOG","Polis onderdeel van een pakket J/N","V",null,null,null,null,null,null,"V"]
[null,"PRODUCT",null,null,null,"Produktcode maatschappij",null,null,null,null,null,null,null,"LEEG"]
[null,"PVADAT",null,null,null,"Premievervaldatum prolongatie",null,null,null,null,null,null,null,"LEEG"]
[null,"SPECLIM",null,null,"ADNLOG","Special limit J/N","V",null,null,null,null,null,null,"V"]
[null,"STATUS",null,null,"ADNSTS","Status, code","V",null,null,null,null,null,null,"V"]
[null,"STPRV",null,null,"ADNLOG","Standaard provisie J/N",null,null,null,null,null,null,null,"LEEG"]
[null,"TARDAT",null,null,null,"Tariefdatum",null,null,null,null,null,null,null,"LEEG"]
[null,"TARSTEL",null,null,"ADNTAR","Tariefstelsel, code",null,null,null,null,null,null,null,"LEEG"]
[null,"TJRPO",null,null,"","Tekenjaar pool","O",null,null,null,null,null,null,"O"]
[null,"TJRPP",null,null,"","Tekenjaar polis","V",null,null,null,null,null,null,{"$f":"IF(LEFT(G74,1)=\"X\",\"X\",IF(LEFT(G74,1)=\"V\",\"V\",IF(H74=\"V\",\"V\",IF(I74=\"V\",\"V\",IF(J74=\"V\",\"O\",IF(K74=\"V\",\"O\",IF(L74=\"V\",\"O\",IF(M74=\"V\",\"V\",IF(LEFT(G74,1)=\"O\",\"O\",IF(LEFT(H74,1)=\"O\",\"O\",IF(I74=\"O\",\"O\",IF(J74=\"O\",\"O\",IF(K74=\"O\",\"O\",IF(L74=\"O\",\"O\",IF(M74=\"O\",\"O\",\"LEEG\")))))))))))))))","v":"V"}]
[null,"VALSRT",null,null,null,"Valutasoort, code",null,null,null,null,null,null,null,"LEEG"]
[null,"VGCODE",null,null,"","Volmachtgever code","V",null,null,null,null,null,null,"V"]
[null,"VOLGNUM",null,null,null,"Volgnummer",null,null,null,null,null,null,null,"LEEG"]
[null,"VRWRKCD",null,null,"ADNVRC","Verwerkingscode entiteit",null,null,null,null,null,null,null,"LEEG"]
[null,"BA",null,null,null,"OBJECT OPSTAL",null,"O:XO",null,null,null,null,null,"O","maxOccurs 1"]
[null,null,"AARDBW",null,"ADNBMU","Bouwaard muren, code",null,"O:XO",null,null,null,null,null,"O"]
[null,null,"AARDDAK",null,"ADNBDA","Bouwaard dak, code",null,"O:XO",null,null,null,null,null,"O"]
[null,null,"AARDOBJ",null,"ADNBMU","Bouwaard object, code",null,"O:XO",null,null,null,null,null,"O"]
[null,null,"AARDVLR",null,"ADNBVL","Bouwaard (verdiepings)vloeren, code",null,"O:XO",null,null,null,null,null,"O"]
[null,null,"BESTEMO",null,null,"Bestemming, omschr",null,"O:XO",null,null,null,null,null,"O"]
[null,null,"BEVEIL",null,"ADNBEV","Beveiliging aanwezig, code",null,null,null,null,null,null,null,"LEEG"]
[null,null,"BOUWJR",null,null,"Bouwjaar",null,"O:XO",null,null,null,null,null,"O"]
[null,null,"BTWCD",null,null,"Bedragen zijn incl./excl. BTW, code",null,"O:XO",null,null,null,null,null,"O"]
[null,null,"EIGENWO",null,"ADNLOG","Eigen woning J/N",null,null,null,null,null,null,null,"LEEG"]
[null,null,"HUISNR",null,null,"Huisnummer","O:XO",null,null,null,null,null,null,"O"]
[null,null,"LEEGSTA",null,"ADNLOG","Leegstand/onbewoond J/N",null,null,null,null,null,null,null,"LEEG"]
[null,null,"MONUMEN",null,"ADNLOG","Monumentaal pand J/N",null,null,null,null,null,null,null,"LEEG"]
[null,null,"ONDSTT",null,null,"Toel. staat van onderhoud",null,"O:XO",null,null,null,null,null,"O"]
[null,null,"OPPWON",null,null,"Oppervlakte woning in m2",null,null,null,null,null,null,null,"LEEG"]
[null,null,"PCODE",null,null,"Postcode","O:XO",null,null,null,null,null,null,"O"]
[null,null,"SKG",null,"ADNLOG","Hand-sluitwerk SKG keurmerk J/N",null,null,null,null,null,null,null,"LEEG"]
[null,null,"SKGSTER",null,null,"Aantal sterren SKG sloten",null,null,null,null,null,null,null,"LEEG"]
[null,null,"SRTRDAK",null,"ADNSRD","Soort rieten dak, code",null,null,null,null,null,null,null,"LEEG"]
[null,null,"TOEGEBR",null,null,"Gebruik, toelichting",null,"O:XO",null,null,null,null,null,"O"]
[null,null,"TOEVOEG",null,null,"Huisnummertoevoeging","O:XO",null,null,null,null,null,null,"O"]
[null,null,"TYPEWON",null,"ADNTYP","Soort woning, code",null,null,null,null,null,null,null,"LEEG"]
[null,null,"VOLGNUM",null,null,"Volgnummer","O:XO",null,null,null,null,null,null,"O"]
[null,null,"VRWRKCD",null,null,"Verwerkingscode entiteit",null,null,null,null,null,null,null,"LEEG"]
[null,null,"WONING",null,"ADNWON","Gebruik pand, code",null,null,null,null,null,null,null,"LEEG"]
[null,"BB",null,null,null,"OBJECT BIJGEBOUW",null,"O:XO",null,null,null,null,null,"O","maxOccurs 1"]
[null,null,"AARDBW",null,"ADNBMU","Bouwaard muren, code",null,"O:XO",null,null,null,null,null,"O"]
[null,null,"AARDDAK",null,"ADNBDA","Bouwaard dak, code",null,"O:XO",null,null,null,null,null,"O"]
[null,null,"AARDVLR",null,"ADNBVL","Bouwaard (verdiepings)vloeren, code",null,"O:XO",null,null,null,null,null,"O"]
[null,null,"BOUWJR",null,null,"Bouwjaar",null,"O:XO",null,null,null,null,null,"O"]
[null,null,"HUISNR",null,null,"Huisnummer","O:XO",null,null,null,null,null,null,"O"]
[null,null,"PCODE",null,null,"Postcode","O:XO",null,null,null,null,null,null,"O"]
[null,null,"TOEGEBR",null,null,"Gebruik, toelichting",null,"O:XO",null,null,null,null,null,"O"]
[null,null,"TOEVOEG",null,null,"Huisnummertoevoeging","O:XO",null,null,null,null,null,null,"O"]
[null,null,"VOLGNUM",null,null,"Volgnummer","O:XO",null,null,null,null,null,null,"O"]
[null,"IB",null,null,null,"OBJECT INBOEDEL",null,"O:XO",null,null,null,null,null,"O","maxOccurs 1"]
[null,null,"DAGWRDE",null,null,"Bedrag dagwaarde",null,"O:XO",null,null,null,null,null,"O"]
[null,null,"VOLGNUM",null,null,"Volgnummer","O:XO",null,null,null,null,null,null,"O"]
[null,"KH",null,null,null,"OBJECT KOSTBAARHEDEN",null,"O:XO",null,null,null,null,null,{"$f":"IF(LEFT(G117,1)=\"X\",\"X\",IF(LEFT(G117,1)=\"V\",\"V\",IF(H117=\"V\",\"V\",IF(I117=\"V\",\"V\",IF(J117=\"V\",\"O\",IF(K117=\"V\",\"O\",IF(L117=\"V\",\"O\",IF(M117=\"V\",\"V\",IF(LEFT(G117,1)=\"O\",\"O\",IF(LEFT(H117,1)=\"O\",\"O\",IF(I117=\"O\",\"O\",IF(J117=\"O\",\"O\",IF(K117=\"O\",\"O\",IF(L117=\"O\",\"O\",IF(M117=\"O\",\"O\",\"LEEG\")))))))))))))))","v":"O"}]
[null,null,"DAGWRDE",null,null,"Bedrag dagwaarde",null,"O:XO",null,null,null,null,null,"O"]
[null,null,"GEBRKBH ",null,"ADNGKH","Gebruik kostbaarheden, code",null,null,null,null,null,null,null,"LEEG"]
[null,null,"MERK",null,null,"Merk",null,"O:XO",null,null,null,null,null,"O"]
[null,null,"SRTKBH",null,"ADNKBH","Soort kostbaarheid, code",null,null,null,null,null,null,null,"LEEG"]
[null,null,"TOEGEBR",null,null,"Gebruik, toelichting",null,"O:XO",null,null,null,null,null,"O"]
[null,null,"TYPE",null,null,"Type",null,"O:XO",null,null,null,null,null,"O"]
[null,null,"VOLGNUM",null,null,"Volgnummer","O:XO",null,null,null,null,null,null,"O"]
[null,"AU",null,null,"","DEKKING AUDIO/VISUEEL/COMPUTER",null,"O:XD",null,null,null,null,null,"O","maxOccurs 1"]
[null,null,"BAFWST",null,null,"Bedrag afwijk. op standaard tarief","O:XD",null,null,null,null,null,null,"O"]
[null,null,"BTP",null,null,"Termijnbedrag bruto premie",null,null,null,null,null,null,null,"LEEG"]
[null,null,"CODE",null,"ADNDEK","Dekkingscode","O:XD",null,null,null,null,null,null,"O"]
[null,null,"COLFACT",null,null,"Perc. collectiviteitfactor","O:XD_PRCCOLK",null,null,null,null,null,null,"O"]
[null,null,"ERB",null,null,"Bedrag eigen risico",null,"O:XD",null,null,null,null,null,"O"]
[null,null,"GADEKCD",null,null,"Volmacht dekkingscode","V:XD",null,null,null,null,null,null,"V"]
[null,null,"GADEKCO",null,null,"Volmacht dekkingscode, omschr.","V:XD",null,null,null,null,null,null,"V"]
[null,null,"MYCODE",null,"ADNMCD","Dekkingscode maatschappij, code",null,"O:XD",null,null,null,null,null,"O"]
[null,null,"NJP",null,null,"Netto jaarpremie","O:XD",null,null,null,null,null,null,"O"]
[null,null,"PAFWST",null,null,"Percentage afw. op standaard tarief","O:XD",null,null,null,null,null,null,"O"]
[null,null,"PPRC",null,null,"Percentage prolongatieprovisie","O:XD",null,null,null,null,null,null,"O"]
[null,null,"PRCPKKT",null,null,"Percentage pakketkorting","O:XD",null,null,null,null,null,null,"O"]
[null,null,"PRCTEKC",null,null,"Percentage Volmachtbeloning","O:XD",null,null,null,null,null,null,"O"]
[null,null,"RELVRH",null,"ADNENT","Relatie verhouding tot, code","O:XD",null,null,null,null,null,null,"O"]
[null,null,"RELVVNR",null,null,"Relatie verhouding tot, volgnummer","O:XD",null,null,null,null,null,null,"O"]
[null,null,"RJRCOR",null,null,"Resterende jaren voor correctie","O:XD",null,null,null,null,null,null,"O"]
[null,null,"TCORBDR",null,null,"Toegepast correctiebedrag","O:XD",null,null,null,null,null,null,"O"]
[null,null,"VEERB",null,null,"Bedrag vrijwillig extra eigen risico",null,null,null,null,null,null,null,{"$f":"IF(LEFT(G143,1)=\"X\",\"X\",IF(LEFT(G143,1)=\"V\",\"V\",IF(H143=\"V\",\"V\",IF(I143=\"V\",\"V\",IF(J143=\"V\",\"O\",IF(K143=\"V\",\"O\",IF(L143=\"V\",\"O\",IF(M143=\"V\",\"V\",IF(LEFT(G143,1)=\"O\",\"O\",IF(LEFT(H143,1)=\"O\",\"O\",IF(I143=\"O\",\"O\",IF(J143=\"O\",\"O\",IF(K143=\"O\",\"O\",IF(L143=\"O\",\"O\",IF(M143=\"O\",\"O\",\"LEEG\")))))))))))))))","v":"LEEG"}]
[null,null,"VERZSOM",null,null,"Verzekerde som",null,"O:XD",null,null,null,null,null,"O"]
[null,null,"VGBRA",null,null,"Volmachtgever branchecode","O:XD",null,null,null,null,null,null,"O"]
[null,null,"VOLGNUM",null,null,"Volgnummer",null,null,null,null,null,null,null,"LEEG"]
[null,null,"VRWRKCD",null,"ADNVRC","Verwerkingscode entiteit",null,null,null,null,null,null,null,"LEEG"]
[null,null,"WPREMBP",null,"ADNPBP","Wijze premieberekening prol.,code","O:XD",null,null,null,null,null,null,"O"]
[null,null,"MP",null,null,"POOLAANDEEL","O",null,null,null,null,null,null,"O"]
[null,null,null,"MYAAND","","POR Maatschappij aanduiding, code","O",null,null,null,null,null,null,"O"]
[null,null,null,"PLLEAD","","Poolleader J/N","O",null,null,null,null,null,null,"O"]
[null,null,null,"POOLNUM","PORMAA","Poolnummer","V",null,null,null,null,null,null,"V"]
[null,null,null,"POOLPRC","ADNLOG","Percentage poolaandeel","V",null,null,null,null,null,null,"V"]
[null,"BI",null,null,"","DEKKING BUITENHUIS",null,"O:XD",null,null,null,null,null,"O","maxOccurs 1"]
[null,null,"BAFWST",null,null,"Bedrag afwijk. op standaard tarief","O:XD",null,null,null,null,null,null,"O"]
[null,null,"BTP",null,null,"Termijnbedrag bruto premie",null,null,null,null,null,null,null,"LEEG"]
[null,null,"CODE",null,"ADNDEK","Dekkingscode","O:XD",null,null,null,null,null,null,"O"]
[null,null,"COLFACT",null,null,"Perc. collectiviteitfactor","O:XD_PRCCOLK",null,null,null,null,null,null,"O"]
[null,null,"ERB",null,null,"Bedrag eigen risico",null,"O:XD",null,null,null,null,null,"O"]
[null,null,"GADEKCD",null,null,"Volmacht dekkingscode","V:XD",null,null,null,null,null,null,"V"]
[null,null,"GADEKCO",null,null,"Volmacht dekkingscode, omschr.","V:XD",null,null,null,null,null,null,"V"]
[null,null,"MYCODE",null,"ADNMCD","Dekkingscode maatschappij, code",null,"O:XD",null,null,null,null,null,"O"]
[null,null,"NJP",null,null,"Netto jaarpremie","O:XD",null,null,null,null,null,null,"O"]
[null,null,"PAFWST",null,null,"Percentage afw. op standaard tarief","O:XD",null,null,null,null,null,null,"O"]
[null,null,"PPRC",null,null,"Percentage prolongatieprovisie","O:XD",null,null,null,null,null,null,"O"]
[null,null,"PRCPKKT",null,null,"Percentage pakketkorting","O:XD",null,null,null,null,null,null,"O"]
[null,null,"PRCTEKC",null,null,"Percentage Volmachtbeloning","O:XD",null,null,null,null,null,null,"O"]
[null,null,"PRMPROM",null,null,"Premiepromilage",null,"O:XD",null,null,null,null,null,"O"]
[null,null,"RELVRH",null,"ADNENT","Relatie verhouding tot, code","O:XD",null,null,null,null,null,null,"O"]
[null,null,"RELVVNR",null,null,"Relatie verhouding tot, volgnummer","O:XD",null,null,null,null,null,null,"O"]
[null,null,"RJRCOR",null,null,"Resterende jaren voor correctie","O:XD",null,null,null,null,null,null,"O"]
[null,null,"TCORBDR",null,null,"Toegepast correctiebedrag","O:XD",null,null,null,null,null,null,"O"]
[null,null,"VERZSOM",null,null,"Verzekerde som",null,"O:XD",null,null,null,null,null,"O"]
[null,null,"VGBRA",null,null,"Volmachtgever branchecode","O:XD",null,null,null,null,null,null,"O"]
[null,null,"VOLGNUM",null,null,"Volgnummer",null,null,null,null,null,null,null,"LEEG"]
[null,null,"VRWRKCD",null,"ADNVRC","Verwerkingscode entiteit",null,null,null,null,null,null,null,"LEEG"]
[null,null,"WPREMBP",null,"ADNPBP","Wijze premieberekening prol.,code","O:XD",null,null,null,null,null,null,"O"]
[null,null,"MP",null,null,"POOLAANDEEL","O",null,null,null,null,null,null,"O"]
[null,null,null,"MYAAND","","POR Maatschappij aanduiding, code","O",null,null,null,null,null,null,"O"]
[null,null,null,"PLLEAD","","Poolleader J/N","O",null,null,null,null,null,null,"O"]
[null,null,null,"POOLNUM","PORMAA","Poolnummer","V",null,null,null,null,null,null,"V"]
[null,null,null,"POOLPRC","ADNLOG","Percentage poolaandeel","V",null,null,null,null,null,null,"V"]
[null,"DF",null,null,null,"DEKKING CAMERA APPARATUUR",null,"O:XD",null,null,null,null,null,"O","maxOccurs 1"]
[null,null,"BAFWST",null,null,"Bedrag afwijk. op standaard tarief","O:XD",null,null,null,null,null,null,"O"]
[null,null,"BTP",null,null,"Termijnbedrag bruto premie",null,null,null,null,null,null,null,"LEEG"]
[null,null,"COLFACT",null,null,"Perc. collectiviteitfactor","O:XD_PRCCOLK",null,null,null,null,null,null,"O"]
[null,null,"CODE",null,"ADNDEK","Dekkingscode","O:XD",null,null,null,null,null,null,"O"]
[null,null,"GADEKCD",null,null,"Volmacht dekkingscode","V:XD",null,null,null,null,null,null,"V"]
[null,null,"GADEKCO",null,null,"Volmacht dekkingscode, omschr.","V:XD",null,null,null,null,null,null,"V"]
[null,null,"MYCODE",null,"ADNMCD","Dekkingscode maatschappij, code",null,"O:XD",null,null,null,null,null,"O"]
[null,null,"NJP",null,null,"Netto jaarpremie","O:XD",null,null,null,null,null,null,"O"]
[null,null,"PAFWST",null,null,"Percentage afw. op standaard tarief","O:XD",null,null,null,null,null,null,"O"]
[null,null,"PPRC",null,null,"Percentage prolongatieprovisie","O:XD",null,null,null,null,null,null,"O"]
[null,null,"PRCPKKT",null,null,"Percentage pakketkorting","O:XD",null,null,null,null,null,null,"O"]
[null,null,"PRCTEKC",null,null,"Percentage Volmachtbeloning","O:XD",null,null,null,null,null,null,"O"]
[null,null,"RELVRH",null,"ADNENT","Relatie verhouding tot, code","O:XD",null,null,null,null,null,null,"O"]
[null,null,"RELVVNR",null,null,"Relatie verhouding tot, volgnummer","O:XD",null,null,null,null,null,null,"O"]
[null,null,"RJRCOR",null,null,"Resterende jaren voor correctie","O:XD",null,null,null,null,null,null,"O"]
[null,null,"TCORBDR",null,null,"Toegepast correctiebedrag","O:XD",null,null,null,null,null,null,"O"]
[null,null,"VEERB",null,null,"Bedrag vrijwillig extra eigen risico",null,null,null,null,null,null,null,"LEEG"]
[null,null,"VERZSOM",null,null,"Verzekerde som",null,"O:XD",null,null,null,null,null,"O"]
[null,null,"VGBRA",null,null,"Volmachtgever branchecode","O:XD",null,null,null,null,null,null,"O"]
[null,null,"VOLGNUM",null,null,"Volgnummer",null,null,null,null,null,null,null,"LEEG"]
[null,null,"VRWRKCD",null,"ADNVRC","Verwerkingscode entiteit",null,null,null,null,null,null,null,"LEEG"]
[null,null,"WPREMBP",null,"ADNPBP","Wijze premieberekening prol.,code","O:XD",null,null,null,null,null,null,"O"]
[null,null,"MP",null,"ADNPBP","POOLAANDEEL","O",null,null,null,null,null,null,{"$f":"IF(LEFT(G206,1)=\"X\",\"X\",IF(LEFT(G206,1)=\"V\",\"V\",IF(H206=\"V\",\"V\",IF(I206=\"V\",\"V\",IF(J206=\"V\",\"O\",IF(K206=\"V\",\"O\",IF(L206=\"V\",\"O\",IF(M206=\"V\",\"V\",IF(LEFT(G206,1)=\"O\",\"O\",IF(LEFT(H206,1)=\"O\",\"O\",IF(I206=\"O\",\"O\",IF(J206=\"O\",\"O\",IF(K206=\"O\",\"O\",IF(L206=\"O\",\"O\",IF(M206=\"O\",\"O\",\"LEEG\")))))))))))))))","v":"O"}]
[null,null,null,"MYAAND","","POR Maatschappij aanduiding, code","O",null,null,null,null,null,null,"O"]
[null,null,null,"PLLEAD","","Poolleader J/N","O",null,null,null,null,null,null,"O"]
[null,null,null,"POOLNUM","PORMAA","Poolnummer","V",null,null,null,null,null,null,"V"]
[null,null,null,"POOLPRC","ADNLOG","Percentage poolaandeel","V",null,null,null,null,null,null,"V"]
[null,"DZ",null,null,null,"DEKKING BIJZONDERE BEZITTINGEN",null,"O:XD",null,null,null,null,null,"O","maxOccurs 1"]
[null,null,"BAFWST",null,null,"Bedrag afwijk. op standaard tarief","O:XD",null,null,null,null,null,null,"O"]
[null,null,"BTP",null,null,"Termijnbedrag bruto premie",null,null,null,null,null,null,null,"LEEG"]
[null,null,"CODE",null,"ADNDEK","Dekkingscode","O:XD",null,null,null,null,null,null,"O"]
[null,null,"COLFACT",null,null,"Perc. collectiviteitfactor","O:XD_PRCCOLK",null,null,null,null,null,null,"O"]
[null,null,"ERB",null,null,"Bedrag eigen risico",null,"O:XD",null,null,null,null,null,"O"]
[null,null,"GADEKCD",null,null,"Volmacht dekkingscode","V:XD",null,null,null,null,null,null,"V"]
[null,null,"GADEKCO",null,null,"Volmacht dekkingscode, omschr.","V:XD",null,null,null,null,null,null,"V"]
[null,null,"MYCODE",null,"ADNMCD","Dekkingscode maatschappij, code",null,"O:XD",null,null,null,null,null,"O"]
[null,null,"NJP",null,null,"Netto jaarpremie","O:XD",null,null,null,null,null,null,"O"]
[null,null,"PAFWST",null,null,"Percentage afw. op standaard tarief","O:XD",null,null,null,null,null,null,"O"]
[null,null,"PPRC",null,null,"Percentage prolongatieprovisie","O:XD",null,null,null,null,null,null,"O"]
[null,null,"PRCPKKT",null,null,"Percentage pakketkorting","O:XD",null,null,null,null,null,null,"O"]
[null,null,"PRCTEKC",null,null,"Percentage Volmachtbeloning","O:XD",null,null,null,null,null,null,"O"]
[null,null,"RELVRH",null,"ADNENT","Relatie verhouding tot, code","O:XD",null,null,null,null,null,null,"O"]
[null,null,"RELVVNR",null,null,"Relatie verhouding tot, volgnummer","O:XD",null,null,null,null,null,null,"O"]
[null,null,"RJRCOR",null,null,"Resterende jaren voor correctie","O:XD",null,null,null,null,null,null,"O"]
[null,null,"TCORBDR",null,null,"Toegepast correctiebedrag","O:XD",null,null,null,null,null,null,"O"]
[null,null,"VERZSOM",null,null,"Verzekerde som",null,"O:XD",null,null,null,null,null,"O"]
[null,null,"VGBRA",null,null,"Volmachtgever branchecode","O:XD",null,null,null,null,null,null,"O"]
[null,null,"VOLGNUM",null,null,"Volgnummer",null,null,null,null,null,null,null,"LEEG"]
[null,null,"VRWRKCD",null,"ADNVRC","Verwerkingscode entiteit",null,null,null,null,null,null,null,"LEEG"]
[null,null,"WPREMBP",null,"ADNPBP","Wijze premieberekening prol.,code","O:XD",null,null,null,null,null,null,"O"]
[null,null,"MP",null,"ADNPBP","POOLAANDEEL","O",null,null,null,null,null,null,"O"]
[null,null,null,"MYAAND","","POR Maatschappij aanduiding, code","O",null,null,null,null,null,null,"O"]
[null,null,null,"PLLEAD","","Poolleader J/N","O",null,null,null,null,null,null,"O"]
[null,null,null,"POOLNUM","PORMAA","Poolnummer","V",null,null,null,null,null,null,"V"]
[null,null,null,"POOLPRC","ADNLOG","Percentage poolaandeel","V",null,null,null,null,null,null,"V"]
[null,"EC",null,null,null,"DEKKING ELEKTRONICA",null,"O:XD",null,null,null,null,null,"O","maxOccurs 1"]
[null,null,"BAFWST",null,null,"Bedrag afwijk. op standaard tarief","O:XD",null,null,null,null,null,null,"O"]
[null,null,"BTP",null,null,"Termijnbedrag bruto premie",null,null,null,null,null,null,null,"LEEG"]
[null,null,"CODE",null,"ADNDEK","Dekkingscode","O:XD",null,null,null,null,null,null,"O"]
[null,null,"COLFACT",null,null,"Perc. collectiviteitfactor","O:XD_PRCCOLK",null,null,null,null,null,null,"O"]
[null,null,"ERB",null,null,"Bedrag eigen risico",null,"O:XD",null,null,null,null,null,"O"]
[null,null,"GADEKCD",null,null,"Volmacht dekkingscode","V:XD",null,null,null,null,null,null,"V"]
[null,null,"GADEKCO",null,null,"Volmacht dekkingscode, omschr.","V:XD",null,null,null,null,null,null,"V"]
[null,null,"MYCODE",null,"ADNMCD","Dekkingscode maatschappij, code",null,"O:XD",null,null,null,null,null,"O"]
[null,null,"NJP",null,null,"Netto jaarpremie","O:XD",null,null,null,null,null,null,"O"]
[null,null,"PAFWST",null,null,"Percentage afw. op standaard tarief","O:XD",null,null,null,null,null,null,"O"]
[null,null,"PPRC",null,null,"Percentage prolongatieprovisie","O:XD",null,null,null,null,null,null,"O"]
[null,null,"PRCPKKT",null,null,"Percentage pakketkorting","O:XD",null,null,null,null,null,null,"O"]
[null,null,"PRCTEKC",null,null,"Percentage Volmachtbeloning","O:XD",null,null,null,null,null,null,"O"]
[null,null,"PRMPROM",null,null,"Premiepromillage",null,"O:XD",null,null,null,null,null,"O"]
[null,null,"RELVRH",null,"ADNENT","Relatie verhouding tot, code","O:XD",null,null,null,null,null,null,"O"]
[null,null,"RELVVNR",null,null,"Relatie verhouding tot, volgnummer","O:XD",null,null,null,null,null,null,"O"]
[null,null,"RJRCOR",null,null,"Resterende jaren voor correctie","O:XD",null,null,null,null,null,null,"O"]
[null,null,"TCORBDR",null,null,"Toegepast correctiebedrag","O:XD",null,null,null,null,null,null,"O"]
[null,null,"VERZSOM",null,null,"Verzekerde som",null,"O:XD",null,null,null,null,null,"O"]
[null,null,"VGBRA",null,null,"Volmachtgever branchecode","O:XD",null,null,null,null,null,null,"O"]
[null,null,"VOLGNUM",null,null,"Volgnummer",null,null,null,null,null,null,null,"LEEG"]
[null,null,"WPREMBP",null,"ADNPBP","Wijze premieberekening prol.,code","O:XD",null,null,null,null,null,null,"O"]
[null,null,"MP",null,"ADNPBP","POOLAANDEEL","O",null,null,null,null,null,null,"O"]
[null,null,null,"MYAAND","","POR Maatschappij aanduiding, code","O",null,null,null,null,null,null,"O"]
[null,null,null,"PLLEAD","","Poolleader J/N","O",null,null,null,null,null,null,"O"]
[null,null,null,"POOLNUM","PORMAA","Poolnummer","V",null,null,null,null,null,null,"V"]
[null,null,null,"POOLPRC","ADNLOG","Percentage poolaandeel","V",null,null,null,null,null,null,"V"]
[null,"GP",null,null,null,"DEKKING GLAS",null,"O:XD",null,null,null,null,null,"O","maxOccurs 1"]
[null,null,"BAFWST",null,null,"Bedrag afwijk. op standaard tarief","O:XD",null,null,null,null,null,null,"O"]
[null,null,"BTP",null,null,"Termijnbedrag bruto premie",null,null,null,null,null,null,null,"LEEG"]
[null,null,"CODE",null,"ADNDEK","Dekkingscode","O:XD",null,null,null,null,null,null,{"$f":"IF(LEFT(G270,1)=\"X\",\"X\",IF(LEFT(G270,1)=\"V\",\"V\",IF(H270=\"V\",\"V\",IF(I270=\"V\",\"V\",IF(J270=\"V\",\"O\",IF(K270=\"V\",\"O\",IF(L270=\"V\",\"O\",IF(M270=\"V\",\"V\",IF(LEFT(G270,1)=\"O\",\"O\",IF(LEFT(H270,1)=\"O\",\"O\",IF(I270=\"O\",\"O\",IF(J270=\"O\",\"O\",IF(K270=\"O\",\"O\",IF(L270=\"O\",\"O\",IF(M270=\"O\",\"O\",\"LEEG\")))))))))))))))","v":"O"}]
[null,null,"COLFACT",null,null,"Perc. collectiviteitfactor","O:XD_PRCCOLK",null,null,null,null,null,null,"O"]
[null,null,"ERB",null,null,"Bedrag eigen risico",null,"O:XD",null,null,null,null,null,"O"]
[null,null,"GADEKCD",null,null,"Volmacht dekkingscode","V:XD",null,null,null,null,null,null,"V"]
[null,null,"GADEKCO",null,null,"Volmacht dekkingscode, omschr.","V:XD",null,null,null,null,null,null,"V"]
[null,null,"MYCODE",null,"ADNMCD","Dekkingscode maatschappij, code",null,"O:XD",null,null,null,null,null,"O"]
[null,null,"NJP",null,null,"Netto jaarpremie","O:XD",null,null,null,null,null,null,"O"]
[null,null,"PAFWST",null,null,"Percentage afw. op standaard tarief","O:XD",null,null,null,null,null,null,"O"]
[null,null,"PPRC",null,null,"Percentage prolongatieprovisie","O:XD",null,null,null,null,null,null,"O"]
[null,null,"PRCPKKT",null,null,"Percentage pakketkorting","O:XD",null,null,null,null,null,null,"O"]
[null,null,"PRCTEKC",null,null,"Percentage Volmachtbeloning","O:XD",null,null,null,null,null,null,"O"]
[null,null,"PRMPROM",null,null,"Premiepromillage",null,"O:XD",null,null,null,null,null,"O"]
[null,null,"RELVRH",null,"ADNENT","Relatie verhouding tot, code","O:XD",null,null,null,null,null,null,"O"]
[null,null,"RELVVNR",null,null,"Relatie verhouding tot, volgnummer","O:XD",null,null,null,null,null,null,"O"]
[null,null,"RJRCOR",null,null,"Resterende jaren voor correctie","O:XD",null,null,null,null,null,null,"O"]
[null,null,"TCORBDR",null,null,"Toegepast correctiebedrag","O:XD",null,null,null,null,null,null,"O"]
[null,null,"VERZSOM",null,null,"Verzekerde som",null,"O:XD",null,null,null,null,null,"O"]
[null,null,"VGBRA",null,null,"Volmachtgever branchecode","O:XD",null,null,null,null,null,null,"O"]
[null,null,"VOLGNUM",null,null,"Volgnummer",null,null,null,null,null,null,null,"LEEG"]
[null,null,"VRWRKCD",null,"ADNVRC","Verwerkingscode entiteit",null,null,null,null,null,null,null,"LEEG"]
[null,null,"WPREMBP",null,"ADNPBP","Wijze premieberekening prol.,code","O:XD",null,null,null,null,null,null,"O"]
[null,null,"MP",null,"ADNPBP","POOLAANDEEL","O",null,null,null,null,null,null,"O"]
[null,null,null,"MYAAND","","POR Maatschappij aanduiding, code","O",null,null,null,null,null,null,"O"]
[null,null,null,"PLLEAD","","Poolleader J/N","O",null,null,null,null,null,null,"O"]
[null,null,null,"POOLNUM","PORMAA","Poolnummer","V",null,null,null,null,null,null,"V"]
[null,null,null,"POOLPRC","ADNLOG","Percentage poolaandeel","V",null,null,null,null,null,null,"V"]
[null,"HU",null,null,null,"DEKKING HUURDERSBELANG",null,"O:XD",null,null,null,null,null,"O","maxOccurs 1"]
[null,null,"BAFWST",null,null,"Bedrag afwijk. op standaard tarief","O:XD",null,null,null,null,null,null,"O"]
[null,null,"BTP",null,null,"Termijnbedrag bruto premie",null,null,null,null,null,null,null,"LEEG"]
[null,null,"CODE",null,"ADNDEK","Dekkingscode","O:XD",null,null,null,null,null,null,"O"]
[null,null,"COLFACT",null,null,"Perc. collectiviteitfactor","O:XD_PRCCOLK",null,null,null,null,null,null,"O"]
[null,null,"ERB",null,null,"Bedrag eigen risico",null,"O:XD",null,null,null,null,null,"O"]
[null,null,"GADEKCD",null,null,"Volmacht dekkingscode","V:XD",null,null,null,null,null,null,"V"]
[null,null,"GADEKCO",null,null,"Volmacht dekkingscode, omschr.","V:XD",null,null,null,null,null,null,"V"]
[null,null,"MYCODE",null,"ADNMCD","Dekkingscode maatschappij, code",null,"O:XD",null,null,null,null,null,"O"]
[null,null,"NJP",null,null,"Netto jaarpremie","O:XD",null,null,null,null,null,null,"O"]
[null,null,"PAFWST",null,null,"Percentage afw. op standaard tarief","O:XD",null,null,null,null,null,null,"O"]
[null,null,"PPRC",null,null,"Percentage prolongatieprovisie","O:XD",null,null,null,null,null,null,"O"]
[null,null,"PRCPKKT",null,null,"Percentage pakketkorting","O:XD",null,null,null,null,null,null,"O"]
[null,null,"PRCTEKC",null,null,"Percentage Volmachtbeloning","O:XD",null,null,null,null,null,null,"O"]
[null,null,"PRMPROM",null,null,"Premiepromillage",null,"O:XD",null,null,null,null,null,"O"]
[null,null,"RELVRH",null,"ADNENT","Relatie verhouding tot, code","O:XD",null,null,null,null,null,null,"O"]
[null,null,"RELVVNR",null,null,"Relatie verhouding tot, volgnummer","O:XD",null,null,null,null,null,null,"O"]
[null,null,"RJRCOR",null,null,"Resterende jaren voor correctie","O:XD",null,null,null,null,null,null,"O"]
[null,null,"TCORBDR",null,null,"Toegepast correctiebedrag","O:XD",null,null,null,null,null,null,"O"]
[null,null,"VERZSOM",null,null,"Verzekerde som",null,"O:XD",null,null,null,null,null,"O"]
[null,null,"VGBRA",null,null,"Volmachtgever branchecode","O:XD",null,null,null,null,null,null,"O"]
[null,null,"VOLGNUM",null,null,"Volgnummer",null,null,null,null,null,null,null,"LEEG"]
[null,null,"VRWRKCD",null,"ADNVRC","Verwerkingscode entiteit",null,null,null,null,null,null,null,"LEEG"]
[null,null,"WPREMBP",null,"ADNPBP","Wijze premieberekening prol.,code","O:XD",null,null,null,null,null,null,"O"]
[null,null,"MP",null,"ADNPBP","POOLAANDEEL","O",null,null,null,null,null,null,"O"]
[null,null,null,"MYAAND","","POR Maatschappij aanduiding, code","O",null,null,null,null,null,null,"O"]
[null,null,null,"PLLEAD","","Poolleader J/N","O",null,null,null,null,null,null,"O"]
[null,null,null,"POOLNUM","PORMAA","Poolnummer","V",null,null,null,null,null,null,"V"]
[null,null,null,"POOLPRC","ADNLOG","Percentage poolaandeel","V",null,null,null,null,null,null,"V"]
[null,"IP",null,null,"","DEKKING INBOEDEL",null,"O:XD",null,null,null,null,null,"O","maxOccurs 1"]
[null,null,"BAFWST",null,null,"Bedrag afwijk. op standaard tarief","O:XD",null,null,null,null,null,null,"O"]
[null,null,"BTP",null,null,"Termijnbedrag bruto premie",null,null,null,null,null,null,null,"LEEG"]
[null,null,"CODE",null,"ADNDEK","Dekkingscode","O:XD",null,null,null,null,null,null,"O"]
[null,null,"COLFACT",null,null,"Perc. collectiviteitfactor","O:XD_PRCCOLK",null,null,null,null,null,null,"O"]
[null,null,"ERB",null,null,"Bedrag eigen risico",null,"O:XD",null,null,null,null,null,"O"]
[null,null,"GADEKCD",null,null,"Volmacht dekkingscode","V:XD",null,null,null,null,null,null,"V"]
[null,null,"GADEKCO",null,null,"Volmacht dekkingscode, omschr.","V:XD",null,null,null,null,null,null,"V"]
[null,null,"GARINB",null,"ADNGTO","Garantie tegen onderverz., code",null,null,null,null,null,null,null,"LEEG"]
[null,null,"GSS",null,"ADNGEZ","Verzekerde gezinssamenstelling, code",null,null,null,null,null,null,null,{"$f":"IF(LEFT(G334,1)=\"X\",\"X\",IF(LEFT(G334,1)=\"V\",\"V\",IF(H334=\"V\",\"V\",IF(I334=\"V\",\"V\",IF(J334=\"V\",\"O\",IF(K334=\"V\",\"O\",IF(L334=\"V\",\"O\",IF(M334=\"V\",\"V\",IF(LEFT(G334,1)=\"O\",\"O\",IF(LEFT(H334,1)=\"O\",\"O\",IF(I334=\"O\",\"O\",IF(J334=\"O\",\"O\",IF(K334=\"O\",\"O\",IF(L334=\"O\",\"O\",IF(M334=\"O\",\"O\",\"LEEG\")))))))))))))))","v":"LEEG"}]
[null,null,"INBOEDE",null,null,"Verz. bedrag inboedel",null,null,null,null,null,null,null,"LEEG"]
[null,null,"MVZVRH",null,"ADNLOG","Mvz. Verhuur J/N",null,null,null,null,null,null,null,"LEEG"]
[null,null,"MYCODE",null,"ADNMCD","Dekkingscode maatschappij, code",null,"O:XD",null,null,null,null,null,"O"]
[null,null,"NJP",null,null,"Netto jaarpremie","O:XD",null,null,null,null,null,null,"O"]
[null,null,"PAFWST",null,null,"Percentage afw. op standaard tarief","O:XD",null,null,null,null,null,null,"O"]
[null,null,"PPRC",null,null,"Percentage prolongatieprovisie","O:XD",null,null,null,null,null,null,"O"]
[null,null,"PRCPKKT",null,null,"Percentage pakketkorting","O:XD",null,null,null,null,null,null,"O"]
[null,null,"PRCTEKC",null,null,"Percentage Volmachtbeloning","O:XD",null,null,null,null,null,null,"O"]
[null,null,"PRMPROM",null,null,"Premiepromillage",null,"O:XD",null,null,null,null,null,"O"]
[null,null,"RELVRH",null,"ADNENT","Relatie verhouding tot, code","O:XD",null,null,null,null,null,null,"O"]
[null,null,"RELVVNR",null,null,"Relatie verhouding tot, volgnummer","O:XD",null,null,null,null,null,null,"O"]
[null,null,"RJRCOR",null,null,"Resterende jaren voor correctie","O:XD",null,null,null,null,null,null,"O"]
[null,null,"TCORBDR",null,null,"Toegepast correctiebedrag","O:XD",null,null,null,null,null,null,"O"]
[null,null,"VERZSOM",null,null,"Verzekerde som",null,"O:XD",null,null,null,null,null,"O"]
[null,null,"VGBRA",null,null,"Volmachtgever branchecode","O:XD",null,null,null,null,null,null,"O"]
[null,null,"VOLGNUM",null,null,"Volgnummer",null,null,null,null,null,null,null,"LEEG"]
[null,null,"VRWRKCD",null,"ADNVRC","Verwerkingscode entiteit",null,null,null,null,null,null,null,"LEEG"]
[null,null,"WPREMBP",null,"ADNPBP","Wijze premieberekening prol.,code","O:XD",null,null,null,null,null,null,"O"]
[null,null,"MP",null,null,"POOLAANDEEL","O",null,null,null,null,null,null,"O"]
[null,null,null,"MYAAND","","POR Maatschappij aanduiding, code","O",null,null,null,null,null,null,"O"]
[null,null,null,"PLLEAD","","Poolleader J/N","O",null,null,null,null,null,null,"O"]
[null,null,null,"POOLNUM","PORMAA","Poolnummer","V",null,null,null,null,null,null,"V"]
[null,null,null,"POOLPRC","ADNLOG","Percentage poolaandeel","V",null,null,null,null,null,null,"V"]
[null,"IV",null,null,null,"DEKKING INVENTARIS/GOEDEREN",null,"O:XD",null,null,null,null,null,"O","maxOccurs 1"]
[null,null,"BAFWST",null,null,"Bedrag afwijk. op standaard tarief","O:XD",null,null,null,null,null,null,"O"]
[null,null,"BTP",null,null,"Termijnbedrag bruto premie",null,null,null,null,null,null,null,"LEEG"]
[null,null,"CODE",null,"ADNDEK","Dekkingscode","O:XD",null,null,null,null,null,null,"O"]
[null,null,"COLFACT",null,null,"Perc. collectiviteitfactor","O:XD_PRCCOLK",null,null,null,null,null,null,"O"]
[null,null,"ERB",null,null,"Bedrag eigen risico",null,"O:XD",null,null,null,null,null,"O"]
[null,null,"GADEKCD",null,null,"Volmacht dekkingscode","V:XD",null,null,null,null,null,null,"V"]
[null,null,"GADEKCO",null,null,"Volmacht dekkingscode, omschr.","V:XD",null,null,null,null,null,null,"V"]
[null,null,"MYCODE",null,"ADNMCD","Dekkingscode maatschappij, code",null,"O:XD",null,null,null,null,null,"O"]
[null,null,"NJP",null,null,"Netto jaarpremie","O:XD",null,null,null,null,null,null,"O"]
[null,null,"PAFWST",null,null,"Percentage afw. op standaard tarief","O:XD",null,null,null,null,null,null,"O"]
[null,null,"PPRC",null,null,"Percentage prolongatieprovisie","O:XD",null,null,null,null,null,null,"O"]
[null,null,"PRCPKKT",null,null,"Percentage pakketkorting","O:XD",null,null,null,null,null,null,"O"]
[null,null,"PRCTEKC",null,null,"Percentage Volmachtbeloning","O:XD",null,null,null,null,null,null,"O"]
[null,null,"PRMPROM",null,null,"Premiepromillage",null,"O:XD",null,null,null,null,null,"O"]
[null,null,"RELVRH",null,"ADNENT","Relatie verhouding tot, code","O:XD",null,null,null,null,null,null,"O"]
[null,null,"RELVVNR",null,null,"Relatie verhouding tot, volgnummer","O:XD",null,null,null,null,null,null,"O"]
[null,null,"RJRCOR",null,null,"Resterende jaren voor correctie","O:XD",null,null,null,null,null,null,"O"]
[null,null,"TCORBDR",null,null,"Toegepast correctiebedrag","O:XD",null,null,null,null,null,null,"O"]
[null,null,"VERZSOM",null,null,"Verzekerde som",null,"O:XD",null,null,null,null,null,"O"]
[null,null,"VGBRA",null,null,"Volmachtgever branchecode","O:XD",null,null,null,null,null,null,"O"]
[null,null,"VOLGNUM",null,null,"Volgnummer",null,null,null,null,null,null,null,"LEEG"]
[null,null,"VRWRKCD",null,"ADNVRC","Verwerkingscode entiteit",null,null,null,null,null,null,null,"LEEG"]
[null,null,"WPREMBP",null,"ADNPBP","Wijze premieberekening prol.,code","O:XD",null,null,null,null,null,null,"O"]
[null,null,"MP",null,null,"POOLAANDEEL","O",null,null,null,null,null,null,"O"]
[null,null,null,"MYAAND","","POR Maatschappij aanduiding, code","O",null,null,null,null,null,null,"O"]
[null,null,null,"PLLEAD","","Poolleader J/N","O",null,null,null,null,null,null,"O"]
[null,null,null,"POOLNUM","PORMAA","Poolnummer","V",null,null,null,null,null,null,"V"]
[null,null,null,"POOLPRC","ADNLOG","Percentage poolaandeel","V",null,null,null,null,null,null,"V"]
[null,"KA",null,null,"","DEKKING KUNST / ANTIQUITEITEN",null,"O:XD",null,null,null,null,null,"O","maxOccurs 1"]
[null,null,"BAFWST",null,null,"Bedrag afwijk. op standaard tarief","O:XD",null,null,null,null,null,null,"O"]
[null,null,"BTP",null,null,"Termijnbedrag bruto premie",null,null,null,null,null,null,null,"LEEG"]
[null,null,"CODE",null,"ADNDEK","Dekkingscode","O:XD",null,null,null,null,null,null,"O"]
[null,null,"COLFACT",null,null,"Perc. collectiviteitfactor","O:XD_PRCCOLK",null,null,null,null,null,null,"O"]
[null,null,"ERB",null,null,"Bedrag eigen risico",null,"O:XD",null,null,null,null,null,"O"]
[null,null,"GADEKCD",null,null,"Volmacht dekkingscode","V:XD",null,null,null,null,null,null,"V"]
[null,null,"GADEKCO",null,null,"Volmacht dekkingscode, omschr.","V:XD",null,null,null,null,null,null,"V"]
[null,null,"MYCODE",null,"ADNMCD","Dekkingscode maatschappij, code",null,"O:XD",null,null,null,null,null,"O"]
[null,null,"NJP",null,null,"Netto jaarpremie","O:XD",null,null,null,null,null,null,"O"]
[null,null,"PAFWST",null,null,"Percentage afw. op standaard tarief","O:XD",null,null,null,null,null,null,"O"]
[null,null,"PPRC",null,null,"Percentage prolongatieprovisie","O:XD",null,null,null,null,null,null,{"$f":"IF(LEFT(G398,1)=\"X\",\"X\",IF(LEFT(G398,1)=\"V\",\"V\",IF(H398=\"V\",\"V\",IF(I398=\"V\",\"V\",IF(J398=\"V\",\"O\",IF(K398=\"V\",\"O\",IF(L398=\"V\",\"O\",IF(M398=\"V\",\"V\",IF(LEFT(G398,1)=\"O\",\"O\",IF(LEFT(H398,1)=\"O\",\"O\",IF(I398=\"O\",\"O\",IF(J398=\"O\",\"O\",IF(K398=\"O\",\"O\",IF(L398=\"O\",\"O\",IF(M398=\"O\",\"O\",\"LEEG\")))))))))))))))","v":"O"}]
[null,null,"PRCPKKT",null,null,"Percentage pakketkorting","O:XD",null,null,null,null,null,null,"O"]
[null,null,"PRCTEKC",null,null,"Percentage Volmachtbeloning","O:XD",null,null,null,null,null,null,"O"]
[null,null,"RELVRH",null,"ADNENT","Relatie verhouding tot, code","O:XD",null,null,null,null,null,null,"O"]
[null,null,"RELVVNR",null,null,"Relatie verhouding tot, volgnummer","O:XD",null,null,null,null,null,null,"O"]
[null,null,"RJRCOR",null,null,"Resterende jaren voor correctie","O:XD",null,null,null,null,null,null,"O"]
[null,null,"TCORBDR",null,null,"Toegepast correctiebedrag","O:XD",null,null,null,null,null,null,"O"]
[null,null,"VERZSOM",null,null,"Verzekerde som",null,"O:XD",null,null,null,null,null,"O"]
[null,null,"VGBRA",null,null,"Volmachtgever branchecode","O:XD",null,null,null,null,null,null,"O"]
[null,null,"VOLGNUM",null,null,"Volgnummer",null,null,null,null,null,null,null,"LEEG"]
[null,null,"VRWRKCD",null,"ADNVRC","Verwerkingscode entiteit",null,null,null,null,null,null,null,"LEEG"]
[null,null,"WPREMBP",null,"ADNPBP","Wijze premieberekening prol.,code","O:XD",null,null,null,null,null,null,"O"]
[null,null,"MP",null,"ADNPBP","POOLAANDEEL","O",null,null,null,null,null,null,"O"]
[null,null,null,"MYAAND","","POR Maatschappij aanduiding, code","O",null,null,null,null,null,null,"O"]
[null,null,null,"PLLEAD","","Poolleader J/N","O",null,null,null,null,null,null,"O"]
[null,null,null,"POOLNUM","PORMAA","Poolnummer","V",null,null,null,null,null,null,"V"]
[null,null,null,"POOLPRC","ADNLOG","Percentage poolaandeel","V",null,null,null,null,null,null,"V"]
[null,"LS",null,null,"","DEKKING LIJFSIERADEN",null,"O:XD",null,null,null,null,null,"O","maxOccurs 1"]
[null,null,"BAFWST",null,null,"Bedrag afwijk. op standaard tarief","O:XD",null,null,null,null,null,null,"O"]
[null,null,"BTP",null,null,"Termijnbedrag bruto premie",null,null,null,null,null,null,null,"LEEG"]
[null,null,"CODE",null,"ADNDEK","Dekkingscode","O:XD",null,null,null,null,null,null,"O"]
[null,null,"COLFACT",null,null,"Perc. collectiviteitfactor","O:XD_PRCCOLK",null,null,null,null,null,null,"O"]
[null,null,"ERB",null,null,"Bedrag eigen risico",null,"O:XD",null,null,null,null,null,"O"]
[null,null,"GADEKCD",null,null,"Volmacht dekkingscode","V:XD",null,null,null,null,null,null,"V"]
[null,null,"GADEKCO",null,null,"Volmacht dekkingscode, omschr.","V:XD",null,null,null,null,null,null,"V"]
[null,null,"MYCODE",null,"ADNMCD","Dekkingscode maatschappij, code",null,"O:XD",null,null,null,null,null,"O"]
[null,null,"NJP",null,null,"Netto jaarpremie","O:XD",null,null,null,null,null,null,"O"]
[null,null,"PAFWST",null,null,"Percentage afw. op standaard tarief","O:XD",null,null,null,null,null,null,"O"]
[null,null,"PPRC",null,null,"Percentage prolongatieprovisie","O:XD",null,null,null,null,null,null,"O"]
[null,null,"PRCPKKT",null,null,"Percentage pakketkorting","O:XD",null,null,null,null,null,null,"O"]
[null,null,"PRCTEKC",null,null,"Percentage Volmachtbeloning","O:XD",null,null,null,null,null,null,"O"]
[null,null,"RELVRH",null,"ADNENT","Relatie verhouding tot, code","O:XD",null,null,null,null,null,null,"O"]
[null,null,"RELVVNR",null,null,"Relatie verhouding tot, volgnummer","O:XD",null,null,null,null,null,null,"O"]
[null,null,"RJRCOR",null,null,"Resterende jaren voor correctie","O:XD",null,null,null,null,null,null,"O"]
[null,null,"TCORBDR",null,null,"Toegepast correctiebedrag","O:XD",null,null,null,null,null,null,"O"]
[null,null,"VEERB",null,null,"Bedrag vrijwillig extra eigen risico",null,null,null,null,null,null,null,"LEEG"]
[null,null,"VERZSOM",null,null,"Verzekerde som",null,"O:XD",null,null,null,null,null,"O"]
[null,null,"VGBRA",null,null,"Volmachtgever branchecode","O:XD",null,null,null,null,null,null,"O"]
[null,null,"VOLGNUM",null,null,"Volgnummer",null,null,null,null,null,null,null,"LEEG"]
[null,null,"VRWRKCD",null,"ADNVRC","Verwerkingscode entiteit",null,null,null,null,null,null,null,"LEEG"]
[null,null,"WPREMBP",null,"ADNPBP","Wijze premieberekening prol.,code","O:XD",null,null,null,null,null,null,"O"]
[null,null,"MP",null,"ADNPBP","POOLAANDEEL","O",null,null,null,null,null,null,"O"]
[null,null,null,"MYAAND","","POR Maatschappij aanduiding, code","O",null,null,null,null,null,null,"O"]
[null,null,null,"PLLEAD","","Poolleader J/N","O",null,null,null,null,null,null,"O"]
[null,null,null,"POOLNUM","PORMAA","Poolnummer","V",null,null,null,null,null,null,"V"]
[null,null,null,"POOLPRC","ADNLOG","Percentage poolaandeel","V",null,null,null,null,null,null,"V"]
[null,"MI",null,null,"","DEKKING MUZIEKINSTRUMENT",null,"O:XD",null,null,null,null,null,"O","maxOccurs 1"]
[null,null,"BAFWST",null,null,"Bedrag afwijk. op standaard tarief","O:XD",null,null,null,null,null,null,"O"]
[null,null,"BTP",null,null,"Termijnbedrag bruto premie",null,null,null,null,null,null,null,"LEEG"]
[null,null,"CODE",null,"ADNDEK","Dekkingscode","O:XD",null,null,null,null,null,null,"O"]
[null,null,"COLFACT",null,null,"Perc. collectiviteitfactor","O:XD_PRCCOLK",null,null,null,null,null,null,"O"]
[null,null,"ERB",null,null,"Bedrag eigen risico",null,"O:XD",null,null,null,null,null,"O"]
[null,null,"GADEKCD",null,null,"Volmacht dekkingscode","V:XD",null,null,null,null,null,null,"V"]
[null,null,"GADEKCO",null,null,"Volmacht dekkingscode, omschr.","V:XD",null,null,null,null,null,null,"V"]
[null,null,"MYCODE",null,"ADNMCD","Dekkingscode maatschappij, code",null,"O:XD",null,null,null,null,null,"O"]
[null,null,"NJP",null,null,"Netto jaarpremie","O:XD",null,null,null,null,null,null,"O"]
[null,null,"PAFWST",null,null,"Percentage afw. op standaard tarief","O:XD",null,null,null,null,null,null,"O"]
[null,null,"PPRC",null,null,"Percentage prolongatieprovisie","O:XD",null,null,null,null,null,null,"O"]
[null,null,"PRCPKKT",null,null,"Percentage pakketkorting","O:XD",null,null,null,null,null,null,"O"]
[null,null,"PRCTEKC",null,null,"Percentage Volmachtbeloning","O:XD",null,null,null,null,null,null,"O"]
[null,null,"RELVRH",null,"ADNENT","Relatie verhouding tot, code","O:XD",null,null,null,null,null,null,"O"]
[null,null,"RELVVNR",null,null,"Relatie verhouding tot, volgnummer","O:XD",null,null,null,null,null,null,"O"]
[null,null,"RJRCOR",null,null,"Resterende jaren voor correctie","O:XD",null,null,null,null,null,null,"O"]
[null,null,"TCORBDR",null,null,"Toegepast correctiebedrag","O:XD",null,null,null,null,null,null,"O"]
[null,null,"VEERB",null,null,"Bedrag vrijwillig extra eigen risico",null,null,null,null,null,null,null,{"$f":"IF(LEFT(G462,1)=\"X\",\"X\",IF(LEFT(G462,1)=\"V\",\"V\",IF(H462=\"V\",\"V\",IF(I462=\"V\",\"V\",IF(J462=\"V\",\"O\",IF(K462=\"V\",\"O\",IF(L462=\"V\",\"O\",IF(M462=\"V\",\"V\",IF(LEFT(G462,1)=\"O\",\"O\",IF(LEFT(H462,1)=\"O\",\"O\",IF(I462=\"O\",\"O\",IF(J462=\"O\",\"O\",IF(K462=\"O\",\"O\",IF(L462=\"O\",\"O\",IF(M462=\"O\",\"O\",\"LEEG\")))))))))))))))","v":"LEEG"}]
[null,null,"VERZSOM",null,null,"Verzekerde som",null,"O:XD",null,null,null,null,null,"O"]
[null,null,"VGBRA",null,null,"Volmachtgever branchecode","O:XD",null,null,null,null,null,null,"O"]
[null,null,"VOLGNUM",null,null,"Volgnummer",null,null,null,null,null,null,null,"LEEG"]
[null,null,"VRWRKCD",null,"ADNVRC","Verwerkingscode entiteit",null,null,null,null,null,null,null,"LEEG"]
[null,null,"WPREMBP",null,"ADNPBP","Wijze premieberekening prol.,code","O:XD",null,null,null,null,null,null,"O"]
[null,null,"MP",null,"ADNPBP","POOLAANDEEL","O",null,null,null,null,null,null,"O"]
[null,null,null,"MYAAND","","POR Maatschappij aanduiding, code","O",null,null,null,null,null,null,"O"]
[null,null,null,"PLLEAD","","Poolleader J/N","O",null,null,null,null,null,null,"O"]
[null,null,null,"POOLNUM","PORMAA","Poolnummer","V",null,null,null,null,null,null,"V"]
[null,null,null,"POOLPRC","ADNLOG","Percentage poolaandeel","V",null,null,null,null,null,null,"V"]
[null,"OP",null,null,null,"DEKKING OPSTAL",null,"O:XD",null,null,null,null,null,"O","maxOccurs 1"]
[null,null,"BAFWST",null,null,"Bedrag afwijk. op standaard tarief","O:XD",null,null,null,null,null,null,"O"]
[null,null,"BTP",null,null,"Termijnbedrag bruto premie",null,null,null,null,null,null,null,"LEEG"]
[null,null,"CODE",null,"ADNDEK","Dekkingscode","O:XD",null,null,null,null,null,null,"O"]
[null,null,"COLFACT",null,null,"Perc. collectiviteitfactor","O:XD_PRCCOLK",null,null,null,null,null,null,"O"]
[null,null,"ERB",null,null,"Bedrag eigen risico",null,"O:XD",null,null,null,null,null,"O"]
[null,null,"GADEKCD",null,null,"Volmacht dekkingscode","V:XD",null,null,null,null,null,null,"V"]
[null,null,"GADEKCO",null,null,"Volmacht dekkingscode, omschr.","V:XD",null,null,null,null,null,null,"V"]
[null,null,"MYCODE",null,"ADNMCD","Dekkingscode maatschappij, code",null,"O:XD",null,null,null,null,null,"O"]
[null,null,"NJP",null,null,"Netto jaarpremie","O:XD",null,null,null,null,null,null,"O"]
[null,null,"PAFWST",null,null,"Percentage afw. op standaard tarief","O:XD",null,null,null,null,null,null,"O"]
[null,null,"PPRC",null,null,"Percentage prolongatieprovisie","O:XD",null,null,null,null,null,null,"O"]
[null,null,"PRCPKKT",null,null,"Percentage pakketkorting","O:XD",null,null,null,null,null,null,"O"]
[null,null,"PRCTEKC",null,null,"Percentage Volmachtbeloning","O:XD",null,null,null,null,null,null,"O"]
[null,null,"RELVRH",null,"ADNENT","Relatie verhouding tot, code","O:XD",null,null,null,null,null,null,"O"]
[null,null,"RELVVNR",null,null,"Relatie verhouding tot, volgnummer","O:XD",null,null,null,null,null,null,"O"]
[null,null,"RJRCOR",null,null,"Resterende jaren voor correctie","O:XD",null,null,null,null,null,null,"O"]
[null,null,"TCORBDR",null,null,"Toegepast correctiebedrag","O:XD",null,null,null,null,null,null,"O"]
[null,null,"VERZSOM",null,null,"Verzekerde som",null,"O:XD",null,null,null,null,null,"O"]
[null,null,"VGBRA",null,null,"Volmachtgever branchecode","O:XD",null,null,null,null,null,null,"O"]
[null,null,"VOLGNUM",null,null,"Volgnummer",null,null,null,null,null,null,null,"LEEG"]
[null,null,"VRWRKCD",null,"ADNVRC","Verwerkingscode entiteit",null,null,null,null,null,null,null,"LEEG"]
[null,null,"WPREMBP",null,"ADNPBP","Wijze premieberekening prol.,code","O:XD",null,null,null,null,null,null,"O"]
[null,null,"MP",null,"ADNPBP","POOLAANDEEL","O",null,null,null,null,null,null,"O"]
[null,null,null,"MYAAND","","POR Maatschappij aanduiding, code","O",null,null,null,null,null,null,"O"]
[null,null,null,"PLLEAD","","Poolleader J/N","O",null,null,null,null,null,null,"O"]
[null,null,null,"POOLNUM","PORMAA","Poolnummer","V",null,null,null,null,null,null,"V"]
[null,null,null,"POOLPRC","ADNLOG","Percentage poolaandeel","V",null,null,null,null,null,null,"V"]
[null,"SU",null,null,null,"DEKKING SPORTUITRUSTING",null,"O:XD",null,null,null,null,null,"O","maxOccurs 1"]
[null,null,"BAFWST",null,null,"Bedrag afwijk. op standaard tarief","O:XD",null,null,null,null,null,null,"O"]
[null,null,"BTP",null,null,"Termijnbedrag bruto premie",null,null,null,null,null,null,null,"LEEG"]
[null,null,"CODE",null,"ADNDEK","Dekkingscode","O:XD",null,null,null,null,null,null,"O"]
[null,null,"COLFACT",null,null,"Perc. collectiviteitfactor","O:XD_PRCCOLK",null,null,null,null,null,null,"O"]
[null,null,"ERB",null,null,"Bedrag eigen risico",null,"O:XD",null,null,null,null,null,"O"]
[null,null,"GADEKCD",null,null,"Volmacht dekkingscode","V:XD",null,null,null,null,null,null,"V"]
[null,null,"GADEKCO",null,null,"Volmacht dekkingscode, omschr.","V:XD",null,null,null,null,null,null,"V"]
[null,null,"MYCODE",null,"ADNMCD","Dekkingscode maatschappij, code",null,"O:XD",null,null,null,null,null,"O"]
[null,null,"NJP",null,null,"Netto jaarpremie","O:XD",null,null,null,null,null,null,"O"]
[null,null,"PAFWST",null,null,"Percentage afw. op standaard tarief","O:XD",null,null,null,null,null,null,"O"]
[null,null,"PPRC",null,null,"Percentage prolongatieprovisie","O:XD",null,null,null,null,null,null,"O"]
[null,null,"PRCPKKT",null,null,"Percentage pakketkorting","O:XD",null,null,null,null,null,null,"O"]
[null,null,"PRCTEKC",null,null,"Percentage Volmachtbeloning","O:XD",null,null,null,null,null,null,"O"]
[null,null,"RELVRH",null,"ADNENT","Relatie verhouding tot, code","O:XD",null,null,null,null,null,null,"O"]
[null,null,"RELVVNR",null,null,"Relatie verhouding tot, volgnummer","O:XD",null,null,null,null,null,null,"O"]
[null,null,"RJRCOR",null,null,"Resterende jaren voor correctie","O:XD",null,null,null,null,null,null,"O"]
[null,null,"TCORBDR",null,null,"Toegepast correctiebedrag","O:XD",null,null,null,null,null,null,"O"]
[null,null,"VERZSOM",null,null,"Verzekerde som",null,"O:XD",null,null,null,null,null,"O"]
[null,null,"VGBRA",null,null,"Volmachtgever branchecode","O:XD",null,null,null,null,null,null,"O"]
[null,null,"VOLGNUM",null,null,"Volgnummer",null,null,null,null,null,null,null,"LEEG"]
[null,null,"VRWRKCD",null,"ADNVRC","Verwerkingscode entiteit",null,null,null,null,null,null,null,"LEEG"]
[null,null,"WPREMBP",null,"ADNPBP","Wijze premieberekening prol.,code","O:XD",null,null,null,null,null,null,"O"]
[null,null,"MP",null,"ADNPBP","POOLAANDEEL","O",null,null,null,null,null,null,"O"]
[null,null,null,"MYAAND","","POR Maatschappij aanduiding, code","O",null,null,null,null,null,null,"O"]
[null,null,null,"PLLEAD","","Poolleader J/N","O",null,null,null,null,null,null,{"$f":"IF(LEFT(G526,1)=\"X\",\"X\",IF(LEFT(G526,1)=\"V\",\"V\",IF(H526=\"V\",\"V\",IF(I526=\"V\",\"V\",IF(J526=\"V\",\"O\",IF(K526=\"V\",\"O\",IF(L526=\"V\",\"O\",IF(M526=\"V\",\"V\",IF(LEFT(G526,1)=\"O\",\"O\",IF(LEFT(H526,1)=\"O\",\"O\",IF(I526=\"O\",\"O\",IF(J526=\"O\",\"O\",IF(K526=\"O\",\"O\",IF(L526=\"O\",\"O\",IF(M526=\"O\",\"O\",\"LEEG\")))))))))))))))","v":"O"}]
[null,null,null,"POOLNUM","PORMAA","Poolnummer","V",null,null,null,null,null,null,"V"]
[null,null,null,"POOLPRC","ADNLOG","Percentage poolaandeel","V",null,null,null,null,null,null,"V"]
[null,"CL",null,null,null,"CLAUSULE",null,null,null,null,null,null,null,"LEEG","maxOccurs 1"]
[null,null,"CLAUSNR",null,null,"Clausule nummers",null,null,null,null,null,null,null,"LEEG"]
[null,null,"CLAUSOM",null,null,"Clausuletekst",null,null,null,null,null,null,null,"LEEG"]
[null,null,"CLAUTXT",null,null,"Clausule tekst",null,null,null,null,null,null,null,"LEEG"]
[null,null,"VERSIEC",null,null,"Clausule versienummer",null,null,null,null,null,null,null,"LEEG"]
[null,null,"VOLGNUM",null,null,"Volgnummer",null,null,null,null,null,null,null,"LEEG"]
[null,null,"VRWRKCD",null,"ADNVRC","Verwerkingscode entiteit",null,null,null,null,null,null,null,"LEEG"]
[null,"VW",null,null,null,"VOORWAARDEN",null,null,null,null,null,null,null,"LEEG","maxOccurs 1"]
[null,null,"VOLGNUM",null,null,"Volgnummer",null,null,null,null,null,null,null,"LEEG"]
[null,null,"VRWNR",null,null,"Voorwaarde nummer",null,null,null,null,null,null,null,"LEEG"]
[null,null,"VRWOM",null,null,"Voorwaardentekst",null,null,null,null,null,null,null,"LEEG"]
[null,null,"VRWRKCD",null,"ADNVRC","Verwerkingscode entiteit",null,null,null,null,null,null,null,"LEEG"]
[null,null,"VRWVERS",null,null,"Voorwaarde versie",null,null,null,null,null,null,null,"LEEG"]
[null,"WM",null,null,null,"WAARDE-, PREVENTIEMETER",null,null,null,null,null,null,null,"LEEG","maxOccurs 1"]
[null,null,"INKHKW",null,null,"Netto maandinkomen hoofdkostwinner",null,null,null,null,null,null,null,"LEEG"]
[null,null,"VRWRKCD",null,"ADNVRC","Verwerkingscode entiteit",null,null,null,null,null,null,null,"LEEG"]
[null,"TP",null,null,"","PARTIJ TUSSENPERSOON","O",null,null,null,null,null,null,"O"]
[null,null,"AFMVRGN",null,"","AFM vergunningnummer","O",null,null,null,null,null,null,"O"]
[null,null,"IDNR",null,"","Identificatienummer","O",null,null,null,null,null,null,"O"]
[null,"VE",null,null,"","PARTIJ VOLMACHTNEMER","V",null,null,null,null,null,null,"V"]
[null,null,"ANAAM",null,"","Naam","V",null,null,null,null,null,null,"V"]
[null,null,"IDNR",null,"","Identificatie nummer","O",null,null,null,null,null,null,"O"]
[null,null,"MYAAND",null,"PORMAA","POR Maatschappij aanduiding, code","O",null,null,null,null,null,null,"O"]
[null,null,"TELNUM",null,"","Telefoonnummer","V",null,null,null,null,null,null,"V"]
[null,null,"TWEEDED",null,"","Tweede deel naam","O",null,null,null,null,null,null,"O"]
[null,null,"VOLGNUM",null,null,"Volgnummer",null,null,null,null,null,null,null,"LEEG"]
[null,null,"VRWRKCD",null,"ADNVRC","Verwerkingscode entiteit",null,null,null,null,null,null,null,"LEEG"]
[null,"VL",null,null,"","PARTIJ VOLMACHTGEVER","V",null,null,null,null,null,null,"V"]
[null,null,"ANAAM",null,"","Naam","V",null,null,null,null,null,null,"V"]
[null,null,"EMAIL",null,"","E-mail adres","O",null,null,null,null,null,null,"O"]
[null,null,"MYAAND",null,"PORMAA","POR Maatschappij aanduiding, code","V",null,null,null,null,null,null,"V"]
[null,null,"TELNUM",null,"","Telefoonnummer","O",null,null,null,null,null,null,"O"]
[null,null,"TWEEDED",null,"","Tweede deel naam","O",null,null,null,null,null,null,"O"]
[null,null,"VEIDNR",null,null,"Volmachtnemer identificatie","O",null,null,null,null,null,null,"O"]
[null,null,"VOLGNUM",null,null,"Volgnummer",null,null,null,null,null,null,null,"LEEG"]
[null,null,"VRWRKCD",null,"ADNVRC","Verwerkingscode entiteit",null,null,null,null,null,null,null,"LEEG"]
[null,"VP",null,null,"","PARTIJ VERZEKERINGNEMER","V",null,null,null,null,null,null,"V","maxOccurs 1"]
[null,null,"ANAAM",null,null,"Naam",null,null,null,null,null,null,null,"LEEG"]
[null,null,"GEBDAT",null,"","Geboortedatum","O",null,null,null,null,null,null,"O"]
[null,null,"GESLACH",null,"ADNSRL","Geslacht/rechtspersoon, code","O",null,null,null,null,null,null,"O"]
[null,null,"HUISNR",null,null,"Huisnummer",null,null,null,null,null,null,null,"LEEG"]
[null,null,"PARZAKC",null,"","Particulier of zakelijk, code","V",null,null,null,null,null,null,"V"]
[null,null,"PLAATS",null,null,"Plaats",null,null,null,null,null,null,null,"LEEG"]
[null,null,"PCODE",null,"ADNGES","Postcode","V",null,null,null,null,null,null,"V"]
[null,null,"STRAAT",null,null,"Straat",null,null,null,null,null,null,null,"LEEG"]
[null,null,"TOEVOEG",null,null,"Huisnummertoevoeging",null,null,null,null,null,null,null,"LEEG"]
[null,null,"VOLGNUM",null,null,"Volgnummer",null,null,null,null,null,null,null,"LEEG"]
[null,null,"VOORL",null,null,"Voorletters",null,null,null,null,null,null,null,"LEEG"]
[null,null,"VOORV",null,null,"Voorvoegsels",null,null,null,null,null,null,null,"LEEG"]
[null,null,"VRWRKCD",null,"ADNVRC","Verwerkingscode entiteit",null,null,null,null,null,null,null,"LEEG"]
["XG",null,null,null,null,"TRANSACTIE PROCES",null,null,null,null,null,null,null,"LEEG"]
[null,"STATUS",null,null,"ADNSTS","Status, code",null,null,null,null,null,null,null,"LEEG"]
[null,"STATUST",null,null,null,"Toelichting status",null,null,null,null,null,null,null,"LEEG"]
[null,"VRWRKCD",null,null,"ADNVRC","Verwerkingscode entiteit",null,null,null,null,null,null,null,"LEEG"]
[null,"XM",null,null,null,"OMSCHRIJVING STATUS",null,null,null,null,null,null,null,"LEEG","maxOccurs 1"]
[null,null,"STATTXT",null,null,"Status, tekst",null,null,null,null,null,null,null,"LEEG"]
[null,null,"VOLGNUM",null,null,"Volgnummer",null,null,null,null,null,null,null,"LEEG"]
[null,null,"VRWRKCD",null,"ADNVRC","Verwerkingscode entiteit",null,null,null,null,null,null,null,"LEEG"]
[null,null,"XPATH",null,null,"Gegevenselement locatie",null,null,null,null,null,null,null,"LEEG"]

{"sheet":" Verbandscontrole","index":2,"n_rows":28,"n_cols":7,"rows_kept":28,"cut":false,"hidden":false,"merged":[[14,6,15,6],[18,6,19,6],[22,6,23,6],[26,2,27,2],[26,5,27,5],[26,6,27,6],[18,2,19,2],[22,2,23,2],[14,2,15,2],[18,5,19,5],[14,5,15,5],[22,5,23,5]]}
["Inventarisatie noodzakelijke attributen "]
["Verzekeraar:",{"$f":"Schema!C2","v":0}]
["Branche:",{"$f":"Schema!C3","v":0}]
["POR maatschappij aanduiding:",{"$f":"Schema!C4","v":0}]
["AFD Definitie naam:",{"$f":"Schema!C5","v":0}]
["AFD Definitie versie nummer:",{"$f":"Schema!C6","v":0}]
["Commerciele productnaam:",{"$f":"Schema!C8","v":0}]
["Bronnen:",{"$f":"Schema!C9","v":0}]
["Contactpersoon:",{"$f":"Schema!C10","v":0}]
["E-mail / Telefoon:",{"$f":"Schema!C11","v":0}]
["Datum:",{"$f":"Schema!C12","v":"27-10-2021"}]
[]
[]
["Conditie","Voorbeeld verbandscontrole",null,"Conditie","Voorbeeld Pseudo-code ","Voorbeeld foutmelding","Bron"]
["If","Dekkingscode is 2002","Aanroep Acceptatie\nAanroep Premieberekening\nKunnen aanleveren","If","CA_CODE = 2002","Bij dekking Casco moet het bedrag oorspronkelijek cataloguswaarde groter zijn dan '0'. ","Rekenbox"]
["Then","moet bedrag oorspronkelijke cataloguswaarde groter zijn dan '0'",null,"Then","OB_VWACA > 0"]
[]
["Conditie","Verbandscontrole 1",null,"Conditie","XPath Verbandscontrole 1","Foutmelding","Bron"]
["If","<Vul hier de conditie waaraan voldaan moet worden> ","Aanroep Acceptatie\nAanroep Premieberekening\nKunnen aanleveren","If","<Vul hier de pseudocode in waaraan voldaan moet worden>","<Vermeld hier welke foutmelding de volmacht krijgt bij een onjuiste validatie> "]
["Then","<Vul hier de validatie die moet worden uitgevoerd als de conditie waar is>",null,"Then","<Vul hier de pseudocode in die bij validatie uitgevoerd moet worden>"]
[]
["Conditie","Verbandscontrole 2",null,"Conditie","XPath Verbandscontrole 2","Foutmelding","Bron"]
["If","<Vul hier de conditie waaraan voldaan moet worden> ","Aanroep Acceptatie\nAanroep Premieberekening\nKunnen aanleveren","If","<Vul hier de pseudocode in waaraan voldaan moet worden>","<Vermeld hier welke foutmelding de volmacht krijgt bij een onjuiste validatie> "]
["Then","<Vul hier de validatie die moet worden uitgevoerd als de conditie waar is>",null,"Then","<Vul hier de pseudocode in waaraan voldaan moet worden>"]
[]
["Conditie","Verbandscontrole 3",null,"Conditie","XPath Verbandscontrole 3","Foutmelding","Bron"]
["If","<Vul hier de conditie waaraan voldaan moet worden> ","Aanroep Acceptatie\nAanroep Premieberekening\nKunnen aanleveren","If","<Vul hier de pseudocode in waaraan voldaan moet worden>","<Vermeld hier welke foutmelding de volmacht krijgt bij een onjuiste validatie> "]
["Then","<Vul hier de validatie die moet worden uitgevoerd als de conditie waar is>",null,"Then","<Vul hier de pseudocode in waaraan voldaan moet worden>"]

{"sheet":"Openstaande punten","index":3,"n_rows":9,"n_cols":3,"rows_kept":9,"cut":false,"hidden":false,"merged":[]}
[]
[null,"Openstaande punten"]
[null,1,"Controleer tab \"Schema\" (zie instructies)"]
[null,2,"Controleer tab \"Verbandscontrole\" (zie instructies)"]
[null,3]
[null,4]
[null,5]
[null,6]
[null,7]

{"sheet":"Updates","index":4,"n_rows":2,"n_cols":4,"rows_kept":2,"cut":false,"hidden":false,"merged":[]}
[]
[null,"Versie","Datum","Omschrijving aanpassing"]

{"sheet":"CSVoutput","index":5,"n_rows":581,"n_cols":15,"rows_kept":581,"cut":false,"hidden":true,"merged":[]}
["Entiteit/Attribuut","Entiteit","I1","I2","I3","Pad1","Pad2","Pad3","Pad","Attribuut",{"$f":"Schema!I14","v":"premieBerekening_aanroep"},{"$f":"Schema!J14","v":"premieBerekening_resultaat"},{"$f":"Schema!K14","v":"Acceptatie_aanroep"},{"$f":"Schema!L14","v":"Acceptatie_resultaat"},{"$f":"Schema!N14","v":"kunnenAanleveren"}]
[{"$f":"Schema!A15&Schema!B15&Schema!C15&Schema!D15","v":"AL"},{"$f":"IF(LEN(A2)=2,A2,IF(A2=\"\",\"Leeg\",B1))","v":"AL"},{"$f":"IF(A2=\"\",\"\",IF(LEN(Schema!A15)=2,1,IF(LEN(Schema!B15)=2,10,IF(LEN(Schema!C15)=2,100,0))))","v":1},{"$f":"IF(C2=0,D1,C2)","v":1},{"$f":"IF(A2=\"\",\"\",SUM(Tabel2[[#This Row],[I1]:[I2]]))","v":2},{"$f":"IF(A2=\"\",\"\",IF(C2=1,B2,F1))","v":"AL"},{"$f":"IF(C2=10,A2,IF(OR(C2=0,C2=100),G1,\"\"))","v":""},{"$f":"IF(E2=200,B2,IF(C2=0,H1,\"\"))","v":""},{"$f":"IF(C2=\"\",\"\",IF(OR(E2=1,E2=10,E2=100),I1,IF(E2=2,F2,IF(E2=20,F2&\"/\"&G2,IF(E2=200,F2&\"/\"&G2&\"/\"&H2)))))","v":"AL"},{"$f":"IF(C2=\"\",\"\",IF(LEN(Tabel2[[#This Row],[Entiteit of attribuut]])=2,\"\",Tabel2[[#This Row],[Entiteit]]&\"_\"&Tabel2[[#This Row],[Entiteit of attribuut]]))","v":""},{"$f":"IF(Schema!I15=\"\",\"\",Schema!I15)","v":""},{"$f":"IF(Schema!J15=\"\",\"\",Schema!J15)","v":""},{"$f":"IF(Schema!K15=\"\",\"\",Schema!K15)","v":""},{"$f":"IF(Schema!L15=\"\",\"\",Schema!L15)","v":""},{"$f":"IF(Schema!N15=\"\",\"\",Schema!N15)","v":"V"}]
[{"$f":"Schema!A16&Schema!B16&Schema!C16&Schema!D16","v":"ADATMSG"},{"$f":"IF(LEN(A3)=2,A3,IF(A3=\"\",\"Leeg\",B2))","v":"AL"},{"$f":"IF(A3=\"\",\"\",IF(LEN(Schema!A16)=2,1,IF(LEN(Schema!B16)=2,10,IF(LEN(Schema!C16)=2,100,0))))","v":0},{"$f":"IF(C3=0,D2,C3)","v":1},{"$f":"IF(A3=\"\",\"\",SUM(Tabel2[[#This Row],[I1]:[I2]]))","v":1},{"$f":"IF(A3=\"\",\"\",IF(C3=1,B3,F2))","v":"AL"},{"$f":"IF(C3=10,A3,IF(OR(C3=0,C3=100),G2,\"\"))","v":""},{"$f":"IF(E3=200,B3,IF(C3=0,H2,\"\"))","v":""},{"$f":"IF(C3=\"\",\"\",IF(OR(E3=1,E3=10,E3=100),I2,IF(E3=2,F3,IF(E3=20,F3&\"/\"&G3,IF(E3=200,F3&\"/\"&G3&\"/\"&H3)))))","v":"AL"},{"$f":"IF(C3=\"\",\"\",IF(LEN(Tabel2[[#This Row],[Entiteit of attribuut]])=2,\"\",Tabel2[[#This Row],[Entiteit]]&\"_\"&Tabel2[[#This Row],[Entiteit of attribuut]]))","v":"AL_ADATMSG"},{"$f":"IF(Schema!I16=\"\",\"\",Schema!I16)","v":""},{"$f":"IF(Schema!J16=\"\",\"\",Schema!J16)","v":""},{"$f":"IF(Schema!K16=\"\",\"\",Schema!K16)","v":""},{"$f":"IF(Schema!L16=\"\",\"\",Schema!L16)","v":""},{"$f":"IF(Schema!N16=\"\",\"\",Schema!N16)","v":"V"}]
[{"$f":"Schema!A17&Schema!B17&Schema!C17&Schema!D17","v":"APPCODE"},"AL",{"$f":"IF(A4=\"\",\"\",IF(LEN(Schema!A17)=2,1,IF(LEN(Schema!B17)=2,10,IF(LEN(Schema!C17)=2,100,0))))","v":0},1,{"$f":"IF(A4=\"\",\"\",SUM(Tabel2[[#This Row],[I1]:[I2]]))","v":1},"AL","","","AL",{"$f":"IF(C4=\"\",\"\",IF(LEN(Tabel2[[#This Row],[Entiteit of attribuut]])=2,\"\",Tabel2[[#This Row],[Entiteit]]&\"_\"&Tabel2[[#This Row],[Entiteit of attribuut]]))","v":"AL_APPCODE"},{"$f":"IF(Schema!I17=\"\",\"\",Schema!I17)","v":""},{"$f":"IF(Schema!J17=\"\",\"\",Schema!J17)","v":""},{"$f":"IF(Schema!K17=\"\",\"\",Schema!K17)","v":""},{"$f":"IF(Schema!L17=\"\",\"\",Schema!L17)","v":""},{"$f":"IF(Schema!N17=\"\",\"\",Schema!N17)","v":"LEEG"}]
[{"$f":"Schema!A18&Schema!B18&Schema!C18&Schema!D18","v":"APPLNM"},"AL",{"$f":"IF(A5=\"\",\"\",IF(LEN(Schema!A18)=2,1,IF(LEN(Schema!B18)=2,10,IF(LEN(Schema!C18)=2,100,0))))","v":0},1,{"$f":"IF(A5=\"\",\"\",SUM(Tabel2[[#This Row],[I1]:[I2]]))","v":1},"AL","","","AL",{"$f":"IF(C5=\"\",\"\",IF(LEN(Tabel2[[#This Row],[Entiteit of attribuut]])=2,\"\",Tabel2[[#This Row],[Entiteit]]&\"_\"&Tabel2[[#This Row],[Entiteit of attribuut]]))","v":"AL_APPLNM"},{"$f":"IF(Schema!I18=\"\",\"\",Schema!I18)","v":""},{"$f":"IF(Schema!J18=\"\",\"\",Schema!J18)","v":""},{"$f":"IF(Schema!K18=\"\",\"\",Schema!K18)","v":""},{"$f":"IF(Schema!L18=\"\",\"\",Schema!L18)","v":""},{"$f":"IF(Schema!N18=\"\",\"\",Schema!N18)","v":"O"}]
[{"$f":"Schema!A19&Schema!B19&Schema!C19&Schema!D19","v":"APPLVS"},"AL",{"$f":"IF(A6=\"\",\"\",IF(LEN(Schema!A19)=2,1,IF(LEN(Schema!B19)=2,10,IF(LEN(Schema!C19)=2,100,0))))","v":0},1,{"$f":"IF(A6=\"\",\"\",SUM(Tabel2[[#This Row],[I1]:[I2]]))","v":1},"AL","","","AL",{"$f":"IF(C6=\"\",\"\",IF(LEN(Tabel2[[#This Row],[Entiteit of attribuut]])=2,\"\",Tabel2[[#This Row],[Entiteit]]&\"_\"&Tabel2[[#This Row],[Entiteit of attribuut]]))","v":"AL_APPLVS"},{"$f":"IF(Schema!I19=\"\",\"\",Schema!I19)","v":""},{"$f":"IF(Schema!J19=\"\",\"\",Schema!J19)","v":""},{"$f":"IF(Schema!K19=\"\",\"\",Schema!K19)","v":""},{"$f":"IF(Schema!L19=\"\",\"\",Schema!L19)","v":""},{"$f":"IF(Schema!N19=\"\",\"\",Schema!N19)","v":"O"}]
[{"$f":"Schema!A20&Schema!B20&Schema!C20&Schema!D20","v":"APPUSER"},"AL",{"$f":"IF(A7=\"\",\"\",IF(LEN(Schema!A20)=2,1,IF(LEN(Schema!B20)=2,10,IF(LEN(Schema!C20)=2,100,0))))","v":0},1,{"$f":"IF(A7=\"\",\"\",SUM(Tabel2[[#This Row],[I1]:[I2]]))","v":1},"AL","","","AL",{"$f":"IF(C7=\"\",\"\",IF(LEN(Tabel2[[#This Row],[Entiteit of attribuut]])=2,\"\",Tabel2[[#This Row],[Entiteit]]&\"_\"&Tabel2[[#This Row],[Entiteit of attribuut]]))","v":"AL_APPUSER"},{"$f":"IF(Schema!I20=\"\",\"\",Schema!I20)","v":""},{"$f":"IF(Schema!J20=\"\",\"\",Schema!J20)","v":""},{"$f":"IF(Schema!K20=\"\",\"\",Schema!K20)","v":""},{"$f":"IF(Schema!L20=\"\",\"\",Schema!L20)","v":""},{"$f":"IF(Schema!N20=\"\",\"\",Schema!N20)","v":"LEEG"}]
[{"$f":"Schema!A21&Schema!B21&Schema!C21&Schema!D21","v":"BRONNM"},"AL",{"$f":"IF(A8=\"\",\"\",IF(LEN(Schema!A21)=2,1,IF(LEN(Schema!B21)=2,10,IF(LEN(Schema!C21)=2,100,0))))","v":0},1,{"$f":"IF(A8=\"\",\"\",SUM(Tabel2[[#This Row],[I1]:[I2]]))","v":1},"AL","","","AL",{"$f":"IF(C8=\"\",\"\",IF(LEN(Tabel2[[#This Row],[Entiteit of attribuut]])=2,\"\",Tabel2[[#This Row],[Entiteit]]&\"_\"&Tabel2[[#This Row],[Entiteit of attribuut]]))","v":"AL_BRONNM"},{"$f":"IF(Schema!I21=\"\",\"\",Schema!I21)","v":""},{"$f":"IF(Schema!J21=\"\",\"\",Schema!J21)","v":""},{"$f":"IF(Schema!K21=\"\",\"\",Schema!K21)","v":""},{"$f":"IF(Schema!L21=\"\",\"\",Schema!L21)","v":""},{"$f":"IF(Schema!N21=\"\",\"\",Schema!N21)","v":"LEEG"}]
[{"$f":"Schema!A22&Schema!B22&Schema!C22&Schema!D22","v":"CPREF"},"AL",{"$f":"IF(A9=\"\",\"\",IF(LEN(Schema!A22)=2,1,IF(LEN(Schema!B22)=2,10,IF(LEN(Schema!C22)=2,100,0))))","v":0},1,{"$f":"IF(A9=\"\",\"\",SUM(Tabel2[[#This Row],[I1]:[I2]]))","v":1},"AL","","","AL",{"$f":"IF(C9=\"\",\"\",IF(LEN(Tabel2[[#This Row],[Entiteit of attribuut]])=2,\"\",Tabel2[[#This Row],[Entiteit]]&\"_\"&Tabel2[[#This Row],[Entiteit of attribuut]]))","v":"AL_CPREF"},{"$f":"IF(Schema!I22=\"\",\"\",Schema!I22)","v":""},{"$f":"IF(Schema!J22=\"\",\"\",Schema!J22)","v":""},{"$f":"IF(Schema!K22=\"\",\"\",Schema!K22)","v":""},{"$f":"IF(Schema!L22=\"\",\"\",Schema!L22)","v":""},{"$f":"IF(Schema!N22=\"\",\"\",Schema!N22)","v":"V"}]
[{"$f":"Schema!A23&Schema!B23&Schema!C23&Schema!D23","v":"DATACAT"},"AL",{"$f":"IF(A10=\"\",\"\",IF(LEN(Schema!A23)=2,1,IF(LEN(Schema!B23)=2,10,IF(LEN(Schema!C23)=2,100,0))))","v":0},1,{"$f":"IF(A10=\"\",\"\",SUM(Tabel2[[#This Row],[I1]:[I2]]))","v":1},"AL","","","AL",{"$f":"IF(C10=\"\",\"\",IF(LEN(Tabel2[[#This Row],[Entiteit of attribuut]])=2,\"\",Tabel2[[#This Row],[Entiteit]]&\"_\"&Tabel2[[#This Row],[Entiteit of attribuut]]))","v":"AL_DATACAT"},{"$f":"IF(Schema!I23=\"\",\"\",Schema!I23)","v":""},{"$f":"IF(Schema!J23=\"\",\"\",Schema!J23)","v":""},{"$f":"IF(Schema!K23=\"\",\"\",Schema!K23)","v":""},{"$f":"IF(Schema!L23=\"\",\"\",Schema!L23)","v":""},{"$f":"IF(Schema!N23=\"\",\"\",Schema!N23)","v":"LEEG"}]
[{"$f":"Schema!A24&Schema!B24&Schema!C24&Schema!D24","v":"FUNCTIE"},"AL",{"$f":"IF(A11=\"\",\"\",IF(LEN(Schema!A24)=2,1,IF(LEN(Schema!B24)=2,10,IF(LEN(Schema!C24)=2,100,0))))","v":0},1,{"$f":"IF(A11=\"\",\"\",SUM(Tabel2[[#This Row],[I1]:[I2]]))","v":1},"AL","","","AL",{"$f":"IF(C11=\"\",\"\",IF(LEN(Tabel2[[#This Row],[Entiteit of attribuut]])=2,\"\",Tabel2[[#This Row],[Entiteit]]&\"_\"&Tabel2[[#This Row],[Entiteit of attribuut]]))","v":"AL_FUNCTIE"},{"$f":"IF(Schema!I24=\"\",\"\",Schema!I24)","v":""},{"$f":"IF(Schema!J24=\"\",\"\",Schema!J24)","v":""},{"$f":"IF(Schema!K24=\"\",\"\",Schema!K24)","v":""},{"$f":"IF(Schema!L24=\"\",\"\",Schema!L24)","v":""},{"$f":"IF(Schema!N24=\"\",\"\",Schema!N24)","v":"LEEG"}]
[{"$f":"Schema!A25&Schema!B25&Schema!C25&Schema!D25","v":"INCLGP"},"AL",{"$f":"IF(A12=\"\",\"\",IF(LEN(Schema!A25)=2,1,IF(LEN(Schema!B25)=2,10,IF(LEN(Schema!C25)=2,100,0))))","v":0},1,{"$f":"IF(A12=\"\",\"\",SUM(Tabel2[[#This Row],[I1]:[I2]]))","v":1},"AL","","","AL",{"$f":"IF(C12=\"\",\"\",IF(LEN(Tabel2[[#This Row],[Entiteit of attribuut]])=2,\"\",Tabel2[[#This Row],[Entiteit]]&\"_\"&Tabel2[[#This Row],[Entiteit of attribuut]]))","v":"AL_INCLGP"},{"$f":"IF(Schema!I25=\"\",\"\",Schema!I25)","v":""},{"$f":"IF(Schema!J25=\"\",\"\",Schema!J25)","v":""},{"$f":"IF(Schema!K25=\"\",\"\",Schema!K25)","v":""},{"$f":"IF(Schema!L25=\"\",\"\",Schema!L25)","v":""},{"$f":"IF(Schema!N25=\"\",\"\",Schema!N25)","v":"V"}]
[{"$f":"Schema!A26&Schema!B26&Schema!C26&Schema!D26","v":"INCLOP"},"AL",{"$f":"IF(A13=\"\",\"\",IF(LEN(Schema!A26)=2,1,IF(LEN(Schema!B26)=2,10,IF(LEN(Schema!C26)=2,100,0))))","v":0},1,{"$f":"IF(A13=\"\",\"\",SUM(Tabel2[[#This Row],[I1]:[I2]]))","v":1},"AL","","","AL",{"$f":"IF(C13=\"\",\"\",IF(LEN(Tabel2[[#This Row],[Entiteit of attribuut]])=2,\"\",Tabel2[[#This Row],[Entiteit]]&\"_\"&Tabel2[[#This Row],[Entiteit of attribuut]]))","v":"AL_INCLOP"},{"$f":"IF(Schema!I26=\"\",\"\",Schema!I26)","v":""},{"$f":"IF(Schema!J26=\"\",\"\",Schema!J26)","v":""},{"$f":"IF(Schema!K26=\"\",\"\",Schema!K26)","v":""},{"$f":"IF(Schema!L26=\"\",\"\",Schema!L26)","v":""},{"$f":"IF(Schema!N26=\"\",\"\",Schema!N26)","v":"V"}]
[{"$f":"Schema!A27&Schema!B27&Schema!C27&Schema!D27","v":"INCLPP"},"AL",{"$f":"IF(A14=\"\",\"\",IF(LEN(Schema!A27)=2,1,IF(LEN(Schema!B27)=2,10,IF(LEN(Schema!C27)=2,100,0))))","v":0},1,{"$f":"IF(A14=\"\",\"\",SUM(Tabel2[[#This Row],[I1]:[I2]]))","v":1},"AL","","","AL",{"$f":"IF(C14=\"\",\"\",IF(LEN(Tabel2[[#This Row],[Entiteit of attribuut]])=2,\"\",Tabel2[[#This Row],[Entiteit]]&\"_\"&Tabel2[[#This Row],[Entiteit of attribuut]]))","v":"AL_INCLPP"},{"$f":"IF(Schema!I27=\"\",\"\",Schema!I27)","v":""},{"$f":"IF(Schema!J27=\"\",\"\",Schema!J27)","v":""},{"$f":"IF(Schema!K27=\"\",\"\",Schema!K27)","v":""},{"$f":"IF(Schema!L27=\"\",\"\",Schema!L27)","v":""},{"$f":"IF(Schema!N27=\"\",\"\",Schema!N27)","v":"V"}]
[{"$f":"Schema!A28&Schema!B28&Schema!C28&Schema!D28","v":"MNDGP"},"AL",{"$f":"IF(A15=\"\",\"\",IF(LEN(Schema!A28)=2,1,IF(LEN(Schema!B28)=2,10,IF(LEN(Schema!C28)=2,100,0))))","v":0},1,{"$f":"IF(A15=\"\",\"\",SUM(Tabel2[[#This Row],[I1]:[I2]]))","v":1},"AL","","","AL",{"$f":"IF(C15=\"\",\"\",IF(LEN(Tabel2[[#This Row],[Entiteit of attribuut]])=2,\"\",Tabel2[[#This Row],[Entiteit]]&\"_\"&Tabel2[[#This Row],[Entiteit of attribuut]]))","v":"AL_MNDGP"},{"$f":"IF(Schema!I28=\"\",\"\",Schema!I28)","v":""},{"$f":"IF(Schema!J28=\"\",\"\",Schema!J28)","v":""},{"$f":"IF(Schema!K28=\"\",\"\",Schema!K28)","v":""},{"$f":"IF(Schema!L28=\"\",\"\",Schema!L28)","v":""},{"$f":"IF(Schema!N28=\"\",\"\",Schema!N28)","v":"O"}]
[{"$f":"Schema!A29&Schema!B29&Schema!C29&Schema!D29","v":"VERSIEV"},"AL",{"$f":"IF(A16=\"\",\"\",IF(LEN(Schema!A29)=2,1,IF(LEN(Schema!B29)=2,10,IF(LEN(Schema!C29)=2,100,0))))","v":0},1,{"$f":"IF(A16=\"\",\"\",SUM(Tabel2[[#This Row],[I1]:[I2]]))","v":1},"AL","","","AL",{"$f":"IF(C16=\"\",\"\",IF(LEN(Tabel2[[#This Row],[Entiteit of attribuut]])=2,\"\",Tabel2[[#This Row],[Entiteit]]&\"_\"&Tabel2[[#This Row],[Entiteit of attribuut]]))","v":"AL_VERSIEV"},{"$f":"IF(Schema!I29=\"\",\"\",Schema!I29)","v":""},{"$f":"IF(Schema!J29=\"\",\"\",Schema!J29)","v":""},{"$f":"IF(Schema!K29=\"\",\"\",Schema!K29)","v":""},{"$f":"IF(Schema!L29=\"\",\"\",Schema!L29)","v":""},{"$f":"IF(Schema!N29=\"\",\"\",Schema!N29)","v":"V"}]
[{"$f":"Schema!A30&Schema!B30&Schema!C30&Schema!D30","v":"VIEWCOD"},"AL",{"$f":"IF(A17=\"\",\"\",IF(LEN(Schema!A30)=2,1,IF(LEN(Schema!B30)=2,10,IF(LEN(Schema!C30)=2,100,0))))","v":0},1,{"$f":"IF(A17=\"\",\"\",SUM(Tabel2[[#This Row],[I1]:[I2]]))","v":1},"AL","","","AL",{"$f":"IF(C17=\"\",\"\",IF(LEN(Tabel2[[#This Row],[Entiteit of attribuut]])=2,\"\",Tabel2[[#This Row],[Entiteit]]&\"_\"&Tabel2[[#This Row],[Entiteit of attribuut]]))","v":"AL_VIEWCOD"},{"$f":"IF(Schema!I30=\"\",\"\",Schema!I30)","v":""},{"$f":"IF(Schema!J30=\"\",\"\",Schema!J30)","v":""},{"$f":"IF(Schema!K30=\"\",\"\",Schema!K30)","v":""},{"$f":"IF(Schema!L30=\"\",\"\",Schema!L30)","v":""},{"$f":"IF(Schema!N30=\"\",\"\",Schema!N30)","v":"LEEG"}]
[{"$f":"Schema!A31&Schema!B31&Schema!C31&Schema!D31","v":"VRWRKCD"},"AL",{"$f":"IF(A18=\"\",\"\",IF(LEN(Schema!A31)=2,1,IF(LEN(Schema!B31)=2,10,IF(LEN(Schema!C31)=2,100,0))))","v":0},1,{"$f":"IF(A18=\"\",\"\",SUM(Tabel2[[#This Row],[I1]:[I2]]))","v":1},"AL","","","AL",{"$f":"IF(C18=\"\",\"\",IF(LEN(Tabel2[[#This Row],[Entiteit of attribuut]])=2,\"\",Tabel2[[#This Row],[Entiteit]]&\"_\"&Tabel2[[#This Row],[Entiteit of attribuut]]))","v":"AL_VRWRKCD"},{"$f":"IF(Schema!I31=\"\",\"\",Schema!I31)","v":""},{"$f":"IF(Schema!J31=\"\",\"\",Schema!J31)","v":""},{"$f":"IF(Schema!K31=\"\",\"\",Schema!K31)","v":""},{"$f":"IF(Schema!L31=\"\",\"\",Schema!L31)","v":""},{"$f":"IF(Schema!N31=\"\",\"\",Schema!N31)","v":"LEEG"}]
[{"$f":"Schema!A32&Schema!B32&Schema!C32&Schema!D32","v":"EL"},"EL",{"$f":"IF(A19=\"\",\"\",IF(LEN(Schema!A32)=2,1,IF(LEN(Schema!B32)=2,10,IF(LEN(Schema!C32)=2,100,0))))","v":1},1,{"$f":"IF(A19=\"\",\"\",SUM(Tabel2[[#This Row],[I1]:[I2]]))","v":2},"EL","","","EL",{"$f":"IF(C19=\"\",\"\",IF(LEN(Tabel2[[#This Row],[Entiteit of attribuut]])=2,\"\",Tabel2[[#This Row],[Entiteit]]&\"_\"&Tabel2[[#This Row],[Entiteit of attribuut]]))","v":""},{"$f":"IF(Schema!I32=\"\",\"\",Schema!I32)","v":""},{"$f":"IF(Schema!J32=\"\",\"\",Schema!J32)","v":""},{"$f":"IF(Schema!K32=\"\",\"\",Schema!K32)","v":""},{"$f":"IF(Schema!L32=\"\",\"\",Schema!L32)","v":""},{"$f":"IF(Schema!N32=\"\",\"\",Schema!N32)","v":"LEEG"}]
[{"$f":"Schema!A33&Schema!B33&Schema!C33&Schema!D33","v":"VOLGNUM"},"EL",{"$f":"IF(A20=\"\",\"\",IF(LEN(Schema!A33)=2,1,IF(LEN(Schema!B33)=2,10,IF(LEN(Schema!C33)=2,100,0))))","v":0},1,{"$f":"IF(A20=\"\",\"\",SUM(Tabel2[[#This Row],[I1]:[I2]]))","v":1},"EL","","","EL",{"$f":"IF(C20=\"\",\"\",IF(LEN(Tabel2[[#This Row],[Entiteit of attribuut]])=2,\"\",Tabel2[[#This Row],[Entiteit]]&\"_\"&Tabel2[[#This Row],[Entiteit of attribuut]]))","v":"EL_VOLGNUM"},{"$f":"IF(Schema!I33=\"\",\"\",Schema!I33)","v":""},{"$f":"IF(Schema!J33=\"\",\"\",Schema!J33)","v":""},{"$f":"IF(Schema!K33=\"\",\"\",Schema!K33)","v":""},{"$f":"IF(Schema!L33=\"\",\"\",Schema!L33)","v":""},{"$f":"IF(Schema!N33=\"\",\"\",Schema!N33)","v":"LEEG"}]
[{"$f":"Schema!A34&Schema!B34&Schema!C34&Schema!D34","v":"VRWRKCD"},"EL",{"$f":"IF(A21=\"\",\"\",IF(LEN(Schema!A34)=2,1,IF(LEN(Schema!B34)=2,10,IF(LEN(Schema!C34)=2,100,0))))","v":0},1,{"$f":"IF(A21=\"\",\"\",SUM(Tabel2[[#This Row],[I1]:[I2]]))","v":1},"EL","","","EL",{"$f":"IF(C21=\"\",\"\",IF(LEN(Tabel2[[#This Row],[Entiteit of attribuut]])=2,\"\",Tabel2[[#This Row],[Entiteit]]&\"_\"&Tabel2[[#This Row],[Entiteit of attribuut]]))","v":"EL_VRWRKCD"},{"$f":"IF(Schema!I34=\"\",\"\",Schema!I34)","v":""},{"$f":"IF(Schema!J34=\"\",\"\",Schema!J34)","v":""},{"$f":"IF(Schema!K34=\"\",\"\",Schema!K34)","v":""},{"$f":"IF(Schema!L34=\"\",\"\",Schema!L34)","v":""},{"$f":"IF(Schema!N34=\"\",\"\",Schema!N34)","v":"LEEG"}]
[{"$f":"Schema!A35&Schema!B35&Schema!C35&Schema!D35","v":"PK"},"PK",{"$f":"IF(A22=\"\",\"\",IF(LEN(Schema!A35)=2,1,IF(LEN(Schema!B35)=2,10,IF(LEN(Schema!C35)=2,100,0))))","v":1},1,{"$f":"IF(A22=\"\",\"\",SUM(Tabel2[[#This Row],[I1]:[I2]]))","v":2},"PK","","","PK",{"$f":"IF(C22=\"\",\"\",IF(LEN(Tabel2[[#This Row],[Entiteit of attribuut]])=2,\"\",Tabel2[[#This Row],[Entiteit]]&\"_\"&Tabel2[[#This Row],[Entiteit of attribuut]]))","v":""},{"$f":"IF(Schema!I35=\"\",\"\",Schema!I35)","v":""},{"$f":"IF(Schema!J35=\"\",\"\",Schema!J35)","v":""},{"$f":"IF(Schema!K35=\"\",\"\",Schema!K35)","v":""},{"$f":"IF(Schema!L35=\"\",\"\",Schema!L35)","v":""},{"$f":"IF(Schema!N35=\"\",\"\",Schema!N35)","v":"O"}]
[{"$f":"Schema!A36&Schema!B36&Schema!C36&Schema!D36","v":"NUMMER"},"PK",{"$f":"IF(A23=\"\",\"\",IF(LEN(Schema!A36)=2,1,IF(LEN(Schema!B36)=2,10,IF(LEN(Schema!C36)=2,100,0))))","v":0},1,{"$f":"IF(A23=\"\",\"\",SUM(Tabel2[[#This Row],[I1]:[I2]]))","v":1},"PK","","","PK",{"$f":"IF(C23=\"\",\"\",IF(LEN(Tabel2[[#This Row],[Entiteit of attribuut]])=2,\"\",Tabel2[[#This Row],[Entiteit]]&\"_\"&Tabel2[[#This Row],[Entiteit of attribuut]]))","v":"PK_NUMMER"},{"$f":"IF(Schema!I36=\"\",\"\",Schema!I36)","v":""},{"$f":"IF(Schema!J36=\"\",\"\",Schema!J36)","v":""},{"$f":"IF(Schema!K36=\"\",\"\",Schema!K36)","v":""},{"$f":"IF(Schema!L36=\"\",\"\",Schema!L36)","v":""},{"$f":"IF(Schema!N36=\"\",\"\",Schema!N36)","v":"V"}]
[{"$f":"Schema!A37&Schema!B37&Schema!C37&Schema!D37","v":"VRWRKCD"},"PK",{"$f":"IF(A24=\"\",\"\",IF(LEN(Schema!A37)=2,1,IF(LEN(Schema!B37)=2,10,IF(LEN(Schema!C37)=2,100,0))))","v":0},1,{"$f":"IF(A24=\"\",\"\",SUM(Tabel2[[#This Row],[I1]:[I2]]))","v":1},"PK","","","PK",{"$f":"IF(C24=\"\",\"\",IF(LEN(Tabel2[[#This Row],[Entiteit of attribuut]])=2,\"\",Tabel2[[#This Row],[Entiteit]]&\"_\"&Tabel2[[#This Row],[Entiteit of attribuut]]))","v":"PK_VRWRKCD"},{"$f":"IF(Schema!I37=\"\",\"\",Schema!I37)","v":""},{"$f":"IF(Schema!J37=\"\",\"\",Schema!J37)","v":""},{"$f":"IF(Schema!K37=\"\",\"\",Schema!K37)","v":""},{"$f":"IF(Schema!L37=\"\",\"\",Schema!L37)","v":""},{"$f":"IF(Schema!N37=\"\",\"\",Schema!N37)","v":"LEEG"}]
[{"$f":"Schema!A38&Schema!B38&Schema!C38&Schema!D38","v":"RC"},"RC",{"$f":"IF(A25=\"\",\"\",IF(LEN(Schema!A38)=2,1,IF(LEN(Schema!B38)=2,10,IF(LEN(Schema!C38)=2,100,0))))","v":1},1,{"$f":"IF(A25=\"\",\"\",SUM(Tabel2[[#This Row],[I1]:[I2]]))","v":2},"RC","","","RC",{"$f":"IF(C25=\"\",\"\",IF(LEN(Tabel2[[#This Row],[Entiteit of attribuut]])=2,\"\",Tabel2[[#This Row],[Entiteit]]&\"_\"&Tabel2[[#This Row],[Entiteit of attribuut]]))","v":""},{"$f":"IF(Schema!I38=\"\",\"\",Schema!I38)","v":""},{"$f":"IF(Schema!J38=\"\",\"\",Schema!J38)","v":""},{"$f":"IF(Schema!K38=\"\",\"\",Schema!K38)","v":""},{"$f":"IF(Schema!L38=\"\",\"\",Schema!L38)","v":""},{"$f":"IF(Schema!N38=\"\",\"\",Schema!N38)","v":"O"}]
[{"$f":"Schema!A39&Schema!B39&Schema!C39&Schema!D39","v":"NUMMER"},"RC",{"$f":"IF(A26=\"\",\"\",IF(LEN(Schema!A39)=2,1,IF(LEN(Schema!B39)=2,10,IF(LEN(Schema!C39)=2,100,0))))","v":0},1,{"$f":"IF(A26=\"\",\"\",SUM(Tabel2[[#This Row],[I1]:[I2]]))","v":1},"RC","","","RC",{"$f":"IF(C26=\"\",\"\",IF(LEN(Tabel2[[#This Row],[Entiteit of attribuut]])=2,\"\",Tabel2[[#This Row],[Entiteit]]&\"_\"&Tabel2[[#This Row],[Entiteit of attribuut]]))","v":"RC_NUMMER"},{"$f":"IF(Schema!I39=\"\",\"\",Schema!I39)","v":""},{"$f":"IF(Schema!J39=\"\",\"\",Schema!J39)","v":""},{"$f":"IF(Schema!K39=\"\",\"\",Schema!K39)","v":""},{"$f":"IF(Schema!L39=\"\",\"\",Schema!L39)","v":""},{"$f":"IF(Schema!N39=\"\",\"\",Schema!N39)","v":"V"}]
[{"$f":"Schema!A40&Schema!B40&Schema!C40&Schema!D40","v":"PP"},"PP",{"$f":"IF(A27=\"\",\"\",IF(LEN(Schema!A40)=2,1,IF(LEN(Schema!B40)=2,10,IF(LEN(Schema!C40)=2,100,0))))","v":1},1,{"$f":"IF(A27=\"\",\"\",SUM(Tabel2[[#This Row],[I1]:[I2]]))","v":2},"PP","","","PP",{"$f":"IF(C27=\"\",\"\",IF(LEN(Tabel2[[#This Row],[Entiteit of attribuut]])=2,\"\",Tabel2[[#This Row],[Entiteit]]&\"_\"&Tabel2[[#This Row],[Entiteit of attribuut]]))","v":""},{"$f":"IF(Schema!I40=\"\",\"\",Schema!I40)","v":""},{"$f":"IF(Schema!J40=\"\",\"\",Schema!J40)","v":""},{"$f":"IF(Schema!K40=\"\",\"\",Schema!K40)","v":""},{"$f":"IF(Schema!L40=\"\",\"\",Schema!L40)","v":""},{"$f":"IF(Schema!N40=\"\",\"\",Schema!N40)","v":"V"}]
[{"$f":"Schema!A41&Schema!B41&Schema!C41&Schema!D41","v":"ADEFVRS"},"PP",{"$f":"IF(A28=\"\",\"\",IF(LEN(Schema!A41)=2,1,IF(LEN(Schema!B41)=2,10,IF(LEN(Schema!C41)=2,100,0))))","v":0},1,{"$f":"IF(A28=\"\",\"\",SUM(Tabel2[[#This Row],[I1]:[I2]]))","v":1},"PP","","","PP",{"$f":"IF(C28=\"\",\"\",IF(LEN(Tabel2[[#This Row],[Entiteit of attribuut]])=2,\"\",Tabel2[[#This Row],[Entiteit]]&\"_\"&Tabel2[[#This Row],[Entiteit of attribuut]]))","v":"PP_ADEFVRS"},{"$f":"IF(Schema!I41=\"\",\"\",Schema!I41)","v":""},{"$f":"IF(Schema!J41=\"\",\"\",Schema!J41)","v":""},{"$f":"IF(Schema!K41=\"\",\"\",Schema!K41)","v":""},{"$f":"IF(Schema!L41=\"\",\"\",Schema!L41)","v":""},{"$f":"IF(Schema!N41=\"\",\"\",Schema!N41)","v":"V"}]
[{"$f":"Schema!A42&Schema!B42&Schema!C42&Schema!D42","v":"AFDDEFN"},"PP",{"$f":"IF(A29=\"\",\"\",IF(LEN(Schema!A42)=2,1,IF(LEN(Schema!B42)=2,10,IF(LEN(Schema!C42)=2,100,0))))","v":0},1,{"$f":"IF(A29=\"\",\"\",SUM(Tabel2[[#This Row],[I1]:[I2]]))","v":1},"PP","","","PP",{"$f":"IF(C29=\"\",\"\",IF(LEN(Tabel2[[#This Row],[Entiteit of attribuut]])=2,\"\",Tabel2[[#This Row],[Entiteit]]&\"_\"&Tabel2[[#This Row],[Entiteit of attribuut]]))","v":"PP_AFDDEFN"},{"$f":"IF(Schema!I42=\"\",\"\",Schema!I42)","v":""},{"$f":"IF(Schema!J42=\"\",\"\",Schema!J42)","v":""},{"$f":"IF(Schema!K42=\"\",\"\",Schema!K42)","v":""},{"$f":"IF(Schema!L42=\"\",\"\",Schema!L42)","v":""},{"$f":"IF(Schema!N42=\"\",\"\",Schema!N42)","v":"V"}]
[{"$f":"Schema!A43&Schema!B43&Schema!C43&Schema!D43","v":"BETTERM"},"PP",{"$f":"IF(A30=\"\",\"\",IF(LEN(Schema!A43)=2,1,IF(LEN(Schema!B43)=2,10,IF(LEN(Schema!C43)=2,100,0))))","v":0},1,{"$f":"IF(A30=\"\",\"\",SUM(Tabel2[[#This Row],[I1]:[I2]]))","v":1},"PP","","","PP",{"$f":"IF(C30=\"\",\"\",IF(LEN(Tabel2[[#This Row],[Entiteit of attribuut]])=2,\"\",Tabel2[[#This Row],[Entiteit]]&\"_\"&Tabel2[[#This Row],[Entiteit of attribuut]]))","v":"PP_BETTERM"},{"$f":"IF(Schema!I43=\"\",\"\",Schema!I43)","v":""},{"$f":"IF(Schema!J43=\"\",\"\",Schema!J43)","v":""},{"$f":"IF(Schema!K43=\"\",\"\",Schema!K43)","v":""},{"$f":"IF(Schema!L43=\"\",\"\",Schema!L43)","v":""},{"$f":"IF(Schema!N43=\"\",\"\",Schema!N43)","v":"O"}]
[{"$f":"Schema!A44&Schema!B44&Schema!C44&Schema!D44","v":"BRANCHE"},"PP",{"$f":"IF(A31=\"\",\"\",IF(LEN(Schema!A44)=2,1,IF(LEN(Schema!B44)=2,10,IF(LEN(Schema!C44)=2,100,0))))","v":0},1,{"$f":"IF(A31=\"\",\"\",SUM(Tabel2[[#This Row],[I1]:[I2]]))","v":1},"PP","","","PP",{"$f":"IF(C31=\"\",\"\",IF(LEN(Tabel2[[#This Row],[Entiteit of attribuut]])=2,\"\",Tabel2[[#This Row],[Entiteit]]&\"_\"&Tabel2[[#This Row],[Entiteit of attribuut]]))","v":"PP_BRANCHE"},{"$f":"IF(Schema!I44=\"\",\"\",Schema!I44)","v":""},{"$f":"IF(Schema!J44=\"\",\"\",Schema!J44)","v":""},{"$f":"IF(Schema!K44=\"\",\"\",Schema!K44)","v":""},{"$f":"IF(Schema!L44=\"\",\"\",Schema!L44)","v":""},{"$f":"IF(Schema!N44=\"\",\"\",Schema!N44)","v":"V"}]
[{"$f":"Schema!A45&Schema!B45&Schema!C45&Schema!D45","v":"BTP"},"PP",{"$f":"IF(A32=\"\",\"\",IF(LEN(Schema!A45)=2,1,IF(LEN(Schema!B45)=2,10,IF(LEN(Schema!C45)=2,100,0))))","v":0},1,{"$f":"IF(A32=\"\",\"\",SUM(Tabel2[[#This Row],[I1]:[I2]]))","v":1},"PP","","","PP",{"$f":"IF(C32=\"\",\"\",IF(LEN(Tabel2[[#This Row],[Entiteit of attribuut]])=2,\"\",Tabel2[[#This Row],[Entiteit]]&\"_\"&Tabel2[[#This Row],[Entiteit of attribuut]]))","v":"PP_BTP"},{"$f":"IF(Schema!I45=\"\",\"\",Schema!I45)","v":""},{"$f":"IF(Schema!J45=\"\",\"\",Schema!J45)","v":""},{"$f":"IF(Schema!K45=\"\",\"\",Schema!K45)","v":""},{"$f":"IF(Schema!L45=\"\",\"\",Schema!L45)","v":""},{"$f":"IF(Schema!N45=\"\",\"\",Schema!N45)","v":"LEEG"}]
[{"$f":"Schema!A46&Schema!B46&Schema!C46&Schema!D46","v":"CDUUMND"},"PP",{"$f":"IF(A33=\"\",\"\",IF(LEN(Schema!A46)=2,1,IF(LEN(Schema!B46)=2,10,IF(LEN(Schema!C46)=2,100,0))))","v":0},1,{"$f":"IF(A33=\"\",\"\",SUM(Tabel2[[#This Row],[I1]:[I2]]))","v":1},"PP","","","PP",{"$f":"IF(C33=\"\",\"\",IF(LEN(Tabel2[[#This Row],[Entiteit of attribuut]])=2,\"\",Tabel2[[#This Row],[Entiteit]]&\"_\"&Tabel2[[#This Row],[Entiteit of attribuut]]))","v":"PP_CDUUMND"},{"$f":"IF(Schema!I46=\"\",\"\",Schema!I46)","v":""},{"$f":"IF(Schema!J46=\"\",\"\",Schema!J46)","v":""},{"$f":"IF(Schema!K46=\"\",\"\",Schema!K46)","v":""},{"$f":"IF(Schema!L46=\"\",\"\",Schema!L46)","v":""},{"$f":"IF(Schema!N46=\"\",\"\",Schema!N46)","v":"O"}]
[{"$f":"Schema!A47&Schema!B47&Schema!C47&Schema!D47","v":"COASSJN"},"PP",{"$f":"IF(A34=\"\",\"\",IF(LEN(Schema!A47)=2,1,IF(LEN(Schema!B47)=2,10,IF(LEN(Schema!C47)=2,100,0))))","v":0},1,{"$f":"IF(A34=\"\",\"\",SUM(Tabel2[[#This Row],[I1]:[I2]]))","v":1},"PP","","","PP",{"$f":"IF(C34=\"\",\"\",IF(LEN(Tabel2[[#This Row],[Entiteit of attribuut]])=2,\"\",Tabel2[[#This Row],[Entiteit]]&\"_\"&Tabel2[[#This Row],[Entiteit of attribuut]]))","v":"PP_COASSJN"},{"$f":"IF(Schema!I47=\"\",\"\",Schema!I47)","v":""},{"$f":"IF(Schema!J47=\"\",\"\",Schema!J47)","v":""},{"$f":"IF(Schema!K47=\"\",\"\",Schema!K47)","v":""},{"$f":"IF(Schema!L47=\"\",\"\",Schema!L47)","v":""},{"$f":"IF(Schema!N47=\"\",\"\",Schema!N47)","v":"V"}]
[{"$f":"Schema!#REF!&Schema!#REF!&Schema!#REF!&Schema!#REF!","v":{"$error":"#REF!"}},{"$error":"#REF!"},{"$f":"IF(A35=\"\",\"\",IF(LEN(Schema!#REF!)=2,1,IF(LEN(Schema!#REF!)=2,10,IF(LEN(Schema!#REF!)=2,100,0))))","v":{"$error":"#REF!"}},{"$error":"#REF!"},{"$f":"IF(A35=\"\",\"\",SUM(Tabel2[[#This Row],[I1]:[I2]]))","v":{"$error":"#REF!"}},{"$error":"#REF!"},{"$error":"#REF!"},{"$error":"#REF!"},{"$error":"#REF!"},{"$f":"IF(C35=\"\",\"\",IF(LEN(Tabel2[[#This Row],[Entiteit of attribuut]])=2,\"\",Tabel2[[#This Row],[Entiteit]]&\"_\"&Tabel2[[#This Row],[Entiteit of attribuut]]))","v":{"$error":"#REF!"}},{"$f":"IF(Schema!#REF!=\"\",\"\",Schema!#REF!)","v":{"$error":"#REF!"}},{"$f":"IF(Schema!#REF!=\"\",\"\",Schema!#REF!)","v":{"$error":"#REF!"}},{"$f":"IF(Schema!#REF!=\"\",\"\",Schema!#REF!)","v":{"$error":"#REF!"}},{"$f":"IF(Schema!#REF!=\"\",\"\",Schema!#REF!)","v":{"$error":"#REF!"}},{"$f":"IF(Schema!#REF!=\"\",\"\",Schema!#REF!)","v":{"$error":"#REF!"}}]
[{"$f":"Schema!A48&Schema!B48&Schema!C48&Schema!D48","v":"ENDDATC"},{"$error":"#REF!"},{"$f":"IF(A36=\"\",\"\",IF(LEN(Schema!A48)=2,1,IF(LEN(Schema!B48)=2,10,IF(LEN(Schema!C48)=2,100,0))))","v":0},{"$error":"#REF!"},{"$f":"IF(A36=\"\",\"\",SUM(Tabel2[[#This Row],[I1]:[I2]]))","v":{"$error":"#REF!"}},{"$error":"#REF!"},{"$error":"#REF!"},{"$error":"#REF!"},{"$error":"#REF!"},{"$f":"IF(C36=\"\",\"\",IF(LEN(Tabel2[[#This Row],[Entiteit of attribuut]])=2,\"\",Tabel2[[#This Row],[Entiteit]]&\"_\"&Tabel2[[#This Row],[Entiteit of attribuut]]))","v":{"$error":"#REF!"}},{"$f":"IF(Schema!I48=\"\",\"\",Schema!I48)","v":""},{"$f":"IF(Schema!J48=\"\",\"\",Schema!J48)","v":""},{"$f":"IF(Schema!K48=\"\",\"\",Schema!K48)","v":""},{"$f":"IF(Schema!L48=\"\",\"\",Schema!L48)","v":""},{"$f":"IF(Schema!N48=\"\",\"\",Schema!N48)","v":"O"}]
[{"$f":"Schema!#REF!&Schema!#REF!&Schema!#REF!&Schema!#REF!","v":{"$error":"#REF!"}},{"$error":"#REF!"},{"$f":"IF(A37=\"\",\"\",IF(LEN(Schema!#REF!)=2,1,IF(LEN(Schema!#REF!)=2,10,IF(LEN(Schema!#REF!)=2,100,0))))","v":{"$error":"#REF!"}},{"$error":"#REF!"},{"$f":"IF(A37=\"\",\"\",SUM(Tabel2[[#This Row],[I1]:[I2]]))","v":{"$error":"#REF!"}},{"$error":"#REF!"},{"$error":"#REF!"},{"$error":"#REF!"},{"$error":"#REF!"},{"$f":"IF(C37=\"\",\"\",IF(LEN(Tabel2[[#This Row],[Entiteit of attribuut]])=2,\"\",Tabel2[[#This Row],[Entiteit]]&\"_\"&Tabel2[[#This Row],[Entiteit of attribuut]]))","v":{"$error":"#REF!"}},{"$f":"IF(Schema!#REF!=\"\",\"\",Schema!#REF!)","v":{"$error":"#REF!"}},{"$f":"IF(Schema!#REF!=\"\",\"\",Schema!#REF!)","v":{"$error":"#REF!"}},{"$f":"IF(Schema!#REF!=\"\",\"\",Schema!#REF!)","v":{"$error":"#REF!"}},{"$f":"IF(Schema!#REF!=\"\",\"\",Schema!#REF!)","v":{"$error":"#REF!"}},{"$f":"IF(Schema!#REF!=\"\",\"\",Schema!#REF!)","v":{"$error":"#REF!"}}]
[{"$f":"Schema!A49&Schema!B49&Schema!C49&Schema!D49","v":"EXTERN"},{"$error":"#REF!"},{"$f":"IF(A38=\"\",\"\",IF(LEN(Schema!A49)=2,1,IF(LEN(Schema!B49)=2,10,IF(LEN(Schema!C49)=2,100,0))))","v":0},{"$error":"#REF!"},{"$f":"IF(A38=\"\",\"\",SUM(Tabel2[[#This Row],[I1]:[I2]]))","v":{"$error":"#REF!"}},{"$error":"#REF!"},{"$error":"#REF!"},{"$error":"#REF!"},{"$error":"#REF!"},{"$f":"IF(C38=\"\",\"\",IF(LEN(Tabel2[[#This Row],[Entiteit of attribuut]])=2,\"\",Tabel2[[#This Row],[Entiteit]]&\"_\"&Tabel2[[#This Row],[Entiteit of attribuut]]))","v":{"$error":"#REF!"}},{"$f":"IF(Schema!I49=\"\",\"\",Schema!I49)","v":""},{"$f":"IF(Schema!J49=\"\",\"\",Schema!J49)","v":""},{"$f":"IF(Schema!K49=\"\",\"\",Schema!K49)","v":""},{"$f":"IF(Schema!L49=\"\",\"\",Schema!L49)","v":""},{"$f":"IF(Schema!N49=\"\",\"\",Schema!N49)","v":"LEEG"}]
[{"$f":"Schema!A50&Schema!B50&Schema!C50&Schema!D50","v":"FACTORS"},{"$error":"#REF!"},{"$f":"IF(A39=\"\",\"\",IF(LEN(Schema!A50)=2,1,IF(LEN(Schema!B50)=2,10,IF(LEN(Schema!C50)=2,100,0))))","v":0},{"$error":"#REF!"},{"$f":"IF(A39=\"\",\"\",SUM(Tabel2[[#This Row],[I1]:[I2]]))","v":{"$error":"#REF!"}},{"$error":"#REF!"},{"$error":"#REF!"},{"$error":"#REF!"},{"$error":"#REF!"},{"$f":"IF(C39=\"\",\"\",IF(LEN(Tabel2[[#This Row],[Entiteit of attribuut]])=2,\"\",Tabel2[[#This Row],[Entiteit]]&\"_\"&Tabel2[[#This Row],[Entiteit of attribuut]]))","v":{"$error":"#REF!"}},{"$f":"IF(Schema!I50=\"\",\"\",Schema!I50)","v":""},{"$f":"IF(Schema!J50=\"\",\"\",Schema!J50)","v":""},{"$f":"IF(Schema!K50=\"\",\"\",Schema!K50)","v":""},{"$f":"IF(Schema!L50=\"\",\"\",Schema!L50)","v":""},{"$f":"IF(Schema!N50=\"\",\"\",Schema!N50)","v":"LEEG"}]
[{"$f":"Schema!A51&Schema!B51&Schema!C51&Schema!D51","v":"GABRA"},{"$error":"#REF!"},{"$f":"IF(A40=\"\",\"\",IF(LEN(Schema!A51)=2,1,IF(LEN(Schema!B51)=2,10,IF(LEN(Schema!C51)=2,100,0))))","v":0},{"$error":"#REF!"},{"$f":"IF(A40=\"\",\"\",SUM(Tabel2[[#This Row],[I1]:[I2]]))","v":{"$error":"#REF!"}},{"$error":"#REF!"},{"$error":"#REF!"},{"$error":"#REF!"},{"$error":"#REF!"},{"$f":"IF(C40=\"\",\"\",IF(LEN(Tabel2[[#This Row],[Entiteit of attribuut]])=2,\"\",Tabel2[[#This Row],[Entiteit]]&\"_\"&Tabel2[[#This Row],[Entiteit of attribuut]]))","v":{"$error":"#REF!"}},{"$f":"IF(Schema!I51=\"\",\"\",Schema!I51)","v":""},{"$f":"IF(Schema!J51=\"\",\"\",Schema!J51)","v":""},{"$f":"IF(Schema!K51=\"\",\"\",Schema!K51)","v":""},{"$f":"IF(Schema!L51=\"\",\"\",Schema!L51)","v":""},{"$f":"IF(Schema!N51=\"\",\"\",Schema!N51)","v":"V"}]
[{"$f":"Schema!A52&Schema!B52&Schema!C52&Schema!D52","v":"GABRAO"},{"$error":"#REF!"},{"$f":"IF(A41=\"\",\"\",IF(LEN(Schema!A52)=2,1,IF(LEN(Schema!B52)=2,10,IF(LEN(Schema!C52)=2,100,0))))","v":0},{"$error":"#REF!"},{"$f":"IF(A41=\"\",\"\",SUM(Tabel2[[#This Row],[I1]:[I2]]))","v":{"$error":"#REF!"}},{"$error":"#REF!"},{"$error":"#REF!"},{"$error":"#REF!"},{"$error":"#REF!"},{"$f":"IF(C41=\"\",\"\",IF(LEN(Tabel2[[#This Row],[Entiteit of attribuut]])=2,\"\",Tabel2[[#This Row],[Entiteit]]&\"_\"&Tabel2[[#This Row],[Entiteit of attribuut]]))","v":{"$error":"#REF!"}},{"$f":"IF(Schema!I52=\"\",\"\",Schema!I52)","v":""},{"$f":"IF(Schema!J52=\"\",\"\",Schema!J52)","v":""},{"$f":"IF(Schema!K52=\"\",\"\",Schema!K52)","v":""},{"$f":"IF(Schema!L52=\"\",\"\",Schema!L52)","v":""},{"$f":"IF(Schema!N52=\"\",\"\",Schema!N52)","v":"V"}]
[{"$f":"Schema!A53&Schema!B53&Schema!C53&Schema!D53","v":"GASBRA"},{"$error":"#REF!"},{"$f":"IF(A42=\"\",\"\",IF(LEN(Schema!A53)=2,1,IF(LEN(Schema!B53)=2,10,IF(LEN(Schema!C53)=2,100,0))))","v":0},{"$error":"#REF!"},{"$f":"IF(A42=\"\",\"\",SUM(Tabel2[[#This Row],[I1]:[I2]]))","v":{"$error":"#REF!"}},{"$error":"#REF!"},{"$error":"#REF!"},{"$error":"#REF!"},{"$error":"#REF!"},{"$f":"IF(C42=\"\",\"\",IF(LEN(Tabel2[[#This Row],[Entiteit of attribuut]])=2,\"\",Tabel2[[#This Row],[Entiteit]]&\"_\"&Tabel2[[#This Row],[Entiteit of attribuut]]))","v":{"$error":"#REF!"}},{"$f":"IF(Schema!I53=\"\",\"\",Schema!I53)","v":""},{"$f":"IF(Schema!J53=\"\",\"\",Schema!J53)","v":""},{"$f":"IF(Schema!K53=\"\",\"\",Schema!K53)","v":""},{"$f":"IF(Schema!L53=\"\",\"\",Schema!L53)","v":""},{"$f":"IF(Schema!N53=\"\",\"\",Schema!N53)","v":"V"}]
[{"$f":"Schema!A54&Schema!B54&Schema!C54&Schema!D54","v":"GASBRAO"},{"$error":"#REF!"},{"$f":"IF(A43=\"\",\"\",IF(LEN(Schema!A54)=2,1,IF(LEN(Schema!B54)=2,10,IF(LEN(Schema!C54)=2,100,0))))","v":0},{"$error":"#REF!"},{"$f":"IF(A43=\"\",\"\",SUM(Tabel2[[#This Row],[I1]:[I2]]))","v":{"$error":"#REF!"}},{"$error":"#REF!"},{"$error":"#REF!"},{"$error":"#REF!"},{"$error":"#REF!"},{"$f":"IF(C43=\"\",\"\",IF(LEN(Tabel2[[#This Row],[Entiteit of attribuut]])=2,\"\",Tabel2[[#This Row],[Entiteit]]&\"_\"&Tabel2[[#This Row],[Entiteit of attribuut]]))","v":{"$error":"#REF!"}},{"$f":"IF(Schema!I54=\"\",\"\",Schema!I54)","v":""},{"$f":"IF(Schema!J54=\"\",\"\",Schema!J54)","v":""},{"$f":"IF(Schema!K54=\"\",\"\",Schema!K54)","v":""},{"$f":"IF(Schema!L54=\"\",\"\",Schema!L54)","v":""},{"$f":"IF(Schema!N54=\"\",\"\",Schema!N54)","v":"V"}]
[{"$f":"Schema!A55&Schema!B55&Schema!C55&Schema!D55","v":"HANDACC"},{"$error":"#REF!"},{"$f":"IF(A44=\"\",\"\",IF(LEN(Schema!A55)=2,1,IF(LEN(Schema!B55)=2,10,IF(LEN(Schema!C55)=2,100,0))))","v":0},{"$error":"#REF!"},{"$f":"IF(A44=\"\",\"\",SUM(Tabel2[[#This Row],[I1]:[I2]]))","v":{"$error":"#REF!"}},{"$error":"#REF!"},{"$error":"#REF!"},{"$error":"#REF!"},{"$error":"#REF!"},{"$f":"IF(C44=\"\",\"\",IF(LEN(Tabel2[[#This Row],[Entiteit of attribuut]])=2,\"\",Tabel2[[#This Row],[Entiteit]]&\"_\"&Tabel2[[#This Row],[Entiteit of attribuut]]))","v":{"$error":"#REF!"}},{"$f":"IF(Schema!I55=\"\",\"\",Schema!I55)","v":""},{"$f":"IF(Schema!J55=\"\",\"\",Schema!J55)","v":""},{"$f":"IF(Schema!K55=\"\",\"\",Schema!K55)","v":""},{"$f":"IF(Schema!L55=\"\",\"\",Schema!L55)","v":""},{"$f":"IF(Schema!N55=\"\",\"\",Schema!N55)","v":"LEEG"}]
[{"$f":"Schema!A56&Schema!B56&Schema!C56&Schema!D56","v":"HVVDAT"},{"$error":"#REF!"},{"$f":"IF(A45=\"\",\"\",IF(LEN(Schema!A56)=2,1,IF(LEN(Schema!B56)=2,10,IF(LEN(Schema!C56)=2,100,0))))","v":0},{"$error":"#REF!"},{"$f":"IF(A45=\"\",\"\",SUM(Tabel2[[#This Row],[I1]:[I2]]))","v":{"$error":"#REF!"}},{"$error":"#REF!"},{"$error":"#REF!"},{"$error":"#REF!"},{"$error":"#REF!"},{"$f":"IF(C45=\"\",\"\",IF(LEN(Tabel2[[#This Row],[Entiteit of attribuut]])=2,\"\",Tabel2[[#This Row],[Entiteit]]&\"_\"&Tabel2[[#This Row],[Entiteit of attribuut]]))","v":{"$error":"#REF!"}},{"$f":"IF(Schema!I56=\"\",\"\",Schema!I56)","v":""},{"$f":"IF(Schema!J56=\"\",\"\",Schema!J56)","v":""},{"$f":"IF(Schema!K56=\"\",\"\",Schema!K56)","v":""},{"$f":"IF(Schema!L56=\"\",\"\",Schema!L56)","v":""},{"$f":"IF(Schema!N56=\"\",\"\",Schema!N56)","v":"O"}]
[{"$f":"Schema!A57&Schema!B57&Schema!C57&Schema!D57","v":"INDEX"},{"$error":"#REF!"},{"$f":"IF(A46=\"\",\"\",IF(LEN(Schema!A57)=2,1,IF(LEN(Schema!B57)=2,10,IF(LEN(Schema!C57)=2,100,0))))","v":0},{"$error":"#REF!"},{"$f":"IF(A46=\"\",\"\",SUM(Tabel2[[#This Row],[I1]:[I2]]))","v":{"$error":"#REF!"}},{"$error":"#REF!"},{"$error":"#REF!"},{"$error":"#REF!"},{"$error":"#REF!"},{"$f":"IF(C46=\"\",\"\",IF(LEN(Tabel2[[#This Row],[Entiteit of attribuut]])=2,\"\",Tabel2[[#This Row],[Entiteit]]&\"_\"&Tabel2[[#This Row],[Entiteit of attribuut]]))","v":{"$error":"#REF!"}},{"$f":"IF(Schema!I57=\"\",\"\",Schema!I57)","v":""},{"$f":"IF(Schema!J57=\"\",\"\",Schema!J57)","v":""},{"$f":"IF(Schema!K57=\"\",\"\",Schema!K57)","v":""},{"$f":"IF(Schema!L57=\"\",\"\",Schema!L57)","v":""},{"$f":"IF(Schema!N57=\"\",\"\",Schema!N57)","v":"LEEG"}]
[{"$f":"Schema!A58&Schema!B58&Schema!C58&Schema!D58","v":"INGDAT"},{"$error":"#REF!"},{"$f":"IF(A47=\"\",\"\",IF(LEN(Schema!A58)=2,1,IF(LEN(Schema!B58)=2,10,IF(LEN(Schema!C58)=2,100,0))))","v":0},{"$error":"#REF!"},{"$f":"IF(A47=\"\",\"\",SUM(Tabel2[[#This Row],[I1]:[I2]]))","v":{"$error":"#REF!"}},{"$error":"#REF!"},{"$error":"#REF!"},{"$error":"#REF!"},{"$error":"#REF!"},{"$f":"IF(C47=\"\",\"\",IF(LEN(Tabel2[[#This Row],[Entiteit of attribuut]])=2,\"\",Tabel2[[#This Row],[Entiteit]]&\"_\"&Tabel2[[#This Row],[Entiteit of attribuut]]))","v":{"$error":"#REF!"}},{"$f":"IF(Schema!I58=\"\",\"\",Schema!I58)","v":""},{"$f":"IF(Schema!J58=\"\",\"\",Schema!J58)","v":""},{"$f":"IF(Schema!K58=\"\",\"\",Schema!K58)","v":""},{"$f":"IF(Schema!L58=\"\",\"\",Schema!L58)","v":""},{"$f":"IF(Schema!N58=\"\",\"\",Schema!N58)","v":"V"}]
[{"$f":"Schema!A59&Schema!B59&Schema!C59&Schema!D59","v":"INGDTW"},{"$error":"#REF!"},{"$f":"IF(A48=\"\",\"\",IF(LEN(Schema!A59)=2,1,IF(LEN(Schema!B59)=2,10,IF(LEN(Schema!C59)=2,100,0))))","v":0},{"$error":"#REF!"},{"$f":"IF(A48=\"\",\"\",SUM(Tabel2[[#This Row],[I1]:[I2]]))","v":{"$error":"#REF!"}},{"$error":"#REF!"},{"$error":"#REF!"},{"$error":"#REF!"},{"$error":"#REF!"},{"$f":"IF(C48=\"\",\"\",IF(LEN(Tabel2[[#This Row],[Entiteit of attribuut]])=2,\"\",Tabel2[[#This Row],[Entiteit]]&\"_\"&Tabel2[[#This Row],[Entiteit of attribuut]]))","v":{"$error":"#REF!"}},{"$f":"IF(Schema!I59=\"\",\"\",Schema!I59)","v":""},{"$f":"IF(Schema!J59=\"\",\"\",Schema!J59)","v":""},{"$f":"IF(Schema!K59=\"\",\"\",Schema!K59)","v":""},{"$f":"IF(Schema!L59=\"\",\"\",Schema!L59)","v":""},{"$f":"IF(Schema!N59=\"\",\"\",Schema!N59)","v":"LEEG"}]
[{"$f":"Schema!A60&Schema!B60&Schema!C60&Schema!D60","v":"INTKEY"},{"$error":"#REF!"},{"$f":"IF(A49=\"\",\"\",IF(LEN(Schema!A60)=2,1,IF(LEN(Schema!B60)=2,10,IF(LEN(Schema!C60)=2,100,0))))","v":0},{"$error":"#REF!"},{"$f":"IF(A49=\"\",\"\",SUM(Tabel2[[#This Row],[I1]:[I2]]))","v":{"$error":"#REF!"}},{"$error":"#REF!"},{"$error":"#REF!"},{"$error":"#REF!"},{"$error":"#REF!"},{"$f":"IF(C49=\"\",\"\",IF(LEN(Tabel2[[#This Row],[Entiteit of attribuut]])=2,\"\",Tabel2[[#This Row],[Entiteit]]&\"_\"&Tabel2[[#This Row],[Entiteit of attribuut]]))","v":{"$error":"#REF!"}},{"$f":"IF(Schema!I60=\"\",\"\",Schema!I60)","v":""},{"$f":"IF(Schema!J60=\"\",\"\",Schema!J60)","v":""},{"$f":"IF(Schema!K60=\"\",\"\",Schema!K60)","v":""},{"$f":"IF(Schema!L60=\"\",\"\",Schema!L60)","v":""},{"$f":"IF(Schema!N60=\"\",\"\",Schema!N60)","v":"O"}]
[{"$f":"Schema!#REF!&Schema!#REF!&Schema!#REF!&Schema!#REF!","v":{"$error":"#REF!"}},{"$error":"#REF!"},{"$f":"IF(A50=\"\",\"\",IF(LEN(Schema!#REF!)=2,1,IF(LEN(Schema!#REF!)=2,10,IF(LEN(Schema!#REF!)=2,100,0))))","v":{"$error":"#REF!"}},{"$error":"#REF!"},{"$f":"IF(A50=\"\",\"\",SUM(Tabel2[[#This Row],[I1]:[I2]]))","v":{"$error":"#REF!"}},{"$error":"#REF!"},{"$error":"#REF!"},{"$error":"#REF!"},{"$error":"#REF!"},{"$f":"IF(C50=\"\",\"\",IF(LEN(Tabel2[[#This Row],[Entiteit of attribuut]])=2,\"\",Tabel2[[#This Row],[Entiteit]]&\"_\"&Tabel2[[#This Row],[Entiteit of attribuut]]))","v":{"$error":"#REF!"}},{"$f":"IF(Schema!#REF!=\"\",\"\",Schema!#REF!)","v":{"$error":"#REF!"}},{"$f":"IF(Schema!#REF!=\"\",\"\",Schema!#REF!)","v":{"$error":"#REF!"}},{"$f":"IF(Schema!#REF!=\"\",\"\",Schema!#REF!)","v":{"$error":"#REF!"}},{"$f":"IF(Schema!#REF!=\"\",\"\",Schema!#REF!)","v":{"$error":"#REF!"}},{"$f":"IF(Schema!#REF!=\"\",\"\",Schema!#REF!)","v":{"$error":"#REF!"}}]
[{"$f":"Schema!A61&Schema!B61&Schema!C61&Schema!D61","v":"LWYZDAT"},{"$error":"#REF!"},{"$f":"IF(A51=\"\",\"\",IF(LEN(Schema!A61)=2,1,IF(LEN(Schema!B61)=2,10,IF(LEN(Schema!C61)=2,100,0))))","v":0},{"$error":"#REF!"},{"$f":"IF(A51=\"\",\"\",SUM(Tabel2[[#This Row],[I1]:[I2]]))","v":{"$error":"#REF!"}},{"$error":"#REF!"},{"$error":"#REF!"},{"$error":"#REF!"},{"$error":"#REF!"},{"$f":"IF(C51=\"\",\"\",IF(LEN(Tabel2[[#This Row],[Entiteit of attribuut]])=2,\"\",Tabel2[[#This Row],[Entiteit]]&\"_\"&Tabel2[[#This Row],[Entiteit of attribuut]]))","v":{"$error":"#REF!"}},{"$f":"IF(Schema!I61=\"\",\"\",Schema!I61)","v":""},{"$f":"IF(Schema!J61=\"\",\"\",Schema!J61)","v":""},{"$f":"IF(Schema!K61=\"\",\"\",Schema!K61)","v":""},{"$f":"IF(Schema!L61=\"\",\"\",Schema!L61)","v":""},{"$f":"IF(Schema!N61=\"\",\"\",Schema!N61)","v":"O"}]
[{"$f":"Schema!A62&Schema!B62&Schema!C62&Schema!D62","v":"MYAAND"},{"$error":"#REF!"},{"$f":"IF(A52=\"\",\"\",IF(LEN(Schema!A62)=2,1,IF(LEN(Schema!B62)=2,10,IF(LEN(Schema!C62)=2,100,0))))","v":0},{"$error":"#REF!"},{"$f":"IF(A52=\"\",\"\",SUM(Tabel2[[#This Row],[I1]:[I2]]))","v":{"$error":"#REF!"}},{"$error":"#REF!"},{"$error":"#REF!"},{"$error":"#REF!"},{"$error":"#REF!"},{"$f":"IF(C52=\"\",\"\",IF(LEN(Tabel2[[#This Row],[Entiteit of attribuut]])=2,\"\",Tabel2[[#This Row],[Entiteit]]&\"_\"&Tabel2[[#This Row],[Entiteit of attribuut]]))","v":{"$error":"#REF!"}},{"$f":"IF(Schema!I62=\"\",\"\",Schema!I62)","v":""},{"$f":"IF(Schema!J62=\"\",\"\",Schema!J62)","v":""},{"$f":"IF(Schema!K62=\"\",\"\",Schema!K62)","v":""},{"$f":"IF(Schema!L62=\"\",\"\",Schema!L62)","v":""},{"$f":"IF(Schema!N62=\"\",\"\",Schema!N62)","v":"V"}]
[{"$f":"Schema!A63&Schema!B63&Schema!C63&Schema!D63","v":"NJP"},{"$error":"#REF!"},{"$f":"IF(A53=\"\",\"\",IF(LEN(Schema!A63)=2,1,IF(LEN(Schema!B63)=2,10,IF(LEN(Schema!C63)=2,100,0))))","v":0},{"$error":"#REF!"},{"$f":"IF(A53=\"\",\"\",SUM(Tabel2[[#This Row],[I1]:[I2]]))","v":{"$error":"#REF!"}},{"$error":"#REF!"},{"$error":"#REF!"},{"$error":"#REF!"},{"$error":"#REF!"},{"$f":"IF(C53=\"\",\"\",IF(LEN(Tabel2[[#This Row],[Entiteit of attribuut]])=2,\"\",Tabel2[[#This Row],[Entiteit]]&\"_\"&Tabel2[[#This Row],[Entiteit of attribuut]]))","v":{"$error":"#REF!"}},{"$f":"IF(Schema!I63=\"\",\"\",Schema!I63)","v":""},{"$f":"IF(Schema!J63=\"\",\"\",Schema!J63)","v":""},{"$f":"IF(Schema!K63=\"\",\"\",Schema!K63)","v":""},{"$f":"IF(Schema!L63=\"\",\"\",Schema!L63)","v":""},{"$f":"IF(Schema!N63=\"\",\"\",Schema!N63)","v":"O"}]
[{"$f":"Schema!A64&Schema!B64&Schema!C64&Schema!D64","v":"NUMMER"},{"$error":"#REF!"},{"$f":"IF(A54=\"\",\"\",IF(LEN(Schema!A64)=2,1,IF(LEN(Schema!B64)=2,10,IF(LEN(Schema!C64)=2,100,0))))","v":0},{"$error":"#REF!"},{"$f":"IF(A54=\"\",\"\",SUM(Tabel2[[#This Row],[I1]:[I2]]))","v":{"$error":"#REF!"}},{"$error":"#REF!"},{"$error":"#REF!"},{"$error":"#REF!"},{"$error":"#REF!"},{"$f":"IF(C54=\"\",\"\",IF(LEN(Tabel2[[#This Row],[Entiteit of attribuut]])=2,\"\",Tabel2[[#This Row],[Entiteit]]&\"_\"&Tabel2[[#This Row],[Entiteit of attribuut]]))","v":{"$error":"#REF!"}},{"$f":"IF(Schema!I64=\"\",\"\",Schema!I64)","v":""},{"$f":"IF(Schema!J64=\"\",\"\",Schema!J64)","v":""},{"$f":"IF(Schema!K64=\"\",\"\",Schema!K64)","v":""},{"$f":"IF(Schema!L64=\"\",\"\",Schema!L64)","v":""},{"$f":"IF(Schema!N64=\"\",\"\",Schema!N64)","v":"V"}]
[{"$f":"Schema!A65&Schema!B65&Schema!C65&Schema!D65","v":"POLPKJN"},{"$error":"#REF!"},{"$f":"IF(A55=\"\",\"\",IF(LEN(Schema!A65)=2,1,IF(LEN(Schema!B65)=2,10,IF(LEN(Schema!C65)=2,100,0))))","v":0},{"$error":"#REF!"},{"$f":"IF(A55=\"\",\"\",SUM(Tabel2[[#This Row],[I1]:[I2]]))","v":{"$error":"#REF!"}},{"$error":"#REF!"},{"$error":"#REF!"},{"$error":"#REF!"},{"$error":"#REF!"},{"$f":"IF(C55=\"\",\"\",IF(LEN(Tabel2[[#This Row],[Entiteit of attribuut]])=2,\"\",Tabel2[[#This Row],[Entiteit]]&\"_\"&Tabel2[[#This Row],[Entiteit of attribuut]]))","v":{"$error":"#REF!"}},{"$f":"IF(Schema!I65=\"\",\"\",Schema!I65)","v":""},{"$f":"IF(Schema!J65=\"\",\"\",Schema!J65)","v":""},{"$f":"IF(Schema!K65=\"\",\"\",Schema!K65)","v":""},{"$f":"IF(Schema!L65=\"\",\"\",Schema!L65)","v":""},{"$f":"IF(Schema!N65=\"\",\"\",Schema!N65)","v":"V"}]
[{"$f":"Schema!#REF!&Schema!#REF!&Schema!#REF!&Schema!#REF!","v":{"$error":"#REF!"}},{"$error":"#REF!"},{"$f":"IF(A56=\"\",\"\",IF(LEN(Schema!#REF!)=2,1,IF(LEN(Schema!#REF!)=2,10,IF(LEN(Schema!#REF!)=2,100,0))))","v":{"$error":"#REF!"}},{"$error":"#REF!"},{"$f":"IF(A56=\"\",\"\",SUM(Tabel2[[#This Row],[I1]:[I2]]))","v":{"$error":"#REF!"}},{"$error":"#REF!"},{"$error":"#REF!"},{"$error":"#REF!"},{"$error":"#REF!"},{"$f":"IF(C56=\"\",\"\",IF(LEN(Tabel2[[#This Row],[Entiteit of attribuut]])=2,\"\",Tabel2[[#This Row],[Entiteit]]&\"_\"&Tabel2[[#This Row],[Entiteit of attribuut]]))","v":{"$error":"#REF!"}},{"$f":"IF(Schema!#REF!=\"\",\"\",Schema!#REF!)","v":{"$error":"#REF!"}},{"$f":"IF(Schema!#REF!=\"\",\"\",Schema!#REF!)","v":{"$error":"#REF!"}},{"$f":"IF(Schema!#REF!=\"\",\"\",Schema!#REF!)","v":{"$error":"#REF!"}},{"$f":"IF(Schema!#REF!=\"\",\"\",Schema!#REF!)","v":{"$error":"#REF!"}},{"$f":"IF(Schema!#REF!=\"\",\"\",Schema!#REF!)","v":{"$error":"#REF!"}}]
[{"$f":"Schema!#REF!&Schema!#REF!&Schema!#REF!&Schema!#REF!","v":{"$error":"#REF!"}},{"$error":"#REF!"},{"$f":"IF(A57=\"\",\"\",IF(LEN(Schema!#REF!)=2,1,IF(LEN(Schema!#REF!)=2,10,IF(LEN(Schema!#REF!)=2,100,0))))","v":{"$error":"#REF!"}},{"$error":"#REF!"},{"$f":"IF(A57=\"\",\"\",SUM(Tabel2[[#This Row],[I1]:[I2]]))","v":{"$error":"#REF!"}},{"$error":"#REF!"},{"$error":"#REF!"},{"$error":"#REF!"},{"$error":"#REF!"},{"$f":"IF(C57=\"\",\"\",IF(LEN(Tabel2[[#This Row],[Entiteit of attribuut]])=2,\"\",Tabel2[[#This Row],[Entiteit]]&\"_\"&Tabel2[[#This Row],[Entiteit of attribuut]]))","v":{"$error":"#REF!"}},{"$f":"IF(Schema!#REF!=\"\",\"\",Schema!#REF!)","v":{"$error":"#REF!"}},{"$f":"IF(Schema!#REF!=\"\",\"\",Schema!#REF!)","v":{"$error":"#REF!"}},{"$f":"IF(Schema!#REF!=\"\",\"\",Schema!#REF!)","v":{"$error":"#REF!"}},{"$f":"IF(Schema!#REF!=\"\",\"\",Schema!#REF!)","v":{"$error":"#REF!"}},{"$f":"IF(Schema!#REF!=\"\",\"\",Schema!#REF!)","v":{"$error":"#REF!"}}]
[{"$f":"Schema!A66&Schema!B66&Schema!C66&Schema!D66","v":"PRODUCT"},{"$error":"#REF!"},{"$f":"IF(A58=\"\",\"\",IF(LEN(Schema!A66)=2,1,IF(LEN(Schema!B66)=2,10,IF(LEN(Schema!C66)=2,100,0))))","v":0},{"$error":"#REF!"},{"$f":"IF(A58=\"\",\"\",SUM(Tabel2[[#This Row],[I1]:[I2]]))","v":{"$error":"#REF!"}},{"$error":"#REF!"},{"$error":"#REF!"},{"$error":"#REF!"},{"$error":"#REF!"},{"$f":"IF(C58=\"\",\"\",IF(LEN(Tabel2[[#This Row],[Entiteit of attribuut]])=2,\"\",Tabel2[[#This Row],[Entiteit]]&\"_\"&Tabel2[[#This Row],[Entiteit of attribuut]]))","v":{"$error":"#REF!"}},{"$f":"IF(Schema!I66=\"\",\"\",Schema!I66)","v":""},{"$f":"IF(Schema!J66=\"\",\"\",Schema!J66)","v":""},{"$f":"IF(Schema!K66=\"\",\"\",Schema!K66)","v":""},{"$f":"IF(Schema!L66=\"\",\"\",Schema!L66)","v":""},{"$f":"IF(Schema!N66=\"\",\"\",Schema!N66)","v":"LEEG"}]
[{"$f":"Schema!A67&Schema!B67&Schema!C67&Schema!D67","v":"PVADAT"},{"$error":"#REF!"},{"$f":"IF(A59=\"\",\"\",IF(LEN(Schema!A67)=2,1,IF(LEN(Schema!B67)=2,10,IF(LEN(Schema!C67)=2,100,0))))","v":0},{"$error":"#REF!"},{"$f":"IF(A59=\"\",\"\",SUM(Tabel2[[#This Row],[I1]:[I2]]))","v":{"$error":"#REF!"}},{"$error":"#REF!"},{"$error":"#REF!"},{"$error":"#REF!"},{"$error":"#REF!"},{"$f":"IF(C59=\"\",\"\",IF(LEN(Tabel2[[#This Row],[Entiteit of attribuut]])=2,\"\",Tabel2[[#This Row],[Entiteit]]&\"_\"&Tabel2[[#This Row],[Entiteit of attribuut]]))","v":{"$error":"#REF!"}},{"$f":"IF(Schema!I67=\"\",\"\",Schema!I67)","v":""},{"$f":"IF(Schema!J67=\"\",\"\",Schema!J67)","v":""},{"$f":"IF(Schema!K67=\"\",\"\",Schema!K67)","v":""},{"$f":"IF(Schema!L67=\"\",\"\",Schema!L67)","v":""},{"$f":"IF(Schema!N67=\"\",\"\",Schema!N67)","v":"LEEG"}]
[{"$f":"Schema!#REF!&Schema!#REF!&Schema!#REF!&Schema!#REF!","v":{"$error":"#REF!"}},{"$error":"#REF!"},{"$f":"IF(A60=\"\",\"\",IF(LEN(Schema!#REF!)=2,1,IF(LEN(Schema!#REF!)=2,10,IF(LEN(Schema!#REF!)=2,100,0))))","v":{"$error":"#REF!"}},{"$error":"#REF!"},{"$f":"IF(A60=\"\",\"\",SUM(Tabel2[[#This Row],[I1]:[I2]]))","v":{"$error":"#REF!"}},{"$error":"#REF!"},{"$error":"#REF!"},{"$error":"#REF!"},{"$error":"#REF!"},{"$f":"IF(C60=\"\",\"\",IF(LEN(Tabel2[[#This Row],[Entiteit of attribuut]])=2,\"\",Tabel2[[#This Row],[Entiteit]]&\"_\"&Tabel2[[#This Row],[Entiteit of attribuut]]))","v":{"$error":"#REF!"}},{"$f":"IF(Schema!#REF!=\"\",\"\",Schema!#REF!)","v":{"$error":"#REF!"}},{"$f":"IF(Schema!#REF!=\"\",\"\",Schema!#REF!)","v":{"$error":"#REF!"}},{"$f":"IF(Schema!#REF!=\"\",\"\",Schema!#REF!)","v":{"$error":"#REF!"}},{"$f":"IF(Schema!#REF!=\"\",\"\",Schema!#REF!)","v":{"$error":"#REF!"}},{"$f":"IF(Schema!#REF!=\"\",\"\",Schema!#REF!)","v":{"$error":"#REF!"}}]
[{"$f":"Schema!A68&Schema!B68&Schema!C68&Schema!D68","v":"SPECLIM"},{"$error":"#REF!"},{"$f":"IF(A61=\"\",\"\",IF(LEN(Schema!A68)=2,1,IF(LEN(Schema!B68)=2,10,IF(LEN(Schema!C68)=2,100,0))))","v":0},{"$error":"#REF!"},{"$f":"IF(A61=\"\",\"\",SUM(Tabel2[[#This Row],[I1]:[I2]]))","v":{"$error":"#REF!"}},{"$error":"#REF!"},{"$error":"#REF!"},{"$error":"#REF!"},{"$error":"#REF!"},{"$f":"IF(C61=\"\",\"\",IF(LEN(Tabel2[[#This Row],[Entiteit of attribuut]])=2,\"\",Tabel2[[#This Row],[Entiteit]]&\"_\"&Tabel2[[#This Row],[Entiteit of attribuut]]))","v":{"$error":"#REF!"}},{"$f":"IF(Schema!I68=\"\",\"\",Schema!I68)","v":""},{"$f":"IF(Schema!J68=\"\",\"\",Schema!J68)","v":""},{"$f":"IF(Schema!K68=\"\",\"\",Schema!K68)","v":""},{"$f":"IF(Schema!L68=\"\",\"\",Schema!L68)","v":""},{"$f":"IF(Schema!N68=\"\",\"\",Schema!N68)","v":"V"}]
[{"$f":"Schema!A69&Schema!B69&Schema!C69&Schema!D69","v":"STATUS"},{"$error":"#REF!"},{"$f":"IF(A62=\"\",\"\",IF(LEN(Schema!A69)=2,1,IF(LEN(Schema!B69)=2,10,IF(LEN(Schema!C69)=2,100,0))))","v":0},{"$error":"#REF!"},{"$f":"IF(A62=\"\",\"\",SUM(Tabel2[[#This Row],[I1]:[I2]]))","v":{"$error":"#REF!"}},{"$error":"#REF!"},{"$error":"#REF!"},{"$error":"#REF!"},{"$error":"#REF!"},{"$f":"IF(C62=\"\",\"\",IF(LEN(Tabel2[[#This Row],[Entiteit of attribuut]])=2,\"\",Tabel2[[#This Row],[Entiteit]]&\"_\"&Tabel2[[#This Row],[Entiteit of attribuut]]))","v":{"$error":"#REF!"}},{"$f":"IF(Schema!I69=\"\",\"\",Schema!I69)","v":""},{"$f":"IF(Schema!J69=\"\",\"\",Schema!J69)","v":""},{"$f":"IF(Schema!K69=\"\",\"\",Schema!K69)","v":""},{"$f":"IF(Schema!L69=\"\",\"\",Schema!L69)","v":""},{"$f":"IF(Schema!N69=\"\",\"\",Schema!N69)","v":"V"}]
[{"$f":"Schema!A70&Schema!B70&Schema!C70&Schema!D70","v":"STPRV"},{"$error":"#REF!"},{"$f":"IF(A63=\"\",\"\",IF(LEN(Schema!A70)=2,1,IF(LEN(Schema!B70)=2,10,IF(LEN(Schema!C70)=2,100,0))))","v":0},{"$error":"#REF!"},{"$f":"IF(A63=\"\",\"\",SUM(Tabel2[[#This Row],[I1]:[I2]]))","v":{"$error":"#REF!"}},{"$error":"#REF!"},{"$error":"#REF!"},{"$error":"#REF!"},{"$error":"#REF!"},{"$f":"IF(C63=\"\",\"\",IF(LEN(Tabel2[[#This Row],[Entiteit of attribuut]])=2,\"\",Tabel2[[#This Row],[Entiteit]]&\"_\"&Tabel2[[#This Row],[Entiteit of attribuut]]))","v":{"$error":"#REF!"}},{"$f":"IF(Schema!I70=\"\",\"\",Schema!I70)","v":""},{"$f":"IF(Schema!J70=\"\",\"\",Schema!J70)","v":""},{"$f":"IF(Schema!K70=\"\",\"\",Schema!K70)","v":""},{"$f":"IF(Schema!L70=\"\",\"\",Schema!L70)","v":""},{"$f":"IF(Schema!N70=\"\",\"\",Schema!N70)","v":"LEEG"}]
[{"$f":"Schema!A71&Schema!B71&Schema!C71&Schema!D71","v":"TARDAT"},{"$error":"#REF!"},{"$f":"IF(A64=\"\",\"\",IF(LEN(Schema!A71)=2,1,IF(LEN(Schema!B71)=2,10,IF(LEN(Schema!C71)=2,100,0))))","v":0},{"$error":"#REF!"},{"$f":"IF(A64=\"\",\"\",SUM(Tabel2[[#This Row],[I1]:[I2]]))","v":{"$error":"#REF!"}},{"$error":"#REF!"},{"$error":"#REF!"},{"$error":"#REF!"},{"$error":"#REF!"},{"$f":"IF(C64=\"\",\"\",IF(LEN(Tabel2[[#This Row],[Entiteit of attribuut]])=2,\"\",Tabel2[[#This Row],[Entiteit]]&\"_\"&Tabel2[[#This Row],[Entiteit of attribuut]]))","v":{"$error":"#REF!"}},{"$f":"IF(Schema!I71=\"\",\"\",Schema!I71)","v":""},{"$f":"IF(Schema!J71=\"\",\"\",Schema!J71)","v":""},{"$f":"IF(Schema!K71=\"\",\"\",Schema!K71)","v":""},{"$f":"IF(Schema!L71=\"\",\"\",Schema!L71)","v":""},{"$f":"IF(Schema!N71=\"\",\"\",Schema!N71)","v":"LEEG"}]
[{"$f":"Schema!A72&Schema!B72&Schema!C72&Schema!D72","v":"TARSTEL"},{"$error":"#REF!"},{"$f":"IF(A65=\"\",\"\",IF(LEN(Schema!A72)=2,1,IF(LEN(Schema!B72)=2,10,IF(LEN(Schema!C72)=2,100,0))))","v":0},{"$error":"#REF!"},{"$f":"IF(A65=\"\",\"\",SUM(Tabel2[[#This Row],[I1]:[I2]]))","v":{"$error":"#REF!"}},{"$error":"#REF!"},{"$error":"#REF!"},{"$error":"#REF!"},{"$error":"#REF!"},{"$f":"IF(C65=\"\",\"\",IF(LEN(Tabel2[[#This Row],[Entiteit of attribuut]])=2,\"\",Tabel2[[#This Row],[Entiteit]]&\"_\"&Tabel2[[#This Row],[Entiteit of attribuut]]))","v":{"$error":"#REF!"}},{"$f":"IF(Schema!I72=\"\",\"\",Schema!I72)","v":""},{"$f":"IF(Schema!J72=\"\",\"\",Schema!J72)","v":""},{"$f":"IF(Schema!K72=\"\",\"\",Schema!K72)","v":""},{"$f":"IF(Schema!L72=\"\",\"\",Schema!L72)","v":""},{"$f":"IF(Schema!N72=\"\",\"\",Schema!N72)","v":"LEEG"}]
[{"$f":"Schema!A73&Schema!B73&Schema!C73&Schema!D73","v":"TJRPO"},{"$error":"#REF!"},{"$f":"IF(A66=\"\",\"\",IF(LEN(Schema!A73)=2,1,IF(LEN(Schema!B73)=2,10,IF(LEN(Schema!C73)=2,100,0))))","v":0},{"$error":"#REF!"},{"$f":"IF(A66=\"\",\"\",SUM(Tabel2[[#This Row],[I1]:[I2]]))","v":{"$error":"#REF!"}},{"$error":"#REF!"},{"$error":"#REF!"},{"$error":"#REF!"},{"$error":"#REF!"},{"$f":"IF(C66=\"\",\"\",IF(LEN(Tabel2[[#This Row],[Entiteit of attribuut]])=2,\"\",Tabel2[[#This Row],[Entiteit]]&\"_\"&Tabel2[[#This Row],[Entiteit of attribuut]]))","v":{"$error":"#REF!"}},{"$f":"IF(Schema!I73=\"\",\"\",Schema!I73)","v":""},{"$f":"IF(Schema!J73=\"\",\"\",Schema!J73)","v":""},{"$f":"IF(Schema!K73=\"\",\"\",Schema!K73)","v":""},{"$f":"IF(Schema!L73=\"\",\"\",Schema!L73)","v":""},{"$f":"IF(Schema!N73=\"\",\"\",Schema!N73)","v":"O"}]
[{"$f":"Schema!A74&Schema!B74&Schema!C74&Schema!D74","v":"TJRPP"},{"$f":"IF(LEN(A67)=2,A67,IF(A67=\"\",\"Leeg\",B66))","v":{"$error":"#REF!"}},{"$f":"IF(A67=\"\",\"\",IF(LEN(Schema!A74)=2,1,IF(LEN(Schema!B74)=2,10,IF(LEN(Schema!C74)=2,100,0))))","v":0},{"$f":"IF(C67=0,D66,C67)","v":{"$error":"#REF!"}},{"$f":"IF(A67=\"\",\"\",SUM(Tabel2[[#This Row],[I1]:[I2]]))","v":{"$error":"#REF!"}},{"$f":"IF(A67=\"\",\"\",IF(C67=1,B67,F66))","v":{"$error":"#REF!"}},{"$f":"IF(C67=10,A67,IF(OR(C67=0,C67=100),G66,\"\"))","v":{"$error":"#REF!"}},{"$f":"IF(E67=200,B67,IF(C67=0,H66,\"\"))","v":{"$error":"#REF!"}},{"$f":"IF(C67=\"\",\"\",IF(OR(E67=1,E67=10,E67=100),I66,IF(E67=2,F67,IF(E67=20,F67&\"/\"&G67,IF(E67=200,F67&\"/\"&G67&\"/\"&H67)))))","v":{"$error":"#REF!"}},{"$f":"IF(C67=\"\",\"\",IF(LEN(Tabel2[[#This Row],[Entiteit of attribuut]])=2,\"\",Tabel2[[#This Row],[Entiteit]]&\"_\"&Tabel2[[#This Row],[Entiteit of attribuut]]))","v":{"$error":"#REF!"}},{"$f":"IF(Schema!I74=\"\",\"\",Schema!I74)","v":""},{"$f":"IF(Schema!J74=\"\",\"\",Schema!J74)","v":""},{"$f":"IF(Schema!K74=\"\",\"\",Schema!K74)","v":""},{"$f":"IF(Schema!L74=\"\",\"\",Schema!L74)","v":""},{"$f":"IF(Schema!N74=\"\",\"\",Schema!N74)","v":"V"}]
[{"$f":"Schema!A75&Schema!B75&Schema!C75&Schema!D75","v":"VALSRT"},{"$error":"#REF!"},{"$f":"IF(A68=\"\",\"\",IF(LEN(Schema!A75)=2,1,IF(LEN(Schema!B75)=2,10,IF(LEN(Schema!C75)=2,100,0))))","v":0},{"$error":"#REF!"},{"$f":"IF(A68=\"\",\"\",SUM(Tabel2[[#This Row],[I1]:[I2]]))","v":{"$error":"#REF!"}},{"$error":"#REF!"},{"$error":"#REF!"},{"$error":"#REF!"},{"$error":"#REF!"},{"$f":"IF(C68=\"\",\"\",IF(LEN(Tabel2[[#This Row],[Entiteit of attribuut]])=2,\"\",Tabel2[[#This Row],[Entiteit]]&\"_\"&Tabel2[[#This Row],[Entiteit of attribuut]]))","v":{"$error":"#REF!"}},{"$f":"IF(Schema!I75=\"\",\"\",Schema!I75)","v":""},{"$f":"IF(Schema!J75=\"\",\"\",Schema!J75)","v":""},{"$f":"IF(Schema!K75=\"\",\"\",Schema!K75)","v":""},{"$f":"IF(Schema!L75=\"\",\"\",Schema!L75)","v":""},{"$f":"IF(Schema!N75=\"\",\"\",Schema!N75)","v":"LEEG"}]
[{"$f":"Schema!A76&Schema!B76&Schema!C76&Schema!D76","v":"VGCODE"},{"$error":"#REF!"},{"$f":"IF(A69=\"\",\"\",IF(LEN(Schema!A76)=2,1,IF(LEN(Schema!B76)=2,10,IF(LEN(Schema!C76)=2,100,0))))","v":0},{"$error":"#REF!"},{"$f":"IF(A69=\"\",\"\",SUM(Tabel2[[#This Row],[I1]:[I2]]))","v":{"$error":"#REF!"}},{"$error":"#REF!"},{"$error":"#REF!"},{"$error":"#REF!"},{"$error":"#REF!"},{"$f":"IF(C69=\"\",\"\",IF(LEN(Tabel2[[#This Row],[Entiteit of attribuut]])=2,\"\",Tabel2[[#This Row],[Entiteit]]&\"_\"&Tabel2[[#This Row],[Entiteit of attribuut]]))","v":{"$error":"#REF!"}},{"$f":"IF(Schema!I76=\"\",\"\",Schema!I76)","v":""},{"$f":"IF(Schema!J76=\"\",\"\",Schema!J76)","v":""},{"$f":"IF(Schema!K76=\"\",\"\",Schema!K76)","v":""},{"$f":"IF(Schema!L76=\"\",\"\",Schema!L76)","v":""},{"$f":"IF(Schema!N76=\"\",\"\",Schema!N76)","v":"V"}]
[{"$f":"Schema!A77&Schema!B77&Schema!C77&Schema!D77","v":"VOLGNUM"},{"$error":"#REF!"},{"$f":"IF(A70=\"\",\"\",IF(LEN(Schema!A77)=2,1,IF(LEN(Schema!B77)=2,10,IF(LEN(Schema!C77)=2,100,0))))","v":0},{"$error":"#REF!"},{"$f":"IF(A70=\"\",\"\",SUM(Tabel2[[#This Row],[I1]:[I2]]))","v":{"$error":"#REF!"}},{"$error":"#REF!"},{"$error":"#REF!"},{"$error":"#REF!"},{"$error":"#REF!"},{"$f":"IF(C70=\"\",\"\",IF(LEN(Tabel2[[#This Row],[Entiteit of attribuut]])=2,\"\",Tabel2[[#This Row],[Entiteit]]&\"_\"&Tabel2[[#This Row],[Entiteit of attribuut]]))","v":{"$error":"#REF!"}},{"$f":"IF(Schema!I77=\"\",\"\",Schema!I77)","v":""},{"$f":"IF(Schema!J77=\"\",\"\",Schema!J77)","v":""},{"$f":"IF(Schema!K77=\"\",\"\",Schema!K77)","v":""},{"$f":"IF(Schema!L77=\"\",\"\",Schema!L77)","v":""},{"$f":"IF(Schema!N77=\"\",\"\",Schema!N77)","v":"LEEG"}]
[{"$f":"Schema!A78&Schema!B78&Schema!C78&Schema!D78","v":"VRWRKCD"},{"$error":"#REF!"},{"$f":"IF(A71=\"\",\"\",IF(LEN(Schema!A78)=2,1,IF(LEN(Schema!B78)=2,10,IF(LEN(Schema!C78)=2,100,0))))","v":0},{"$error":"#REF!"},{"$f":"IF(A71=\"\",\"\",SUM(Tabel2[[#This Row],[I1]:[I2]]))","v":{"$error":"#REF!"}},{"$error":"#REF!"},{"$error":"#REF!"},{"$error":"#REF!"},{"$error":"#REF!"},{"$f":"IF(C71=\"\",\"\",IF(LEN(Tabel2[[#This Row],[Entiteit of attribuut]])=2,\"\",Tabel2[[#This Row],[Entiteit]]&\"_\"&Tabel2[[#This Row],[Entiteit of attribuut]]))","v":{"$error":"#REF!"}},{"$f":"IF(Schema!I78=\"\",\"\",Schema!I78)","v":""},{"$f":"IF(Schema!J78=\"\",\"\",Schema!J78)","v":""},{"$f":"IF(Schema!K78=\"\",\"\",Schema!K78)","v":""},{"$f":"IF(Schema!L78=\"\",\"\",Schema!L78)","v":""},{"$f":"IF(Schema!N78=\"\",\"\",Schema!N78)","v":"LEEG"}]
[{"$f":"Schema!A79&Schema!B79&Schema!C79&Schema!D79","v":"BA"},"BA",{"$f":"IF(A72=\"\",\"\",IF(LEN(Schema!A79)=2,1,IF(LEN(Schema!B79)=2,10,IF(LEN(Schema!C79)=2,100,0))))","v":10},10,{"$f":"IF(A72=\"\",\"\",SUM(Tabel2[[#This Row],[I1]:[I2]]))","v":20},{"$error":"#REF!"},"BA","",{"$error":"#REF!"},{"$f":"IF(C72=\"\",\"\",IF(LEN(Tabel2[[#This Row],[Entiteit of attribuut]])=2,\"\",Tabel2[[#This Row],[Entiteit]]&\"_\"&Tabel2[[#This Row],[Entiteit of attribuut]]))","v":""},{"$f":"IF(Schema!I79=\"\",\"\",Schema!I79)","v":""},{"$f":"IF(Schema!J79=\"\",\"\",Schema!J79)","v":""},{"$f":"IF(Schema!K79=\"\",\"\",Schema!K79)","v":""},{"$f":"IF(Schema!L79=\"\",\"\",Schema!L79)","v":""},{"$f":"IF(Schema!N79=\"\",\"\",Schema!N79)","v":"O"}]
[{"$f":"Schema!A80&Schema!B80&Schema!C80&Schema!D80","v":"AARDBW"},"BA",{"$f":"IF(A73=\"\",\"\",IF(LEN(Schema!A80)=2,1,IF(LEN(Schema!B80)=2,10,IF(LEN(Schema!C80)=2,100,0))))","v":0},10,{"$f":"IF(A73=\"\",\"\",SUM(Tabel2[[#This Row],[I1]:[I2]]))","v":10},{"$error":"#REF!"},"BA","",{"$error":"#REF!"},{"$f":"IF(C73=\"\",\"\",IF(LEN(Tabel2[[#This Row],[Entiteit of attribuut]])=2,\"\",Tabel2[[#This Row],[Entiteit]]&\"_\"&Tabel2[[#This Row],[Entiteit of attribuut]]))","v":"BA_AARDBW"},{"$f":"IF(Schema!I80=\"\",\"\",Schema!I80)","v":""},{"$f":"IF(Schema!J80=\"\",\"\",Schema!J80)","v":""},{"$f":"IF(Schema!K80=\"\",\"\",Schema!K80)","v":""},{"$f":"IF(Schema!L80=\"\",\"\",Schema!L80)","v":""},{"$f":"IF(Schema!N80=\"\",\"\",Schema!N80)","v":"O"}]
[{"$f":"Schema!A81&Schema!B81&Schema!C81&Schema!D81","v":"AARDDAK"},"BA",{"$f":"IF(A74=\"\",\"\",IF(LEN(Schema!A81)=2,1,IF(LEN(Schema!B81)=2,10,IF(LEN(Schema!C81)=2,100,0))))","v":0},10,{"$f":"IF(A74=\"\",\"\",SUM(Tabel2[[#This Row],[I1]:[I2]]))","v":10},{"$error":"#REF!"},"BA","",{"$error":"#REF!"},{"$f":"IF(C74=\"\",\"\",IF(LEN(Tabel2[[#This Row],[Entiteit of attribuut]])=2,\"\",Tabel2[[#This Row],[Entiteit]]&\"_\"&Tabel2[[#This Row],[Entiteit of attribuut]]))","v":"BA_AARDDAK"},{"$f":"IF(Schema!I81=\"\",\"\",Schema!I81)","v":""},{"$f":"IF(Schema!J81=\"\",\"\",Schema!J81)","v":""},{"$f":"IF(Schema!K81=\"\",\"\",Schema!K81)","v":""},{"$f":"IF(Schema!L81=\"\",\"\",Schema!L81)","v":""},{"$f":"IF(Schema!N81=\"\",\"\",Schema!N81)","v":"O"}]
[{"$f":"Schema!A82&Schema!B82&Schema!C82&Schema!D82","v":"AARDOBJ"},"BA",{"$f":"IF(A75=\"\",\"\",IF(LEN(Schema!A82)=2,1,IF(LEN(Schema!B82)=2,10,IF(LEN(Schema!C82)=2,100,0))))","v":0},10,{"$f":"IF(A75=\"\",\"\",SUM(Tabel2[[#This Row],[I1]:[I2]]))","v":10},{"$error":"#REF!"},"BA","",{"$error":"#REF!"},{"$f":"IF(C75=\"\",\"\",IF(LEN(Tabel2[[#This Row],[Entiteit of attribuut]])=2,\"\",Tabel2[[#This Row],[Entiteit]]&\"_\"&Tabel2[[#This Row],[Entiteit of attribuut]]))","v":"BA_AARDOBJ"},{"$f":"IF(Schema!I82=\"\",\"\",Schema!I82)","v":""},{"$f":"IF(Schema!J82=\"\",\"\",Schema!J82)","v":""},{"$f":"IF(Schema!K82=\"\",\"\",Schema!K82)","v":""},{"$f":"IF(Schema!L82=\"\",\"\",Schema!L82)","v":""},{"$f":"IF(Schema!N82=\"\",\"\",Schema!N82)","v":"O"}]
[{"$f":"Schema!A83&Schema!B83&Schema!C83&Schema!D83","v":"AARDVLR"},"BA",{"$f":"IF(A76=\"\",\"\",IF(LEN(Schema!A83)=2,1,IF(LEN(Schema!B83)=2,10,IF(LEN(Schema!C83)=2,100,0))))","v":0},10,{"$f":"IF(A76=\"\",\"\",SUM(Tabel2[[#This Row],[I1]:[I2]]))","v":10},{"$error":"#REF!"},"BA","",{"$error":"#REF!"},{"$f":"IF(C76=\"\",\"\",IF(LEN(Tabel2[[#This Row],[Entiteit of attribuut]])=2,\"\",Tabel2[[#This Row],[Entiteit]]&\"_\"&Tabel2[[#This Row],[Entiteit of attribuut]]))","v":"BA_AARDVLR"},{"$f":"IF(Schema!I83=\"\",\"\",Schema!I83)","v":""},{"$f":"IF(Schema!J83=\"\",\"\",Schema!J83)","v":""},{"$f":"IF(Schema!K83=\"\",\"\",Schema!K83)","v":""},{"$f":"IF(Schema!L83=\"\",\"\",Schema!L83)","v":""},{"$f":"IF(Schema!N83=\"\",\"\",Schema!N83)","v":"O"}]
[{"$f":"Schema!A84&Schema!B84&Schema!C84&Schema!D84","v":"BESTEMO"},"BA",{"$f":"IF(A77=\"\",\"\",IF(LEN(Schema!A84)=2,1,IF(LEN(Schema!B84)=2,10,IF(LEN(Schema!C84)=2,100,0))))","v":0},10,{"$f":"IF(A77=\"\",\"\",SUM(Tabel2[[#This Row],[I1]:[I2]]))","v":10},{"$error":"#REF!"},"BA","",{"$error":"#REF!"},{"$f":"IF(C77=\"\",\"\",IF(LEN(Tabel2[[#This Row],[Entiteit of attribuut]])=2,\"\",Tabel2[[#This Row],[Entiteit]]&\"_\"&Tabel2[[#This Row],[Entiteit of attribuut]]))","v":"BA_BESTEMO"},{"$f":"IF(Schema!I84=\"\",\"\",Schema!I84)","v":""},{"$f":"IF(Schema!J84=\"\",\"\",Schema!J84)","v":""},{"$f":"IF(Schema!K84=\"\",\"\",Schema!K84)","v":""},{"$f":"IF(Schema!L84=\"\",\"\",Schema!L84)","v":""},{"$f":"IF(Schema!N84=\"\",\"\",Schema!N84)","v":"O"}]
[{"$f":"Schema!A85&Schema!B85&Schema!C85&Schema!D85","v":"BEVEIL"},"BA",{"$f":"IF(A78=\"\",\"\",IF(LEN(Schema!A85)=2,1,IF(LEN(Schema!B85)=2,10,IF(LEN(Schema!C85)=2,100,0))))","v":0},10,{"$f":"IF(A78=\"\",\"\",SUM(Tabel2[[#This Row],[I1]:[I2]]))","v":10},{"$error":"#REF!"},"BA","",{"$error":"#REF!"},{"$f":"IF(C78=\"\",\"\",IF(LEN(Tabel2[[#This Row],[Entiteit of attribuut]])=2,\"\",Tabel2[[#This Row],[Entiteit]]&\"_\"&Tabel2[[#This Row],[Entiteit of attribuut]]))","v":"BA_BEVEIL"},{"$f":"IF(Schema!I85=\"\",\"\",Schema!I85)","v":""},{"$f":"IF(Schema!J85=\"\",\"\",Schema!J85)","v":""},{"$f":"IF(Schema!K85=\"\",\"\",Schema!K85)","v":""},{"$f":"IF(Schema!L85=\"\",\"\",Schema!L85)","v":""},{"$f":"IF(Schema!N85=\"\",\"\",Schema!N85)","v":"LEEG"}]
[{"$f":"Schema!A86&Schema!B86&Schema!C86&Schema!D86","v":"BOUWJR"},"BA",{"$f":"IF(A79=\"\",\"\",IF(LEN(Schema!A86)=2,1,IF(LEN(Schema!B86)=2,10,IF(LEN(Schema!C86)=2,100,0))))","v":0},10,{"$f":"IF(A79=\"\",\"\",SUM(Tabel2[[#This Row],[I1]:[I2]]))","v":10},{"$error":"#REF!"},"BA","",{"$error":"#REF!"},{"$f":"IF(C79=\"\",\"\",IF(LEN(Tabel2[[#This Row],[Entiteit of attribuut]])=2,\"\",Tabel2[[#This Row],[Entiteit]]&\"_\"&Tabel2[[#This Row],[Entiteit of attribuut]]))","v":"BA_BOUWJR"},{"$f":"IF(Schema!I86=\"\",\"\",Schema!I86)","v":""},{"$f":"IF(Schema!J86=\"\",\"\",Schema!J86)","v":""},{"$f":"IF(Schema!K86=\"\",\"\",Schema!K86)","v":""},{"$f":"IF(Schema!L86=\"\",\"\",Schema!L86)","v":""},{"$f":"IF(Schema!N86=\"\",\"\",Schema!N86)","v":"O"}]
[{"$f":"Schema!A87&Schema!B87&Schema!C87&Schema!D87","v":"BTWCD"},"BA",{"$f":"IF(A80=\"\",\"\",IF(LEN(Schema!A87)=2,1,IF(LEN(Schema!B87)=2,10,IF(LEN(Schema!C87)=2,100,0))))","v":0},10,{"$f":"IF(A80=\"\",\"\",SUM(Tabel2[[#This Row],[I1]:[I2]]))","v":10},{"$error":"#REF!"},"BA","",{"$error":"#REF!"},{"$f":"IF(C80=\"\",\"\",IF(LEN(Tabel2[[#This Row],[Entiteit of attribuut]])=2,\"\",Tabel2[[#This Row],[Entiteit]]&\"_\"&Tabel2[[#This Row],[Entiteit of attribuut]]))","v":"BA_BTWCD"},{"$f":"IF(Schema!I87=\"\",\"\",Schema!I87)","v":""},{"$f":"IF(Schema!J87=\"\",\"\",Schema!J87)","v":""},{"$f":"IF(Schema!K87=\"\",\"\",Schema!K87)","v":""},{"$f":"IF(Schema!L87=\"\",\"\",Schema!L87)","v":""},{"$f":"IF(Schema!N87=\"\",\"\",Schema!N87)","v":"O"}]
[{"$f":"Schema!A88&Schema!B88&Schema!C88&Schema!D88","v":"EIGENWO"},"BA",{"$f":"IF(A81=\"\",\"\",IF(LEN(Schema!A88)=2,1,IF(LEN(Schema!B88)=2,10,IF(LEN(Schema!C88)=2,100,0))))","v":0},10,{"$f":"IF(A81=\"\",\"\",SUM(Tabel2[[#This Row],[I1]:[I2]]))","v":10},{"$error":"#REF!"},"BA","",{"$error":"#REF!"},{"$f":"IF(C81=\"\",\"\",IF(LEN(Tabel2[[#This Row],[Entiteit of attribuut]])=2,\"\",Tabel2[[#This Row],[Entiteit]]&\"_\"&Tabel2[[#This Row],[Entiteit of attribuut]]))","v":"BA_EIGENWO"},{"$f":"IF(Schema!I88=\"\",\"\",Schema!I88)","v":""},{"$f":"IF(Schema!J88=\"\",\"\",Schema!J88)","v":""},{"$f":"IF(Schema!K88=\"\",\"\",Schema!K88)","v":""},{"$f":"IF(Schema!L88=\"\",\"\",Schema!L88)","v":""},{"$f":"IF(Schema!N88=\"\",\"\",Schema!N88)","v":"LEEG"}]
[{"$f":"Schema!A89&Schema!B89&Schema!C89&Schema!D89","v":"HUISNR"},"BA",{"$f":"IF(A82=\"\",\"\",IF(LEN(Schema!A89)=2,1,IF(LEN(Schema!B89)=2,10,IF(LEN(Schema!C89)=2,100,0))))","v":0},10,{"$f":"IF(A82=\"\",\"\",SUM(Tabel2[[#This Row],[I1]:[I2]]))","v":10},{"$error":"#REF!"},"BA","",{"$error":"#REF!"},{"$f":"IF(C82=\"\",\"\",IF(LEN(Tabel2[[#This Row],[Entiteit of attribuut]])=2,\"\",Tabel2[[#This Row],[Entiteit]]&\"_\"&Tabel2[[#This Row],[Entiteit of attribuut]]))","v":"BA_HUISNR"},{"$f":"IF(Schema!I89=\"\",\"\",Schema!I89)","v":""},{"$f":"IF(Schema!J89=\"\",\"\",Schema!J89)","v":""},{"$f":"IF(Schema!K89=\"\",\"\",Schema!K89)","v":""},{"$f":"IF(Schema!L89=\"\",\"\",Schema!L89)","v":""},{"$f":"IF(Schema!N89=\"\",\"\",Schema!N89)","v":"O"}]
[{"$f":"Schema!A90&Schema!B90&Schema!C90&Schema!D90","v":"LEEGSTA"},"BA",{"$f":"IF(A83=\"\",\"\",IF(LEN(Schema!A90)=2,1,IF(LEN(Schema!B90)=2,10,IF(LEN(Schema!C90)=2,100,0))))","v":0},10,{"$f":"IF(A83=\"\",\"\",SUM(Tabel2[[#This Row],[I1]:[I2]]))","v":10},{"$error":"#REF!"},"BA","",{"$error":"#REF!"},{"$f":"IF(C83=\"\",\"\",IF(LEN(Tabel2[[#This Row],[Entiteit of attribuut]])=2,\"\",Tabel2[[#This Row],[Entiteit]]&\"_\"&Tabel2[[#This Row],[Entiteit of attribuut]]))","v":"BA_LEEGSTA"},{"$f":"IF(Schema!I90=\"\",\"\",Schema!I90)","v":""},{"$f":"IF(Schema!J90=\"\",\"\",Schema!J90)","v":""},{"$f":"IF(Schema!K90=\"\",\"\",Schema!K90)","v":""},{"$f":"IF(Schema!L90=\"\",\"\",Schema!L90)","v":""},{"$f":"IF(Schema!N90=\"\",\"\",Schema!N90)","v":"LEEG"}]
[{"$f":"Schema!A91&Schema!B91&Schema!C91&Schema!D91","v":"MONUMEN"},"BA",{"$f":"IF(A84=\"\",\"\",IF(LEN(Schema!A91)=2,1,IF(LEN(Schema!B91)=2,10,IF(LEN(Schema!C91)=2,100,0))))","v":0},10,{"$f":"IF(A84=\"\",\"\",SUM(Tabel2[[#This Row],[I1]:[I2]]))","v":10},{"$error":"#REF!"},"BA","",{"$error":"#REF!"},{"$f":"IF(C84=\"\",\"\",IF(LEN(Tabel2[[#This Row],[Entiteit of attribuut]])=2,\"\",Tabel2[[#This Row],[Entiteit]]&\"_\"&Tabel2[[#This Row],[Entiteit of attribuut]]))","v":"BA_MONUMEN"},{"$f":"IF(Schema!I91=\"\",\"\",Schema!I91)","v":""},{"$f":"IF(Schema!J91=\"\",\"\",Schema!J91)","v":""},{"$f":"IF(Schema!K91=\"\",\"\",Schema!K91)","v":""},{"$f":"IF(Schema!L91=\"\",\"\",Schema!L91)","v":""},{"$f":"IF(Schema!N91=\"\",\"\",Schema!N91)","v":"LEEG"}]
[{"$f":"Schema!A92&Schema!B92&Schema!C92&Schema!D92","v":"ONDSTT"},"BA",{"$f":"IF(A85=\"\",\"\",IF(LEN(Schema!A92)=2,1,IF(LEN(Schema!B92)=2,10,IF(LEN(Schema!C92)=2,100,0))))","v":0},10,{"$f":"IF(A85=\"\",\"\",SUM(Tabel2[[#This Row],[I1]:[I2]]))","v":10},{"$error":"#REF!"},"BA","",{"$error":"#REF!"},{"$f":"IF(C85=\"\",\"\",IF(LEN(Tabel2[[#This Row],[Entiteit of attribuut]])=2,\"\",Tabel2[[#This Row],[Entiteit]]&\"_\"&Tabel2[[#This Row],[Entiteit of attribuut]]))","v":"BA_ONDSTT"},{"$f":"IF(Schema!I92=\"\",\"\",Schema!I92)","v":""},{"$f":"IF(Schema!J92=\"\",\"\",Schema!J92)","v":""},{"$f":"IF(Schema!K92=\"\",\"\",Schema!K92)","v":""},{"$f":"IF(Schema!L92=\"\",\"\",Schema!L92)","v":""},{"$f":"IF(Schema!N92=\"\",\"\",Schema!N92)","v":"O"}]
[{"$f":"Schema!A93&Schema!B93&Schema!C93&Schema!D93","v":"OPPWON"},"BA",{"$f":"IF(A86=\"\",\"\",IF(LEN(Schema!A93)=2,1,IF(LEN(Schema!B93)=2,10,IF(LEN(Schema!C93)=2,100,0))))","v":0},10,{"$f":"IF(A86=\"\",\"\",SUM(Tabel2[[#This Row],[I1]:[I2]]))","v":10},{"$error":"#REF!"},"BA","",{"$error":"#REF!"},{"$f":"IF(C86=\"\",\"\",IF(LEN(Tabel2[[#This Row],[Entiteit of attribuut]])=2,\"\",Tabel2[[#This Row],[Entiteit]]&\"_\"&Tabel2[[#This Row],[Entiteit of attribuut]]))","v":"BA_OPPWON"},{"$f":"IF(Schema!I93=\"\",\"\",Schema!I93)","v":""},{"$f":"IF(Schema!J93=\"\",\"\",Schema!J93)","v":""},{"$f":"IF(Schema!K93=\"\",\"\",Schema!K93)","v":""},{"$f":"IF(Schema!L93=\"\",\"\",Schema!L93)","v":""},{"$f":"IF(Schema!N93=\"\",\"\",Schema!N93)","v":"LEEG"}]
[{"$f":"Schema!A94&Schema!B94&Schema!C94&Schema!D94","v":"PCODE"},"BA",{"$f":"IF(A87=\"\",\"\",IF(LEN(Schema!A94)=2,1,IF(LEN(Schema!B94)=2,10,IF(LEN(Schema!C94)=2,100,0))))","v":0},10,{"$f":"IF(A87=\"\",\"\",SUM(Tabel2[[#This Row],[I1]:[I2]]))","v":10},{"$error":"#REF!"},"BA","",{"$error":"#REF!"},{"$f":"IF(C87=\"\",\"\",IF(LEN(Tabel2[[#This Row],[Entiteit of attribuut]])=2,\"\",Tabel2[[#This Row],[Entiteit]]&\"_\"&Tabel2[[#This Row],[Entiteit of attribuut]]))","v":"BA_PCODE"},{"$f":"IF(Schema!I94=\"\",\"\",Schema!I94)","v":""},{"$f":"IF(Schema!J94=\"\",\"\",Schema!J94)","v":""},{"$f":"IF(Schema!K94=\"\",\"\",Schema!K94)","v":""},{"$f":"IF(Schema!L94=\"\",\"\",Schema!L94)","v":""},{"$f":"IF(Schema!N94=\"\",\"\",Schema!N94)","v":"O"}]
[{"$f":"Schema!A95&Schema!B95&Schema!C95&Schema!D95","v":"SKG"},"BA",{"$f":"IF(A88=\"\",\"\",IF(LEN(Schema!A95)=2,1,IF(LEN(Schema!B95)=2,10,IF(LEN(Schema!C95)=2,100,0))))","v":0},10,{"$f":"IF(A88=\"\",\"\",SUM(Tabel2[[#This Row],[I1]:[I2]]))","v":10},{"$error":"#REF!"},"BA","",{"$error":"#REF!"},{"$f":"IF(C88=\"\",\"\",IF(LEN(Tabel2[[#This Row],[Entiteit of attribuut]])=2,\"\",Tabel2[[#This Row],[Entiteit]]&\"_\"&Tabel2[[#This Row],[Entiteit of attribuut]]))","v":"BA_SKG"},{"$f":"IF(Schema!I95=\"\",\"\",Schema!I95)","v":""},{"$f":"IF(Schema!J95=\"\",\"\",Schema!J95)","v":""},{"$f":"IF(Schema!K95=\"\",\"\",Schema!K95)","v":""},{"$f":"IF(Schema!L95=\"\",\"\",Schema!L95)","v":""},{"$f":"IF(Schema!N95=\"\",\"\",Schema!N95)","v":"LEEG"}]
[{"$f":"Schema!A96&Schema!B96&Schema!C96&Schema!D96","v":"SKGSTER"},"BA",{"$f":"IF(A89=\"\",\"\",IF(LEN(Schema!A96)=2,1,IF(LEN(Schema!B96)=2,10,IF(LEN(Schema!C96)=2,100,0))))","v":0},10,{"$f":"IF(A89=\"\",\"\",SUM(Tabel2[[#This Row],[I1]:[I2]]))","v":10},{"$error":"#REF!"},"BA","",{"$error":"#REF!"},{"$f":"IF(C89=\"\",\"\",IF(LEN(Tabel2[[#This Row],[Entiteit of attribuut]])=2,\"\",Tabel2[[#This Row],[Entiteit]]&\"_\"&Tabel2[[#This Row],[Entiteit of attribuut]]))","v":"BA_SKGSTER"},{"$f":"IF(Schema!I96=\"\",\"\",Schema!I96)","v":""},{"$f":"IF(Schema!J96=\"\",\"\",Schema!J96)","v":""},{"$f":"IF(Schema!K96=\"\",\"\",Schema!K96)","v":""},{"$f":"IF(Schema!L96=\"\",\"\",Schema!L96)","v":""},{"$f":"IF(Schema!N96=\"\",\"\",Schema!N96)","v":"LEEG"}]
[{"$f":"Schema!A97&Schema!B97&Schema!C97&Schema!D97","v":"SRTRDAK"},"BA",{"$f":"IF(A90=\"\",\"\",IF(LEN(Schema!A97)=2,1,IF(LEN(Schema!B97)=2,10,IF(LEN(Schema!C97)=2,100,0))))","v":0},10,{"$f":"IF(A90=\"\",\"\",SUM(Tabel2[[#This Row],[I1]:[I2]]))","v":10},{"$error":"#REF!"},"BA","",{"$error":"#REF!"},{"$f":"IF(C90=\"\",\"\",IF(LEN(Tabel2[[#This Row],[Entiteit of attribuut]])=2,\"\",Tabel2[[#This Row],[Entiteit]]&\"_\"&Tabel2[[#This Row],[Entiteit of attribuut]]))","v":"BA_SRTRDAK"},{"$f":"IF(Schema!I97=\"\",\"\",Schema!I97)","v":""},{"$f":"IF(Schema!J97=\"\",\"\",Schema!J97)","v":""},{"$f":"IF(Schema!K97=\"\",\"\",Schema!K97)","v":""},{"$f":"IF(Schema!L97=\"\",\"\",Schema!L97)","v":""},{"$f":"IF(Schema!N97=\"\",\"\",Schema!N97)","v":"LEEG"}]
[{"$f":"Schema!A98&Schema!B98&Schema!C98&Schema!D98","v":"TOEGEBR"},"BA",{"$f":"IF(A91=\"\",\"\",IF(LEN(Schema!A98)=2,1,IF(LEN(Schema!B98)=2,10,IF(LEN(Schema!C98)=2,100,0))))","v":0},10,{"$f":"IF(A91=\"\",\"\",SUM(Tabel2[[#This Row],[I1]:[I2]]))","v":10},{"$error":"#REF!"},"BA","",{"$error":"#REF!"},{"$f":"IF(C91=\"\",\"\",IF(LEN(Tabel2[[#This Row],[Entiteit of attribuut]])=2,\"\",Tabel2[[#This Row],[Entiteit]]&\"_\"&Tabel2[[#This Row],[Entiteit of attribuut]]))","v":"BA_TOEGEBR"},{"$f":"IF(Schema!I98=\"\",\"\",Schema!I98)","v":""},{"$f":"IF(Schema!J98=\"\",\"\",Schema!J98)","v":""},{"$f":"IF(Schema!K98=\"\",\"\",Schema!K98)","v":""},{"$f":"IF(Schema!L98=\"\",\"\",Schema!L98)","v":""},{"$f":"IF(Schema!N98=\"\",\"\",Schema!N98)","v":"O"}]
[{"$f":"Schema!A99&Schema!B99&Schema!C99&Schema!D99","v":"TOEVOEG"},"BA",{"$f":"IF(A92=\"\",\"\",IF(LEN(Schema!A99)=2,1,IF(LEN(Schema!B99)=2,10,IF(LEN(Schema!C99)=2,100,0))))","v":0},10,{"$f":"IF(A92=\"\",\"\",SUM(Tabel2[[#This Row],[I1]:[I2]]))","v":10},{"$error":"#REF!"},"BA","",{"$error":"#REF!"},{"$f":"IF(C92=\"\",\"\",IF(LEN(Tabel2[[#This Row],[Entiteit of attribuut]])=2,\"\",Tabel2[[#This Row],[Entiteit]]&\"_\"&Tabel2[[#This Row],[Entiteit of attribuut]]))","v":"BA_TOEVOEG"},{"$f":"IF(Schema!I99=\"\",\"\",Schema!I99)","v":""},{"$f":"IF(Schema!J99=\"\",\"\",Schema!J99)","v":""},{"$f":"IF(Schema!K99=\"\",\"\",Schema!K99)","v":""},{"$f":"IF(Schema!L99=\"\",\"\",Schema!L99)","v":""},{"$f":"IF(Schema!N99=\"\",\"\",Schema!N99)","v":"O"}]
[{"$f":"Schema!A100&Schema!B100&Schema!C100&Schema!D100","v":"TYPEWON"},"BA",{"$f":"IF(A93=\"\",\"\",IF(LEN(Schema!A100)=2,1,IF(LEN(Schema!B100)=2,10,IF(LEN(Schema!C100)=2,100,0))))","v":0},10,{"$f":"IF(A93=\"\",\"\",SUM(Tabel2[[#This Row],[I1]:[I2]]))","v":10},{"$error":"#REF!"},"BA","",{"$error":"#REF!"},{"$f":"IF(C93=\"\",\"\",IF(LEN(Tabel2[[#This Row],[Entiteit of attribuut]])=2,\"\",Tabel2[[#This Row],[Entiteit]]&\"_\"&Tabel2[[#This Row],[Entiteit of attribuut]]))","v":"BA_TYPEWON"},{"$f":"IF(Schema!I100=\"\",\"\",Schema!I100)","v":""},{"$f":"IF(Schema!J100=\"\",\"\",Schema!J100)","v":""},{"$f":"IF(Schema!K100=\"\",\"\",Schema!K100)","v":""},{"$f":"IF(Schema!L100=\"\",\"\",Schema!L100)","v":""},{"$f":"IF(Schema!N100=\"\",\"\",Schema!N100)","v":"LEEG"}]
[{"$f":"Schema!A101&Schema!B101&Schema!C101&Schema!D101","v":"VOLGNUM"},"BA",{"$f":"IF(A94=\"\",\"\",IF(LEN(Schema!A101)=2,1,IF(LEN(Schema!B101)=2,10,IF(LEN(Schema!C101)=2,100,0))))","v":0},10,{"$f":"IF(A94=\"\",\"\",SUM(Tabel2[[#This Row],[I1]:[I2]]))","v":10},{"$error":"#REF!"},"BA","",{"$error":"#REF!"},{"$f":"IF(C94=\"\",\"\",IF(LEN(Tabel2[[#This Row],[Entiteit of attribuut]])=2,\"\",Tabel2[[#This Row],[Entiteit]]&\"_\"&Tabel2[[#This Row],[Entiteit of attribuut]]))","v":"BA_VOLGNUM"},{"$f":"IF(Schema!I101=\"\",\"\",Schema!I101)","v":""},{"$f":"IF(Schema!J101=\"\",\"\",Schema!J101)","v":""},{"$f":"IF(Schema!K101=\"\",\"\",Schema!K101)","v":""},{"$f":"IF(Schema!L101=\"\",\"\",Schema!L101)","v":""},{"$f":"IF(Schema!N101=\"\",\"\",Schema!N101)","v":"O"}]
[{"$f":"Schema!A102&Schema!B102&Schema!C102&Schema!D102","v":"VRWRKCD"},"BA",{"$f":"IF(A95=\"\",\"\",IF(LEN(Schema!A102)=2,1,IF(LEN(Schema!B102)=2,10,IF(LEN(Schema!C102)=2,100,0))))","v":0},10,{"$f":"IF(A95=\"\",\"\",SUM(Tabel2[[#This Row],[I1]:[I2]]))","v":10},{"$error":"#REF!"},"BA","",{"$error":"#REF!"},{"$f":"IF(C95=\"\",\"\",IF(LEN(Tabel2[[#This Row],[Entiteit of attribuut]])=2,\"\",Tabel2[[#This Row],[Entiteit]]&\"_\"&Tabel2[[#This Row],[Entiteit of attribuut]]))","v":"BA_VRWRKCD"},{"$f":"IF(Schema!I102=\"\",\"\",Schema!I102)","v":""},{"$f":"IF(Schema!J102=\"\",\"\",Schema!J102)","v":""},{"$f":"IF(Schema!K102=\"\",\"\",Schema!K102)","v":""},{"$f":"IF(Schema!L102=\"\",\"\",Schema!L102)","v":""},{"$f":"IF(Schema!N102=\"\",\"\",Schema!N102)","v":"LEEG"}]
[{"$f":"Schema!A103&Schema!B103&Schema!C103&Schema!D103","v":"WONING"},"BA",{"$f":"IF(A96=\"\",\"\",IF(LEN(Schema!A103)=2,1,IF(LEN(Schema!B103)=2,10,IF(LEN(Schema!C103)=2,100,0))))","v":0},10,{"$f":"IF(A96=\"\",\"\",SUM(Tabel2[[#This Row],[I1]:[I2]]))","v":10},{"$error":"#REF!"},"BA","",{"$error":"#REF!"},{"$f":"IF(C96=\"\",\"\",IF(LEN(Tabel2[[#This Row],[Entiteit of attribuut]])=2,\"\",Tabel2[[#This Row],[Entiteit]]&\"_\"&Tabel2[[#This Row],[Entiteit of attribuut]]))","v":"BA_WONING"},{"$f":"IF(Schema!I103=\"\",\"\",Schema!I103)","v":""},{"$f":"IF(Schema!J103=\"\",\"\",Schema!J103)","v":""},{"$f":"IF(Schema!K103=\"\",\"\",Schema!K103)","v":""},{"$f":"IF(Schema!L103=\"\",\"\",Schema!L103)","v":""},{"$f":"IF(Schema!N103=\"\",\"\",Schema!N103)","v":"LEEG"}]
[{"$f":"Schema!A104&Schema!B104&Schema!C104&Schema!D104","v":"BB"},"BB",{"$f":"IF(A97=\"\",\"\",IF(LEN(Schema!A104)=2,1,IF(LEN(Schema!B104)=2,10,IF(LEN(Schema!C104)=2,100,0))))","v":10},10,{"$f":"IF(A97=\"\",\"\",SUM(Tabel2[[#This Row],[I1]:[I2]]))","v":20},{"$error":"#REF!"},"BB","",{"$error":"#REF!"},{"$f":"IF(C97=\"\",\"\",IF(LEN(Tabel2[[#This Row],[Entiteit of attribuut]])=2,\"\",Tabel2[[#This Row],[Entiteit]]&\"_\"&Tabel2[[#This Row],[Entiteit of attribuut]]))","v":""},{"$f":"IF(Schema!I104=\"\",\"\",Schema!I104)","v":""},{"$f":"IF(Schema!J104=\"\",\"\",Schema!J104)","v":""},{"$f":"IF(Schema!K104=\"\",\"\",Schema!K104)","v":""},{"$f":"IF(Schema!L104=\"\",\"\",Schema!L104)","v":""},{"$f":"IF(Schema!N104=\"\",\"\",Schema!N104)","v":"O"}]
[{"$f":"Schema!A105&Schema!B105&Schema!C105&Schema!D105","v":"AARDBW"},"BB",{"$f":"IF(A98=\"\",\"\",IF(LEN(Schema!A105)=2,1,IF(LEN(Schema!B105)=2,10,IF(LEN(Schema!C105)=2,100,0))))","v":0},10,{"$f":"IF(A98=\"\",\"\",SUM(Tabel2[[#This Row],[I1]:[I2]]))","v":10},{"$error":"#REF!"},"BB","",{"$error":"#REF!"},{"$f":"IF(C98=\"\",\"\",IF(LEN(Tabel2[[#This Row],[Entiteit of attribuut]])=2,\"\",Tabel2[[#This Row],[Entiteit]]&\"_\"&Tabel2[[#This Row],[Entiteit of attribuut]]))","v":"BB_AARDBW"},{"$f":"IF(Schema!I105=\"\",\"\",Schema!I105)","v":""},{"$f":"IF(Schema!J105=\"\",\"\",Schema!J105)","v":""},{"$f":"IF(Schema!K105=\"\",\"\",Schema!K105)","v":""},{"$f":"IF(Schema!L105=\"\",\"\",Schema!L105)","v":""},{"$f":"IF(Schema!N105=\"\",\"\",Schema!N105)","v":"O"}]
[{"$f":"Schema!A106&Schema!B106&Schema!C106&Schema!D106","v":"AARDDAK"},"BB",{"$f":"IF(A99=\"\",\"\",IF(LEN(Schema!A106)=2,1,IF(LEN(Schema!B106)=2,10,IF(LEN(Schema!C106)=2,100,0))))","v":0},10,{"$f":"IF(A99=\"\",\"\",SUM(Tabel2[[#This Row],[I1]:[I2]]))","v":10},{"$error":"#REF!"},"BB","",{"$error":"#REF!"},{"$f":"IF(C99=\"\",\"\",IF(LEN(Tabel2[[#This Row],[Entiteit of attribuut]])=2,\"\",Tabel2[[#This Row],[Entiteit]]&\"_\"&Tabel2[[#This Row],[Entiteit of attribuut]]))","v":"BB_AARDDAK"},{"$f":"IF(Schema!I106=\"\",\"\",Schema!I106)","v":""},{"$f":"IF(Schema!J106=\"\",\"\",Schema!J106)","v":""},{"$f":"IF(Schema!K106=\"\",\"\",Schema!K106)","v":""},{"$f":"IF(Schema!L106=\"\",\"\",Schema!L106)","v":""},{"$f":"IF(Schema!N106=\"\",\"\",Schema!N106)","v":"O"}]
[{"$f":"Schema!A107&Schema!B107&Schema!C107&Schema!D107","v":"AARDVLR"},"BB",{"$f":"IF(A100=\"\",\"\",IF(LEN(Schema!A107)=2,1,IF(LEN(Schema!B107)=2,10,IF(LEN(Schema!C107)=2,100,0))))","v":0},10,{"$f":"IF(A100=\"\",\"\",SUM(Tabel2[[#This Row],[I1]:[I2]]))","v":10},{"$error":"#REF!"},"BB","",{"$error":"#REF!"},{"$f":"IF(C100=\"\",\"\",IF(LEN(Tabel2[[#This Row],[Entiteit of attribuut]])=2,\"\",Tabel2[[#This Row],[Entiteit]]&\"_\"&Tabel2[[#This Row],[Entiteit of attribuut]]))","v":"BB_AARDVLR"},{"$f":"IF(Schema!I107=\"\",\"\",Schema!I107)","v":""},{"$f":"IF(Schema!J107=\"\",\"\",Schema!J107)","v":""},{"$f":"IF(Schema!K107=\"\",\"\",Schema!K107)","v":""},{"$f":"IF(Schema!L107=\"\",\"\",Schema!L107)","v":""},{"$f":"IF(Schema!N107=\"\",\"\",Schema!N107)","v":"O"}]
[{"$f":"Schema!A108&Schema!B108&Schema!C108&Schema!D108","v":"BOUWJR"},"BB",{"$f":"IF(A101=\"\",\"\",IF(LEN(Schema!A108)=2,1,IF(LEN(Schema!B108)=2,10,IF(LEN(Schema!C108)=2,100,0))))","v":0},10,{"$f":"IF(A101=\"\",\"\",SUM(Tabel2[[#This Row],[I1]:[I2]]))","v":10},{"$error":"#REF!"},"BB","",{"$error":"#REF!"},{"$f":"IF(C101=\"\",\"\",IF(LEN(Tabel2[[#This Row],[Entiteit of attribuut]])=2,\"\",Tabel2[[#This Row],[Entiteit]]&\"_\"&Tabel2[[#This Row],[Entiteit of attribuut]]))","v":"BB_BOUWJR"},{"$f":"IF(Schema!I108=\"\",\"\",Schema!I108)","v":""},{"$f":"IF(Schema!J108=\"\",\"\",Schema!J108)","v":""},{"$f":"IF(Schema!K108=\"\",\"\",Schema!K108)","v":""},{"$f":"IF(Schema!L108=\"\",\"\",Schema!L108)","v":""},{"$f":"IF(Schema!N108=\"\",\"\",Schema!N108)","v":"O"}]
[{"$f":"Schema!A109&Schema!B109&Schema!C109&Schema!D109","v":"HUISNR"},"BB",{"$f":"IF(A102=\"\",\"\",IF(LEN(Schema!A109)=2,1,IF(LEN(Schema!B109)=2,10,IF(LEN(Schema!C109)=2,100,0))))","v":0},10,{"$f":"IF(A102=\"\",\"\",SUM(Tabel2[[#This Row],[I1]:[I2]]))","v":10},{"$error":"#REF!"},"BB","",{"$error":"#REF!"},{"$f":"IF(C102=\"\",\"\",IF(LEN(Tabel2[[#This Row],[Entiteit of attribuut]])=2,\"\",Tabel2[[#This Row],[Entiteit]]&\"_\"&Tabel2[[#This Row],[Entiteit of attribuut]]))","v":"BB_HUISNR"},{"$f":"IF(Schema!I109=\"\",\"\",Schema!I109)","v":""},{"$f":"IF(Schema!J109=\"\",\"\",Schema!J109)","v":""},{"$f":"IF(Schema!K109=\"\",\"\",Schema!K109)","v":""},{"$f":"IF(Schema!L109=\"\",\"\",Schema!L109)","v":""},{"$f":"IF(Schema!N109=\"\",\"\",Schema!N109)","v":"O"}]
[{"$f":"Schema!A110&Schema!B110&Schema!C110&Schema!D110","v":"PCODE"},"BB",{"$f":"IF(A103=\"\",\"\",IF(LEN(Schema!A110)=2,1,IF(LEN(Schema!B110)=2,10,IF(LEN(Schema!C110)=2,100,0))))","v":0},10,{"$f":"IF(A103=\"\",\"\",SUM(Tabel2[[#This Row],[I1]:[I2]]))","v":10},{"$error":"#REF!"},"BB","",{"$error":"#REF!"},{"$f":"IF(C103=\"\",\"\",IF(LEN(Tabel2[[#This Row],[Entiteit of attribuut]])=2,\"\",Tabel2[[#This Row],[Entiteit]]&\"_\"&Tabel2[[#This Row],[Entiteit of attribuut]]))","v":"BB_PCODE"},{"$f":"IF(Schema!I110=\"\",\"\",Schema!I110)","v":""},{"$f":"IF(Schema!J110=\"\",\"\",Schema!J110)","v":""},{"$f":"IF(Schema!K110=\"\",\"\",Schema!K110)","v":""},{"$f":"IF(Schema!L110=\"\",\"\",Schema!L110)","v":""},{"$f":"IF(Schema!N110=\"\",\"\",Schema!N110)","v":"O"}]
[{"$f":"Schema!A111&Schema!B111&Schema!C111&Schema!D111","v":"TOEGEBR"},"BB",{"$f":"IF(A104=\"\",\"\",IF(LEN(Schema!A111)=2,1,IF(LEN(Schema!B111)=2,10,IF(LEN(Schema!C111)=2,100,0))))","v":0},10,{"$f":"IF(A104=\"\",\"\",SUM(Tabel2[[#This Row],[I1]:[I2]]))","v":10},{"$error":"#REF!"},"BB","",{"$error":"#REF!"},{"$f":"IF(C104=\"\",\"\",IF(LEN(Tabel2[[#This Row],[Entiteit of attribuut]])=2,\"\",Tabel2[[#This Row],[Entiteit]]&\"_\"&Tabel2[[#This Row],[Entiteit of attribuut]]))","v":"BB_TOEGEBR"},{"$f":"IF(Schema!I111=\"\",\"\",Schema!I111)","v":""},{"$f":"IF(Schema!J111=\"\",\"\",Schema!J111)","v":""},{"$f":"IF(Schema!K111=\"\",\"\",Schema!K111)","v":""},{"$f":"IF(Schema!L111=\"\",\"\",Schema!L111)","v":""},{"$f":"IF(Schema!N111=\"\",\"\",Schema!N111)","v":"O"}]
[{"$f":"Schema!A112&Schema!B112&Schema!C112&Schema!D112","v":"TOEVOEG"},"BB",{"$f":"IF(A105=\"\",\"\",IF(LEN(Schema!A112)=2,1,IF(LEN(Schema!B112)=2,10,IF(LEN(Schema!C112)=2,100,0))))","v":0},10,{"$f":"IF(A105=\"\",\"\",SUM(Tabel2[[#This Row],[I1]:[I2]]))","v":10},{"$error":"#REF!"},"BB","",{"$error":"#REF!"},{"$f":"IF(C105=\"\",\"\",IF(LEN(Tabel2[[#This Row],[Entiteit of attribuut]])=2,\"\",Tabel2[[#This Row],[Entiteit]]&\"_\"&Tabel2[[#This Row],[Entiteit of attribuut]]))","v":"BB_TOEVOEG"},{"$f":"IF(Schema!I112=\"\",\"\",Schema!I112)","v":""},{"$f":"IF(Schema!J112=\"\",\"\",Schema!J112)","v":""},{"$f":"IF(Schema!K112=\"\",\"\",Schema!K112)","v":""},{"$f":"IF(Schema!L112=\"\",\"\",Schema!L112)","v":""},{"$f":"IF(Schema!N112=\"\",\"\",Schema!N112)","v":"O"}]
[{"$f":"Schema!A113&Schema!B113&Schema!C113&Schema!D113","v":"VOLGNUM"},"BB",{"$f":"IF(A106=\"\",\"\",IF(LEN(Schema!A113)=2,1,IF(LEN(Schema!B113)=2,10,IF(LEN(Schema!C113)=2,100,0))))","v":0},10,{"$f":"IF(A106=\"\",\"\",SUM(Tabel2[[#This Row],[I1]:[I2]]))","v":10},{"$error":"#REF!"},"BB","",{"$error":"#REF!"},{"$f":"IF(C106=\"\",\"\",IF(LEN(Tabel2[[#This Row],[Entiteit of attribuut]])=2,\"\",Tabel2[[#This Row],[Entiteit]]&\"_\"&Tabel2[[#This Row],[Entiteit of attribuut]]))","v":"BB_VOLGNUM"},{"$f":"IF(Schema!I113=\"\",\"\",Schema!I113)","v":""},{"$f":"IF(Schema!J113=\"\",\"\",Schema!J113)","v":""},{"$f":"IF(Schema!K113=\"\",\"\",Schema!K113)","v":""},{"$f":"IF(Schema!L113=\"\",\"\",Schema!L113)","v":""},{"$f":"IF(Schema!N113=\"\",\"\",Schema!N113)","v":"O"}]
[{"$f":"Schema!A114&Schema!B114&Schema!C114&Schema!D114","v":"IB"},"IB",{"$f":"IF(A107=\"\",\"\",IF(LEN(Schema!A114)=2,1,IF(LEN(Schema!B114)=2,10,IF(LEN(Schema!C114)=2,100,0))))","v":10},10,{"$f":"IF(A107=\"\",\"\",SUM(Tabel2[[#This Row],[I1]:[I2]]))","v":20},{"$error":"#REF!"},"IB","",{"$error":"#REF!"},{"$f":"IF(C107=\"\",\"\",IF(LEN(Tabel2[[#This Row],[Entiteit of attribuut]])=2,\"\",Tabel2[[#This Row],[Entiteit]]&\"_\"&Tabel2[[#This Row],[Entiteit of attribuut]]))","v":""},{"$f":"IF(Schema!I114=\"\",\"\",Schema!I114)","v":""},{"$f":"IF(Schema!J114=\"\",\"\",Schema!J114)","v":""},{"$f":"IF(Schema!K114=\"\",\"\",Schema!K114)","v":""},{"$f":"IF(Schema!L114=\"\",\"\",Schema!L114)","v":""},{"$f":"IF(Schema!N114=\"\",\"\",Schema!N114)","v":"O"}]
[{"$f":"Schema!A115&Schema!B115&Schema!C115&Schema!D115","v":"DAGWRDE"},"IB",{"$f":"IF(A108=\"\",\"\",IF(LEN(Schema!A115)=2,1,IF(LEN(Schema!B115)=2,10,IF(LEN(Schema!C115)=2,100,0))))","v":0},10,{"$f":"IF(A108=\"\",\"\",SUM(Tabel2[[#This Row],[I1]:[I2]]))","v":10},{"$error":"#REF!"},"IB","",{"$error":"#REF!"},{"$f":"IF(C108=\"\",\"\",IF(LEN(Tabel2[[#This Row],[Entiteit of attribuut]])=2,\"\",Tabel2[[#This Row],[Entiteit]]&\"_\"&Tabel2[[#This Row],[Entiteit of attribuut]]))","v":"IB_DAGWRDE"},{"$f":"IF(Schema!I115=\"\",\"\",Schema!I115)","v":""},{"$f":"IF(Schema!J115=\"\",\"\",Schema!J115)","v":""},{"$f":"IF(Schema!K115=\"\",\"\",Schema!K115)","v":""},{"$f":"IF(Schema!L115=\"\",\"\",Schema!L115)","v":""},{"$f":"IF(Schema!N115=\"\",\"\",Schema!N115)","v":"O"}]
[{"$f":"Schema!A116&Schema!B116&Schema!C116&Schema!D116","v":"VOLGNUM"},"IB",{"$f":"IF(A109=\"\",\"\",IF(LEN(Schema!A116)=2,1,IF(LEN(Schema!B116)=2,10,IF(LEN(Schema!C116)=2,100,0))))","v":0},10,{"$f":"IF(A109=\"\",\"\",SUM(Tabel2[[#This Row],[I1]:[I2]]))","v":10},{"$error":"#REF!"},"IB","",{"$error":"#REF!"},{"$f":"IF(C109=\"\",\"\",IF(LEN(Tabel2[[#This Row],[Entiteit of attribuut]])=2,\"\",Tabel2[[#This Row],[Entiteit]]&\"_\"&Tabel2[[#This Row],[Entiteit of attribuut]]))","v":"IB_VOLGNUM"},{"$f":"IF(Schema!I116=\"\",\"\",Schema!I116)","v":""},{"$f":"IF(Schema!J116=\"\",\"\",Schema!J116)","v":""},{"$f":"IF(Schema!K116=\"\",\"\",Schema!K116)","v":""},{"$f":"IF(Schema!L116=\"\",\"\",Schema!L116)","v":""},{"$f":"IF(Schema!N116=\"\",\"\",Schema!N116)","v":"O"}]
[{"$f":"Schema!A117&Schema!B117&Schema!C117&Schema!D117","v":"KH"},"KH",{"$f":"IF(A110=\"\",\"\",IF(LEN(Schema!A117)=2,1,IF(LEN(Schema!B117)=2,10,IF(LEN(Schema!C117)=2,100,0))))","v":10},10,{"$f":"IF(A110=\"\",\"\",SUM(Tabel2[[#This Row],[I1]:[I2]]))","v":20},{"$error":"#REF!"},"KH","",{"$error":"#REF!"},{"$f":"IF(C110=\"\",\"\",IF(LEN(Tabel2[[#This Row],[Entiteit of attribuut]])=2,\"\",Tabel2[[#This Row],[Entiteit]]&\"_\"&Tabel2[[#This Row],[Entiteit of attribuut]]))","v":""},{"$f":"IF(Schema!I117=\"\",\"\",Schema!I117)","v":""},{"$f":"IF(Schema!J117=\"\",\"\",Schema!J117)","v":""},{"$f":"IF(Schema!K117=\"\",\"\",Schema!K117)","v":""},{"$f":"IF(Schema!L117=\"\",\"\",Schema!L117)","v":""},{"$f":"IF(Schema!N117=\"\",\"\",Schema!N117)","v":"O"}]
[{"$f":"Schema!A118&Schema!B118&Schema!C118&Schema!D118","v":"DAGWRDE"},"KH",{"$f":"IF(A111=\"\",\"\",IF(LEN(Schema!A118)=2,1,IF(LEN(Schema!B118)=2,10,IF(LEN(Schema!C118)=2,100,0))))","v":0},10,{"$f":"IF(A111=\"\",\"\",SUM(Tabel2[[#This Row],[I1]:[I2]]))","v":10},{"$error":"#REF!"},"KH","",{"$error":"#REF!"},{"$f":"IF(C111=\"\",\"\",IF(LEN(Tabel2[[#This Row],[Entiteit of attribuut]])=2,\"\",Tabel2[[#This Row],[Entiteit]]&\"_\"&Tabel2[[#This Row],[Entiteit of attribuut]]))","v":"KH_DAGWRDE"},{"$f":"IF(Schema!I118=\"\",\"\",Schema!I118)","v":""},{"$f":"IF(Schema!J118=\"\",\"\",Schema!J118)","v":""},{"$f":"IF(Schema!K118=\"\",\"\",Schema!K118)","v":""},{"$f":"IF(Schema!L118=\"\",\"\",Schema!L118)","v":""},{"$f":"IF(Schema!N118=\"\",\"\",Schema!N118)","v":"O"}]
[{"$f":"Schema!A119&Schema!B119&Schema!C119&Schema!D119","v":"GEBRKBH "},"KH",{"$f":"IF(A112=\"\",\"\",IF(LEN(Schema!A119)=2,1,IF(LEN(Schema!B119)=2,10,IF(LEN(Schema!C119)=2,100,0))))","v":0},10,{"$f":"IF(A112=\"\",\"\",SUM(Tabel2[[#This Row],[I1]:[I2]]))","v":10},{"$error":"#REF!"},"KH","",{"$error":"#REF!"},{"$f":"IF(C112=\"\",\"\",IF(LEN(Tabel2[[#This Row],[Entiteit of attribuut]])=2,\"\",Tabel2[[#This Row],[Entiteit]]&\"_\"&Tabel2[[#This Row],[Entiteit of attribuut]]))","v":"KH_GEBRKBH "},{"$f":"IF(Schema!I119=\"\",\"\",Schema!I119)","v":""},{"$f":"IF(Schema!J119=\"\",\"\",Schema!J119)","v":""},{"$f":"IF(Schema!K119=\"\",\"\",Schema!K119)","v":""},{"$f":"IF(Schema!L119=\"\",\"\",Schema!L119)","v":""},{"$f":"IF(Schema!N119=\"\",\"\",Schema!N119)","v":"LEEG"}]
[{"$f":"Schema!A120&Schema!B120&Schema!C120&Schema!D120","v":"MERK"},"KH",{"$f":"IF(A113=\"\",\"\",IF(LEN(Schema!A120)=2,1,IF(LEN(Schema!B120)=2,10,IF(LEN(Schema!C120)=2,100,0))))","v":0},10,{"$f":"IF(A113=\"\",\"\",SUM(Tabel2[[#This Row],[I1]:[I2]]))","v":10},{"$error":"#REF!"},"KH","",{"$error":"#REF!"},{"$f":"IF(C113=\"\",\"\",IF(LEN(Tabel2[[#This Row],[Entiteit of attribuut]])=2,\"\",Tabel2[[#This Row],[Entiteit]]&\"_\"&Tabel2[[#This Row],[Entiteit of attribuut]]))","v":"KH_MERK"},{"$f":"IF(Schema!I120=\"\",\"\",Schema!I120)","v":""},{"$f":"IF(Schema!J120=\"\",\"\",Schema!J120)","v":""},{"$f":"IF(Schema!K120=\"\",\"\",Schema!K120)","v":""},{"$f":"IF(Schema!L120=\"\",\"\",Schema!L120)","v":""},{"$f":"IF(Schema!N120=\"\",\"\",Schema!N120)","v":"O"}]
[{"$f":"Schema!A121&Schema!B121&Schema!C121&Schema!D121","v":"SRTKBH"},"KH",{"$f":"IF(A114=\"\",\"\",IF(LEN(Schema!A121)=2,1,IF(LEN(Schema!B121)=2,10,IF(LEN(Schema!C121)=2,100,0))))","v":0},10,{"$f":"IF(A114=\"\",\"\",SUM(Tabel2[[#This Row],[I1]:[I2]]))","v":10},{"$error":"#REF!"},"KH","",{"$error":"#REF!"},{"$f":"IF(C114=\"\",\"\",IF(LEN(Tabel2[[#This Row],[Entiteit of attribuut]])=2,\"\",Tabel2[[#This Row],[Entiteit]]&\"_\"&Tabel2[[#This Row],[Entiteit of attribuut]]))","v":"KH_SRTKBH"},{"$f":"IF(Schema!I121=\"\",\"\",Schema!I121)","v":""},{"$f":"IF(Schema!J121=\"\",\"\",Schema!J121)","v":""},{"$f":"IF(Schema!K121=\"\",\"\",Schema!K121)","v":""},{"$f":"IF(Schema!L121=\"\",\"\",Schema!L121)","v":""},{"$f":"IF(Schema!N121=\"\",\"\",Schema!N121)","v":"LEEG"}]
[{"$f":"Schema!A122&Schema!B122&Schema!C122&Schema!D122","v":"TOEGEBR"},"KH",{"$f":"IF(A115=\"\",\"\",IF(LEN(Schema!A122)=2,1,IF(LEN(Schema!B122)=2,10,IF(LEN(Schema!C122)=2,100,0))))","v":0},10,{"$f":"IF(A115=\"\",\"\",SUM(Tabel2[[#This Row],[I1]:[I2]]))","v":10},{"$error":"#REF!"},"KH","",{"$error":"#REF!"},{"$f":"IF(C115=\"\",\"\",IF(LEN(Tabel2[[#This Row],[Entiteit of attribuut]])=2,\"\",Tabel2[[#This Row],[Entiteit]]&\"_\"&Tabel2[[#This Row],[Entiteit of attribuut]]))","v":"KH_TOEGEBR"},{"$f":"IF(Schema!I122=\"\",\"\",Schema!I122)","v":""},{"$f":"IF(Schema!J122=\"\",\"\",Schema!J122)","v":""},{"$f":"IF(Schema!K122=\"\",\"\",Schema!K122)","v":""},{"$f":"IF(Schema!L122=\"\",\"\",Schema!L122)","v":""},{"$f":"IF(Schema!N122=\"\",\"\",Schema!N122)","v":"O"}]
[{"$f":"Schema!A123&Schema!B123&Schema!C123&Schema!D123","v":"TYPE"},"KH",{"$f":"IF(A116=\"\",\"\",IF(LEN(Schema!A123)=2,1,IF(LEN(Schema!B123)=2,10,IF(LEN(Schema!C123)=2,100,0))))","v":0},10,{"$f":"IF(A116=\"\",\"\",SUM(Tabel2[[#This Row],[I1]:[I2]]))","v":10},{"$error":"#REF!"},"KH","",{"$error":"#REF!"},{"$f":"IF(C116=\"\",\"\",IF(LEN(Tabel2[[#This Row],[Entiteit of attribuut]])=2,\"\",Tabel2[[#This Row],[Entiteit]]&\"_\"&Tabel2[[#This Row],[Entiteit of attribuut]]))","v":"KH_TYPE"},{"$f":"IF(Schema!I123=\"\",\"\",Schema!I123)","v":""},{"$f":"IF(Schema!J123=\"\",\"\",Schema!J123)","v":""},{"$f":"IF(Schema!K123=\"\",\"\",Schema!K123)","v":""},{"$f":"IF(Schema!L123=\"\",\"\",Schema!L123)","v":""},{"$f":"IF(Schema!N123=\"\",\"\",Schema!N123)","v":"O"}]
[{"$f":"Schema!A124&Schema!B124&Schema!C124&Schema!D124","v":"VOLGNUM"},"KH",{"$f":"IF(A117=\"\",\"\",IF(LEN(Schema!A124)=2,1,IF(LEN(Schema!B124)=2,10,IF(LEN(Schema!C124)=2,100,0))))","v":0},10,{"$f":"IF(A117=\"\",\"\",SUM(Tabel2[[#This Row],[I1]:[I2]]))","v":10},{"$error":"#REF!"},"KH","",{"$error":"#REF!"},{"$f":"IF(C117=\"\",\"\",IF(LEN(Tabel2[[#This Row],[Entiteit of attribuut]])=2,\"\",Tabel2[[#This Row],[Entiteit]]&\"_\"&Tabel2[[#This Row],[Entiteit of attribuut]]))","v":"KH_VOLGNUM"},{"$f":"IF(Schema!I124=\"\",\"\",Schema!I124)","v":""},{"$f":"IF(Schema!J124=\"\",\"\",Schema!J124)","v":""},{"$f":"IF(Schema!K124=\"\",\"\",Schema!K124)","v":""},{"$f":"IF(Schema!L124=\"\",\"\",Schema!L124)","v":""},{"$f":"IF(Schema!N124=\"\",\"\",Schema!N124)","v":"O"}]
[{"$f":"Schema!A125&Schema!B125&Schema!C125&Schema!D125","v":"AU"},"AU",{"$f":"IF(A118=\"\",\"\",IF(LEN(Schema!A125)=2,1,IF(LEN(Schema!B125)=2,10,IF(LEN(Schema!C125)=2,100,0))))","v":10},10,{"$f":"IF(A118=\"\",\"\",SUM(Tabel2[[#This Row],[I1]:[I2]]))","v":20},{"$error":"#REF!"},"AU","",{"$error":"#REF!"},{"$f":"IF(C118=\"\",\"\",IF(LEN(Tabel2[[#This Row],[Entiteit of attribuut]])=2,\"\",Tabel2[[#This Row],[Entiteit]]&\"_\"&Tabel2[[#This Row],[Entiteit of attribuut]]))","v":""},{"$f":"IF(Schema!I125=\"\",\"\",Schema!I125)","v":""},{"$f":"IF(Schema!J125=\"\",\"\",Schema!J125)","v":""},{"$f":"IF(Schema!K125=\"\",\"\",Schema!K125)","v":""},{"$f":"IF(Schema!L125=\"\",\"\",Schema!L125)","v":""},{"$f":"IF(Schema!N125=\"\",\"\",Schema!N125)","v":"O"}]
[{"$f":"Schema!A126&Schema!B126&Schema!C126&Schema!D126","v":"BAFWST"},"AU",{"$f":"IF(A119=\"\",\"\",IF(LEN(Schema!A126)=2,1,IF(LEN(Schema!B126)=2,10,IF(LEN(Schema!C126)=2,100,0))))","v":0},10,{"$f":"IF(A119=\"\",\"\",SUM(Tabel2[[#This Row],[I1]:[I2]]))","v":10},{"$error":"#REF!"},"AU","",{"$error":"#REF!"},{"$f":"IF(C119=\"\",\"\",IF(LEN(Tabel2[[#This Row],[Entiteit of attribuut]])=2,\"\",Tabel2[[#This Row],[Entiteit]]&\"_\"&Tabel2[[#This Row],[Entiteit of attribuut]]))","v":"AU_BAFWST"},{"$f":"IF(Schema!I126=\"\",\"\",Schema!I126)","v":""},{"$f":"IF(Schema!J126=\"\",\"\",Schema!J126)","v":""},{"$f":"IF(Schema!K126=\"\",\"\",Schema!K126)","v":""},{"$f":"IF(Schema!L126=\"\",\"\",Schema!L126)","v":""},{"$f":"IF(Schema!N126=\"\",\"\",Schema!N126)","v":"O"}]
[{"$f":"Schema!A127&Schema!B127&Schema!C127&Schema!D127","v":"BTP"},"AU",{"$f":"IF(A120=\"\",\"\",IF(LEN(Schema!A127)=2,1,IF(LEN(Schema!B127)=2,10,IF(LEN(Schema!C127)=2,100,0))))","v":0},10,{"$f":"IF(A120=\"\",\"\",SUM(Tabel2[[#This Row],[I1]:[I2]]))","v":10},{"$error":"#REF!"},"AU","",{"$error":"#REF!"},{"$f":"IF(C120=\"\",\"\",IF(LEN(Tabel2[[#This Row],[Entiteit of attribuut]])=2,\"\",Tabel2[[#This Row],[Entiteit]]&\"_\"&Tabel2[[#This Row],[Entiteit of attribuut]]))","v":"AU_BTP"},{"$f":"IF(Schema!I127=\"\",\"\",Schema!I127)","v":""},{"$f":"IF(Schema!J127=\"\",\"\",Schema!J127)","v":""},{"$f":"IF(Schema!K127=\"\",\"\",Schema!K127)","v":""},{"$f":"IF(Schema!L127=\"\",\"\",Schema!L127)","v":""},{"$f":"IF(Schema!N127=\"\",\"\",Schema!N127)","v":"LEEG"}]
[{"$f":"Schema!A128&Schema!B128&Schema!C128&Schema!D128","v":"CODE"},"AU",{"$f":"IF(A121=\"\",\"\",IF(LEN(Schema!A128)=2,1,IF(LEN(Schema!B128)=2,10,IF(LEN(Schema!C128)=2,100,0))))","v":0},10,{"$f":"IF(A121=\"\",\"\",SUM(Tabel2[[#This Row],[I1]:[I2]]))","v":10},{"$error":"#REF!"},"AU","",{"$error":"#REF!"},{"$f":"IF(C121=\"\",\"\",IF(LEN(Tabel2[[#This Row],[Entiteit of attribuut]])=2,\"\",Tabel2[[#This Row],[Entiteit]]&\"_\"&Tabel2[[#This Row],[Entiteit of attribuut]]))","v":"AU_CODE"},{"$f":"IF(Schema!I128=\"\",\"\",Schema!I128)","v":""},{"$f":"IF(Schema!J128=\"\",\"\",Schema!J128)","v":""},{"$f":"IF(Schema!K128=\"\",\"\",Schema!K128)","v":""},{"$f":"IF(Schema!L128=\"\",\"\",Schema!L128)","v":""},{"$f":"IF(Schema!N128=\"\",\"\",Schema!N128)","v":"O"}]
[{"$f":"Schema!A129&Schema!B129&Schema!C129&Schema!D129","v":"COLFACT"},"AU",{"$f":"IF(A122=\"\",\"\",IF(LEN(Schema!A129)=2,1,IF(LEN(Schema!B129)=2,10,IF(LEN(Schema!C129)=2,100,0))))","v":0},10,{"$f":"IF(A122=\"\",\"\",SUM(Tabel2[[#This Row],[I1]:[I2]]))","v":10},{"$error":"#REF!"},"AU","",{"$error":"#REF!"},{"$f":"IF(C122=\"\",\"\",IF(LEN(Tabel2[[#This Row],[Entiteit of attribuut]])=2,\"\",Tabel2[[#This Row],[Entiteit]]&\"_\"&Tabel2[[#This Row],[Entiteit of attribuut]]))","v":"AU_COLFACT"},{"$f":"IF(Schema!I129=\"\",\"\",Schema!I129)","v":""},{"$f":"IF(Schema!J129=\"\",\"\",Schema!J129)","v":""},{"$f":"IF(Schema!K129=\"\",\"\",Schema!K129)","v":""},{"$f":"IF(Schema!L129=\"\",\"\",Schema!L129)","v":""},{"$f":"IF(Schema!N129=\"\",\"\",Schema!N129)","v":"O"}]
[{"$f":"Schema!A130&Schema!B130&Schema!C130&Schema!D130","v":"ERB"},"AU",{"$f":"IF(A123=\"\",\"\",IF(LEN(Schema!A130)=2,1,IF(LEN(Schema!B130)=2,10,IF(LEN(Schema!C130)=2,100,0))))","v":0},10,{"$f":"IF(A123=\"\",\"\",SUM(Tabel2[[#This Row],[I1]:[I2]]))","v":10},{"$error":"#REF!"},"AU","",{"$error":"#REF!"},{"$f":"IF(C123=\"\",\"\",IF(LEN(Tabel2[[#This Row],[Entiteit of attribuut]])=2,\"\",Tabel2[[#This Row],[Entiteit]]&\"_\"&Tabel2[[#This Row],[Entiteit of attribuut]]))","v":"AU_ERB"},{"$f":"IF(Schema!I130=\"\",\"\",Schema!I130)","v":""},{"$f":"IF(Schema!J130=\"\",\"\",Schema!J130)","v":""},{"$f":"IF(Schema!K130=\"\",\"\",Schema!K130)","v":""},{"$f":"IF(Schema!L130=\"\",\"\",Schema!L130)","v":""},{"$f":"IF(Schema!N130=\"\",\"\",Schema!N130)","v":"O"}]
[{"$f":"Schema!A131&Schema!B131&Schema!C131&Schema!D131","v":"GADEKCD"},"AU",{"$f":"IF(A124=\"\",\"\",IF(LEN(Schema!A131)=2,1,IF(LEN(Schema!B131)=2,10,IF(LEN(Schema!C131)=2,100,0))))","v":0},10,{"$f":"IF(A124=\"\",\"\",SUM(Tabel2[[#This Row],[I1]:[I2]]))","v":10},{"$error":"#REF!"},"AU","",{"$error":"#REF!"},{"$f":"IF(C124=\"\",\"\",IF(LEN(Tabel2[[#This Row],[Entiteit of attribuut]])=2,\"\",Tabel2[[#This Row],[Entiteit]]&\"_\"&Tabel2[[#This Row],[Entiteit of attribuut]]))","v":"AU_GADEKCD"},{"$f":"IF(Schema!I131=\"\",\"\",Schema!I131)","v":""},{"$f":"IF(Schema!J131=\"\",\"\",Schema!J131)","v":""},{"$f":"IF(Schema!K131=\"\",\"\",Schema!K131)","v":""},{"$f":"IF(Schema!L131=\"\",\"\",Schema!L131)","v":""},{"$f":"IF(Schema!N131=\"\",\"\",Schema!N131)","v":"V"}]
[{"$f":"Schema!A132&Schema!B132&Schema!C132&Schema!D132","v":"GADEKCO"},"AU",{"$f":"IF(A125=\"\",\"\",IF(LEN(Schema!A132)=2,1,IF(LEN(Schema!B132)=2,10,IF(LEN(Schema!C132)=2,100,0))))","v":0},10,{"$f":"IF(A125=\"\",\"\",SUM(Tabel2[[#This Row],[I1]:[I2]]))","v":10},{"$error":"#REF!"},"AU","",{"$error":"#REF!"},{"$f":"IF(C125=\"\",\"\",IF(LEN(Tabel2[[#This Row],[Entiteit of attribuut]])=2,\"\",Tabel2[[#This Row],[Entiteit]]&\"_\"&Tabel2[[#This Row],[Entiteit of attribuut]]))","v":"AU_GADEKCO"},{"$f":"IF(Schema!I132=\"\",\"\",Schema!I132)","v":""},{"$f":"IF(Schema!J132=\"\",\"\",Schema!J132)","v":""},{"$f":"IF(Schema!K132=\"\",\"\",Schema!K132)","v":""},{"$f":"IF(Schema!L132=\"\",\"\",Schema!L132)","v":""},{"$f":"IF(Schema!N132=\"\",\"\",Schema!N132)","v":"V"}]
[{"$f":"Schema!A133&Schema!B133&Schema!C133&Schema!D133","v":"MYCODE"},"AU",{"$f":"IF(A126=\"\",\"\",IF(LEN(Schema!A133)=2,1,IF(LEN(Schema!B133)=2,10,IF(LEN(Schema!C133)=2,100,0))))","v":0},10,{"$f":"IF(A126=\"\",\"\",SUM(Tabel2[[#This Row],[I1]:[I2]]))","v":10},{"$error":"#REF!"},"AU","",{"$error":"#REF!"},{"$f":"IF(C126=\"\",\"\",IF(LEN(Tabel2[[#This Row],[Entiteit of attribuut]])=2,\"\",Tabel2[[#This Row],[Entiteit]]&\"_\"&Tabel2[[#This Row],[Entiteit of attribuut]]))","v":"AU_MYCODE"},{"$f":"IF(Schema!I133=\"\",\"\",Schema!I133)","v":""},{"$f":"IF(Schema!J133=\"\",\"\",Schema!J133)","v":""},{"$f":"IF(Schema!K133=\"\",\"\",Schema!K133)","v":""},{"$f":"IF(Schema!L133=\"\",\"\",Schema!L133)","v":""},{"$f":"IF(Schema!N133=\"\",\"\",Schema!N133)","v":"O"}]
[{"$f":"Schema!A134&Schema!B134&Schema!C134&Schema!D134","v":"NJP"},"AU",{"$f":"IF(A127=\"\",\"\",IF(LEN(Schema!A134)=2,1,IF(LEN(Schema!B134)=2,10,IF(LEN(Schema!C134)=2,100,0))))","v":0},10,{"$f":"IF(A127=\"\",\"\",SUM(Tabel2[[#This Row],[I1]:[I2]]))","v":10},{"$error":"#REF!"},"AU","",{"$error":"#REF!"},{"$f":"IF(C127=\"\",\"\",IF(LEN(Tabel2[[#This Row],[Entiteit of attribuut]])=2,\"\",Tabel2[[#This Row],[Entiteit]]&\"_\"&Tabel2[[#This Row],[Entiteit of attribuut]]))","v":"AU_NJP"},{"$f":"IF(Schema!I134=\"\",\"\",Schema!I134)","v":""},{"$f":"IF(Schema!J134=\"\",\"\",Schema!J134)","v":""},{"$f":"IF(Schema!K134=\"\",\"\",Schema!K134)","v":""},{"$f":"IF(Schema!L134=\"\",\"\",Schema!L134)","v":""},{"$f":"IF(Schema!N134=\"\",\"\",Schema!N134)","v":"O"}]
[{"$f":"Schema!A135&Schema!B135&Schema!C135&Schema!D135","v":"PAFWST"},"AU",{"$f":"IF(A128=\"\",\"\",IF(LEN(Schema!A135)=2,1,IF(LEN(Schema!B135)=2,10,IF(LEN(Schema!C135)=2,100,0))))","v":0},10,{"$f":"IF(A128=\"\",\"\",SUM(Tabel2[[#This Row],[I1]:[I2]]))","v":10},{"$error":"#REF!"},"AU","",{"$error":"#REF!"},{"$f":"IF(C128=\"\",\"\",IF(LEN(Tabel2[[#This Row],[Entiteit of attribuut]])=2,\"\",Tabel2[[#This Row],[Entiteit]]&\"_\"&Tabel2[[#This Row],[Entiteit of attribuut]]))","v":"AU_PAFWST"},{"$f":"IF(Schema!I135=\"\",\"\",Schema!I135)","v":""},{"$f":"IF(Schema!J135=\"\",\"\",Schema!J135)","v":""},{"$f":"IF(Schema!K135=\"\",\"\",Schema!K135)","v":""},{"$f":"IF(Schema!L135=\"\",\"\",Schema!L135)","v":""},{"$f":"IF(Schema!N135=\"\",\"\",Schema!N135)","v":"O"}]
[{"$f":"Schema!A136&Schema!B136&Schema!C136&Schema!D136","v":"PPRC"},"AU",{"$f":"IF(A129=\"\",\"\",IF(LEN(Schema!A136)=2,1,IF(LEN(Schema!B136)=2,10,IF(LEN(Schema!C136)=2,100,0))))","v":0},10,{"$f":"IF(A129=\"\",\"\",SUM(Tabel2[[#This Row],[I1]:[I2]]))","v":10},{"$error":"#REF!"},"AU","",{"$error":"#REF!"},{"$f":"IF(C129=\"\",\"\",IF(LEN(Tabel2[[#This Row],[Entiteit of attribuut]])=2,\"\",Tabel2[[#This Row],[Entiteit]]&\"_\"&Tabel2[[#This Row],[Entiteit of attribuut]]))","v":"AU_PPRC"},{"$f":"IF(Schema!I136=\"\",\"\",Schema!I136)","v":""},{"$f":"IF(Schema!J136=\"\",\"\",Schema!J136)","v":""},{"$f":"IF(Schema!K136=\"\",\"\",Schema!K136)","v":""},{"$f":"IF(Schema!L136=\"\",\"\",Schema!L136)","v":""},{"$f":"IF(Schema!N136=\"\",\"\",Schema!N136)","v":"O"}]
[{"$f":"Schema!A137&Schema!B137&Schema!C137&Schema!D137","v":"PRCPKKT"},"AU",{"$f":"IF(A130=\"\",\"\",IF(LEN(Schema!A137)=2,1,IF(LEN(Schema!B137)=2,10,IF(LEN(Schema!C137)=2,100,0))))","v":0},10,{"$f":"IF(A130=\"\",\"\",SUM(Tabel2[[#This Row],[I1]:[I2]]))","v":10},{"$error":"#REF!"},"AU","",{"$error":"#REF!"},{"$f":"IF(C130=\"\",\"\",IF(LEN(Tabel2[[#This Row],[Entiteit of attribuut]])=2,\"\",Tabel2[[#This Row],[Entiteit]]&\"_\"&Tabel2[[#This Row],[Entiteit of attribuut]]))","v":"AU_PRCPKKT"},{"$f":"IF(Schema!I137=\"\",\"\",Schema!I137)","v":""},{"$f":"IF(Schema!J137=\"\",\"\",Schema!J137)","v":""},{"$f":"IF(Schema!K137=\"\",\"\",Schema!K137)","v":""},{"$f":"IF(Schema!L137=\"\",\"\",Schema!L137)","v":""},{"$f":"IF(Schema!N137=\"\",\"\",Schema!N137)","v":"O"}]
[{"$f":"Schema!A138&Schema!B138&Schema!C138&Schema!D138","v":"PRCTEKC"},{"$f":"IF(LEN(A131)=2,A131,IF(A131=\"\",\"Leeg\",B130))","v":"AU"},{"$f":"IF(A131=\"\",\"\",IF(LEN(Schema!A138)=2,1,IF(LEN(Schema!B138)=2,10,IF(LEN(Schema!C138)=2,100,0))))","v":0},{"$f":"IF(C131=0,D130,C131)","v":10},{"$f":"IF(A131=\"\",\"\",SUM(Tabel2[[#This Row],[I1]:[I2]]))","v":10},{"$f":"IF(A131=\"\",\"\",IF(C131=1,B131,F130))","v":{"$error":"#REF!"}},{"$f":"IF(C131=10,A131,IF(OR(C131=0,C131=100),G130,\"\"))","v":"AU"},{"$f":"IF(E131=200,B131,IF(C131=0,H130,\"\"))","v":""},{"$f":"IF(C131=\"\",\"\",IF(OR(E131=1,E131=10,E131=100),I130,IF(E131=2,F131,IF(E131=20,F131&\"/\"&G131,IF(E131=200,F131&\"/\"&G131&\"/\"&H131)))))","v":{"$error":"#REF!"}},{"$f":"IF(C131=\"\",\"\",IF(LEN(Tabel2[[#This Row],[Entiteit of attribuut]])=2,\"\",Tabel2[[#This Row],[Entiteit]]&\"_\"&Tabel2[[#This Row],[Entiteit of attribuut]]))","v":"AU_PRCTEKC"},{"$f":"IF(Schema!I138=\"\",\"\",Schema!I138)","v":""},{"$f":"IF(Schema!J138=\"\",\"\",Schema!J138)","v":""},{"$f":"IF(Schema!K138=\"\",\"\",Schema!K138)","v":""},{"$f":"IF(Schema!L138=\"\",\"\",Schema!L138)","v":""},{"$f":"IF(Schema!N138=\"\",\"\",Schema!N138)","v":"O"}]
[{"$f":"Schema!A139&Schema!B139&Schema!C139&Schema!D139","v":"RELVRH"},"AU",{"$f":"IF(A132=\"\",\"\",IF(LEN(Schema!A139)=2,1,IF(LEN(Schema!B139)=2,10,IF(LEN(Schema!C139)=2,100,0))))","v":0},10,{"$f":"IF(A132=\"\",\"\",SUM(Tabel2[[#This Row],[I1]:[I2]]))","v":10},{"$error":"#REF!"},"AU","",{"$error":"#REF!"},{"$f":"IF(C132=\"\",\"\",IF(LEN(Tabel2[[#This Row],[Entiteit of attribuut]])=2,\"\",Tabel2[[#This Row],[Entiteit]]&\"_\"&Tabel2[[#This Row],[Entiteit of attribuut]]))","v":"AU_RELVRH"},{"$f":"IF(Schema!I139=\"\",\"\",Schema!I139)","v":""},{"$f":"IF(Schema!J139=\"\",\"\",Schema!J139)","v":""},{"$f":"IF(Schema!K139=\"\",\"\",Schema!K139)","v":""},{"$f":"IF(Schema!L139=\"\",\"\",Schema!L139)","v":""},{"$f":"IF(Schema!N139=\"\",\"\",Schema!N139)","v":"O"}]
[{"$f":"Schema!A140&Schema!B140&Schema!C140&Schema!D140","v":"RELVVNR"},"AU",{"$f":"IF(A133=\"\",\"\",IF(LEN(Schema!A140)=2,1,IF(LEN(Schema!B140)=2,10,IF(LEN(Schema!C140)=2,100,0))))","v":0},10,{"$f":"IF(A133=\"\",\"\",SUM(Tabel2[[#This Row],[I1]:[I2]]))","v":10},{"$error":"#REF!"},"AU","",{"$error":"#REF!"},{"$f":"IF(C133=\"\",\"\",IF(LEN(Tabel2[[#This Row],[Entiteit of attribuut]])=2,\"\",Tabel2[[#This Row],[Entiteit]]&\"_\"&Tabel2[[#This Row],[Entiteit of attribuut]]))","v":"AU_RELVVNR"},{"$f":"IF(Schema!I140=\"\",\"\",Schema!I140)","v":""},{"$f":"IF(Schema!J140=\"\",\"\",Schema!J140)","v":""},{"$f":"IF(Schema!K140=\"\",\"\",Schema!K140)","v":""},{"$f":"IF(Schema!L140=\"\",\"\",Schema!L140)","v":""},{"$f":"IF(Schema!N140=\"\",\"\",Schema!N140)","v":"O"}]
[{"$f":"Schema!A141&Schema!B141&Schema!C141&Schema!D141","v":"RJRCOR"},"AU",{"$f":"IF(A134=\"\",\"\",IF(LEN(Schema!A141)=2,1,IF(LEN(Schema!B141)=2,10,IF(LEN(Schema!C141)=2,100,0))))","v":0},10,{"$f":"IF(A134=\"\",\"\",SUM(Tabel2[[#This Row],[I1]:[I2]]))","v":10},{"$error":"#REF!"},"AU","",{"$error":"#REF!"},{"$f":"IF(C134=\"\",\"\",IF(LEN(Tabel2[[#This Row],[Entiteit of attribuut]])=2,\"\",Tabel2[[#This Row],[Entiteit]]&\"_\"&Tabel2[[#This Row],[Entiteit of attribuut]]))","v":"AU_RJRCOR"},{"$f":"IF(Schema!I141=\"\",\"\",Schema!I141)","v":""},{"$f":"IF(Schema!J141=\"\",\"\",Schema!J141)","v":""},{"$f":"IF(Schema!K141=\"\",\"\",Schema!K141)","v":""},{"$f":"IF(Schema!L141=\"\",\"\",Schema!L141)","v":""},{"$f":"IF(Schema!N141=\"\",\"\",Schema!N141)","v":"O"}]
[{"$f":"Schema!A142&Schema!B142&Schema!C142&Schema!D142","v":"TCORBDR"},"AU",{"$f":"IF(A135=\"\",\"\",IF(LEN(Schema!A142)=2,1,IF(LEN(Schema!B142)=2,10,IF(LEN(Schema!C142)=2,100,0))))","v":0},10,{"$f":"IF(A135=\"\",\"\",SUM(Tabel2[[#This Row],[I1]:[I2]]))","v":10},{"$error":"#REF!"},"AU","",{"$error":"#REF!"},{"$f":"IF(C135=\"\",\"\",IF(LEN(Tabel2[[#This Row],[Entiteit of attribuut]])=2,\"\",Tabel2[[#This Row],[Entiteit]]&\"_\"&Tabel2[[#This Row],[Entiteit of attribuut]]))","v":"AU_TCORBDR"},{"$f":"IF(Schema!I142=\"\",\"\",Schema!I142)","v":""},{"$f":"IF(Schema!J142=\"\",\"\",Schema!J142)","v":""},{"$f":"IF(Schema!K142=\"\",\"\",Schema!K142)","v":""},{"$f":"IF(Schema!L142=\"\",\"\",Schema!L142)","v":""},{"$f":"IF(Schema!N142=\"\",\"\",Schema!N142)","v":"O"}]
[{"$f":"Schema!A143&Schema!B143&Schema!C143&Schema!D143","v":"VEERB"},"AU",{"$f":"IF(A136=\"\",\"\",IF(LEN(Schema!A143)=2,1,IF(LEN(Schema!B143)=2,10,IF(LEN(Schema!C143)=2,100,0))))","v":0},10,{"$f":"IF(A136=\"\",\"\",SUM(Tabel2[[#This Row],[I1]:[I2]]))","v":10},{"$error":"#REF!"},"AU","",{"$error":"#REF!"},{"$f":"IF(C136=\"\",\"\",IF(LEN(Tabel2[[#This Row],[Entiteit of attribuut]])=2,\"\",Tabel2[[#This Row],[Entiteit]]&\"_\"&Tabel2[[#This Row],[Entiteit of attribuut]]))","v":"AU_VEERB"},{"$f":"IF(Schema!I143=\"\",\"\",Schema!I143)","v":""},{"$f":"IF(Schema!J143=\"\",\"\",Schema!J143)","v":""},{"$f":"IF(Schema!K143=\"\",\"\",Schema!K143)","v":""},{"$f":"IF(Schema!L143=\"\",\"\",Schema!L143)","v":""},{"$f":"IF(Schema!N143=\"\",\"\",Schema!N143)","v":"LEEG"}]
[{"$f":"Schema!A144&Schema!B144&Schema!C144&Schema!D144","v":"VERZSOM"},"AU",{"$f":"IF(A137=\"\",\"\",IF(LEN(Schema!A144)=2,1,IF(LEN(Schema!B144)=2,10,IF(LEN(Schema!C144)=2,100,0))))","v":0},10,{"$f":"IF(A137=\"\",\"\",SUM(Tabel2[[#This Row],[I1]:[I2]]))","v":10},{"$error":"#REF!"},"AU","",{"$error":"#REF!"},{"$f":"IF(C137=\"\",\"\",IF(LEN(Tabel2[[#This Row],[Entiteit of attribuut]])=2,\"\",Tabel2[[#This Row],[Entiteit]]&\"_\"&Tabel2[[#This Row],[Entiteit of attribuut]]))","v":"AU_VERZSOM"},{"$f":"IF(Schema!I144=\"\",\"\",Schema!I144)","v":""},{"$f":"IF(Schema!J144=\"\",\"\",Schema!J144)","v":""},{"$f":"IF(Schema!K144=\"\",\"\",Schema!K144)","v":""},{"$f":"IF(Schema!L144=\"\",\"\",Schema!L144)","v":""},{"$f":"IF(Schema!N144=\"\",\"\",Schema!N144)","v":"O"}]
[{"$f":"Schema!A145&Schema!B145&Schema!C145&Schema!D145","v":"VGBRA"},"AU",{"$f":"IF(A138=\"\",\"\",IF(LEN(Schema!A145)=2,1,IF(LEN(Schema!B145)=2,10,IF(LEN(Schema!C145)=2,100,0))))","v":0},10,{"$f":"IF(A138=\"\",\"\",SUM(Tabel2[[#This Row],[I1]:[I2]]))","v":10},{"$error":"#REF!"},"AU","",{"$error":"#REF!"},{"$f":"IF(C138=\"\",\"\",IF(LEN(Tabel2[[#This Row],[Entiteit of attribuut]])=2,\"\",Tabel2[[#This Row],[Entiteit]]&\"_\"&Tabel2[[#This Row],[Entiteit of attribuut]]))","v":"AU_VGBRA"},{"$f":"IF(Schema!I145=\"\",\"\",Schema!I145)","v":""},{"$f":"IF(Schema!J145=\"\",\"\",Schema!J145)","v":""},{"$f":"IF(Schema!K145=\"\",\"\",Schema!K145)","v":""},{"$f":"IF(Schema!L145=\"\",\"\",Schema!L145)","v":""},{"$f":"IF(Schema!N145=\"\",\"\",Schema!N145)","v":"O"}]
[{"$f":"Schema!A146&Schema!B146&Schema!C146&Schema!D146","v":"VOLGNUM"},"AU",{"$f":"IF(A139=\"\",\"\",IF(LEN(Schema!A146)=2,1,IF(LEN(Schema!B146)=2,10,IF(LEN(Schema!C146)=2,100,0))))","v":0},10,{"$f":"IF(A139=\"\",\"\",SUM(Tabel2[[#This Row],[I1]:[I2]]))","v":10},{"$error":"#REF!"},"AU","",{"$error":"#REF!"},{"$f":"IF(C139=\"\",\"\",IF(LEN(Tabel2[[#This Row],[Entiteit of attribuut]])=2,\"\",Tabel2[[#This Row],[Entiteit]]&\"_\"&Tabel2[[#This Row],[Entiteit of attribuut]]))","v":"AU_VOLGNUM"},{"$f":"IF(Schema!I146=\"\",\"\",Schema!I146)","v":""},{"$f":"IF(Schema!J146=\"\",\"\",Schema!J146)","v":""},{"$f":"IF(Schema!K146=\"\",\"\",Schema!K146)","v":""},{"$f":"IF(Schema!L146=\"\",\"\",Schema!L146)","v":""},{"$f":"IF(Schema!N146=\"\",\"\",Schema!N146)","v":"LEEG"}]
[{"$f":"Schema!A147&Schema!B147&Schema!C147&Schema!D147","v":"VRWRKCD"},"AU",{"$f":"IF(A140=\"\",\"\",IF(LEN(Schema!A147)=2,1,IF(LEN(Schema!B147)=2,10,IF(LEN(Schema!C147)=2,100,0))))","v":0},10,{"$f":"IF(A140=\"\",\"\",SUM(Tabel2[[#This Row],[I1]:[I2]]))","v":10},{"$error":"#REF!"},"AU","",{"$error":"#REF!"},{"$f":"IF(C140=\"\",\"\",IF(LEN(Tabel2[[#This Row],[Entiteit of attribuut]])=2,\"\",Tabel2[[#This Row],[Entiteit]]&\"_\"&Tabel2[[#This Row],[Entiteit of attribuut]]))","v":"AU_VRWRKCD"},{"$f":"IF(Schema!I147=\"\",\"\",Schema!I147)","v":""},{"$f":"IF(Schema!J147=\"\",\"\",Schema!J147)","v":""},{"$f":"IF(Schema!K147=\"\",\"\",Schema!K147)","v":""},{"$f":"IF(Schema!L147=\"\",\"\",Schema!L147)","v":""},{"$f":"IF(Schema!N147=\"\",\"\",Schema!N147)","v":"LEEG"}]
[{"$f":"Schema!A148&Schema!B148&Schema!C148&Schema!D148","v":"WPREMBP"},"AU",{"$f":"IF(A141=\"\",\"\",IF(LEN(Schema!A148)=2,1,IF(LEN(Schema!B148)=2,10,IF(LEN(Schema!C148)=2,100,0))))","v":0},10,{"$f":"IF(A141=\"\",\"\",SUM(Tabel2[[#This Row],[I1]:[I2]]))","v":10},{"$error":"#REF!"},"AU","",{"$error":"#REF!"},{"$f":"IF(C141=\"\",\"\",IF(LEN(Tabel2[[#This Row],[Entiteit of attribuut]])=2,\"\",Tabel2[[#This Row],[Entiteit]]&\"_\"&Tabel2[[#This Row],[Entiteit of attribuut]]))","v":"AU_WPREMBP"},{"$f":"IF(Schema!I148=\"\",\"\",Schema!I148)","v":""},{"$f":"IF(Schema!J148=\"\",\"\",Schema!J148)","v":""},{"$f":"IF(Schema!K148=\"\",\"\",Schema!K148)","v":""},{"$f":"IF(Schema!L148=\"\",\"\",Schema!L148)","v":""},{"$f":"IF(Schema!N148=\"\",\"\",Schema!N148)","v":"O"}]
[{"$f":"Schema!A149&Schema!B149&Schema!C149&Schema!D149","v":"MP"},"MP",{"$f":"IF(A142=\"\",\"\",IF(LEN(Schema!A149)=2,1,IF(LEN(Schema!B149)=2,10,IF(LEN(Schema!C149)=2,100,0))))","v":100},100,{"$f":"IF(A142=\"\",\"\",SUM(Tabel2[[#This Row],[I1]:[I2]]))","v":200},{"$error":"#REF!"},"AU","MP",{"$error":"#REF!"},{"$f":"IF(C142=\"\",\"\",IF(LEN(Tabel2[[#This Row],[Entiteit of attribuut]])=2,\"\",Tabel2[[#This Row],[Entiteit]]&\"_\"&Tabel2[[#This Row],[Entiteit of attribuut]]))","v":""},{"$f":"IF(Schema!I149=\"\",\"\",Schema!I149)","v":""},{"$f":"IF(Schema!J149=\"\",\"\",Schema!J149)","v":""},{"$f":"IF(Schema!K149=\"\",\"\",Schema!K149)","v":""},{"$f":"IF(Schema!L149=\"\",\"\",Schema!L149)","v":""},{"$f":"IF(Schema!N149=\"\",\"\",Schema!N149)","v":"O"}]
[{"$f":"Schema!A150&Schema!B150&Schema!C150&Schema!D150","v":"MYAAND"},"MP",{"$f":"IF(A143=\"\",\"\",IF(LEN(Schema!A150)=2,1,IF(LEN(Schema!B150)=2,10,IF(LEN(Schema!C150)=2,100,0))))","v":0},100,{"$f":"IF(A143=\"\",\"\",SUM(Tabel2[[#This Row],[I1]:[I2]]))","v":100},{"$error":"#REF!"},"AU","MP",{"$error":"#REF!"},{"$f":"IF(C143=\"\",\"\",IF(LEN(Tabel2[[#This Row],[Entiteit of attribuut]])=2,\"\",Tabel2[[#This Row],[Entiteit]]&\"_\"&Tabel2[[#This Row],[Entiteit of attribuut]]))","v":"MP_MYAAND"},{"$f":"IF(Schema!I150=\"\",\"\",Schema!I150)","v":""},{"$f":"IF(Schema!J150=\"\",\"\",Schema!J150)","v":""},{"$f":"IF(Schema!K150=\"\",\"\",Schema!K150)","v":""},{"$f":"IF(Schema!L150=\"\",\"\",Schema!L150)","v":""},{"$f":"IF(Schema!N150=\"\",\"\",Schema!N150)","v":"O"}]
[{"$f":"Schema!A151&Schema!B151&Schema!C151&Schema!D151","v":"PLLEAD"},"MP",{"$f":"IF(A144=\"\",\"\",IF(LEN(Schema!A151)=2,1,IF(LEN(Schema!B151)=2,10,IF(LEN(Schema!C151)=2,100,0))))","v":0},100,{"$f":"IF(A144=\"\",\"\",SUM(Tabel2[[#This Row],[I1]:[I2]]))","v":100},{"$error":"#REF!"},"AU","MP",{"$error":"#REF!"},{"$f":"IF(C144=\"\",\"\",IF(LEN(Tabel2[[#This Row],[Entiteit of attribuut]])=2,\"\",Tabel2[[#This Row],[Entiteit]]&\"_\"&Tabel2[[#This Row],[Entiteit of attribuut]]))","v":"MP_PLLEAD"},{"$f":"IF(Schema!I151=\"\",\"\",Schema!I151)","v":""},{"$f":"IF(Schema!J151=\"\",\"\",Schema!J151)","v":""},{"$f":"IF(Schema!K151=\"\",\"\",Schema!K151)","v":""},{"$f":"IF(Schema!L151=\"\",\"\",Schema!L151)","v":""},{"$f":"IF(Schema!N151=\"\",\"\",Schema!N151)","v":"O"}]
[{"$f":"Schema!A152&Schema!B152&Schema!C152&Schema!D152","v":"POOLNUM"},"MP",{"$f":"IF(A145=\"\",\"\",IF(LEN(Schema!A152)=2,1,IF(LEN(Schema!B152)=2,10,IF(LEN(Schema!C152)=2,100,0))))","v":0},100,{"$f":"IF(A145=\"\",\"\",SUM(Tabel2[[#This Row],[I1]:[I2]]))","v":100},{"$error":"#REF!"},"AU","MP",{"$error":"#REF!"},{"$f":"IF(C145=\"\",\"\",IF(LEN(Tabel2[[#This Row],[Entiteit of attribuut]])=2,\"\",Tabel2[[#This Row],[Entiteit]]&\"_\"&Tabel2[[#This Row],[Entiteit of attribuut]]))","v":"MP_POOLNUM"},{"$f":"IF(Schema!I152=\"\",\"\",Schema!I152)","v":""},{"$f":"IF(Schema!J152=\"\",\"\",Schema!J152)","v":""},{"$f":"IF(Schema!K152=\"\",\"\",Schema!K152)","v":""},{"$f":"IF(Schema!L152=\"\",\"\",Schema!L152)","v":""},{"$f":"IF(Schema!N152=\"\",\"\",Schema!N152)","v":"V"}]
[{"$f":"Schema!A153&Schema!B153&Schema!C153&Schema!D153","v":"POOLPRC"},"MP",{"$f":"IF(A146=\"\",\"\",IF(LEN(Schema!A153)=2,1,IF(LEN(Schema!B153)=2,10,IF(LEN(Schema!C153)=2,100,0))))","v":0},100,{"$f":"IF(A146=\"\",\"\",SUM(Tabel2[[#This Row],[I1]:[I2]]))","v":100},{"$error":"#REF!"},"AU","MP",{"$error":"#REF!"},{"$f":"IF(C146=\"\",\"\",IF(LEN(Tabel2[[#This Row],[Entiteit of attribuut]])=2,\"\",Tabel2[[#This Row],[Entiteit]]&\"_\"&Tabel2[[#This Row],[Entiteit of attribuut]]))","v":"MP_POOLPRC"},{"$f":"IF(Schema!I153=\"\",\"\",Schema!I153)","v":""},{"$f":"IF(Schema!J153=\"\",\"\",Schema!J153)","v":""},{"$f":"IF(Schema!K153=\"\",\"\",Schema!K153)","v":""},{"$f":"IF(Schema!L153=\"\",\"\",Schema!L153)","v":""},{"$f":"IF(Schema!N153=\"\",\"\",Schema!N153)","v":"V"}]
[{"$f":"Schema!A154&Schema!B154&Schema!C154&Schema!D154","v":"BI"},"BI",{"$f":"IF(A147=\"\",\"\",IF(LEN(Schema!A154)=2,1,IF(LEN(Schema!B154)=2,10,IF(LEN(Schema!C154)=2,100,0))))","v":10},10,{"$f":"IF(A147=\"\",\"\",SUM(Tabel2[[#This Row],[I1]:[I2]]))","v":20},{"$error":"#REF!"},"BI","",{"$error":"#REF!"},{"$f":"IF(C147=\"\",\"\",IF(LEN(Tabel2[[#This Row],[Entiteit of attribuut]])=2,\"\",Tabel2[[#This Row],[Entiteit]]&\"_\"&Tabel2[[#This Row],[Entiteit of attribuut]]))","v":""},{"$f":"IF(Schema!I154=\"\",\"\",Schema!I154)","v":""},{"$f":"IF(Schema!J154=\"\",\"\",Schema!J154)","v":""},{"$f":"IF(Schema!K154=\"\",\"\",Schema!K154)","v":""},{"$f":"IF(Schema!L154=\"\",\"\",Schema!L154)","v":""},{"$f":"IF(Schema!N154=\"\",\"\",Schema!N154)","v":"O"}]
[{"$f":"Schema!A155&Schema!B155&Schema!C155&Schema!D155","v":"BAFWST"},"BI",{"$f":"IF(A148=\"\",\"\",IF(LEN(Schema!A155)=2,1,IF(LEN(Schema!B155)=2,10,IF(LEN(Schema!C155)=2,100,0))))","v":0},10,{"$f":"IF(A148=\"\",\"\",SUM(Tabel2[[#This Row],[I1]:[I2]]))","v":10},{"$error":"#REF!"},"BI","",{"$error":"#REF!"},{"$f":"IF(C148=\"\",\"\",IF(LEN(Tabel2[[#This Row],[Entiteit of attribuut]])=2,\"\",Tabel2[[#This Row],[Entiteit]]&\"_\"&Tabel2[[#This Row],[Entiteit of attribuut]]))","v":"BI_BAFWST"},{"$f":"IF(Schema!I155=\"\",\"\",Schema!I155)","v":""},{"$f":"IF(Schema!J155=\"\",\"\",Schema!J155)","v":""},{"$f":"IF(Schema!K155=\"\",\"\",Schema!K155)","v":""},{"$f":"IF(Schema!L155=\"\",\"\",Schema!L155)","v":""},{"$f":"IF(Schema!N155=\"\",\"\",Schema!N155)","v":"O"}]
[{"$f":"Schema!A156&Schema!B156&Schema!C156&Schema!D156","v":"BTP"},"BI",{"$f":"IF(A149=\"\",\"\",IF(LEN(Schema!A156)=2,1,IF(LEN(Schema!B156)=2,10,IF(LEN(Schema!C156)=2,100,0))))","v":0},10,{"$f":"IF(A149=\"\",\"\",SUM(Tabel2[[#This Row],[I1]:[I2]]))","v":10},{"$error":"#REF!"},"BI","",{"$error":"#REF!"},{"$f":"IF(C149=\"\",\"\",IF(LEN(Tabel2[[#This Row],[Entiteit of attribuut]])=2,\"\",Tabel2[[#This Row],[Entiteit]]&\"_\"&Tabel2[[#This Row],[Entiteit of attribuut]]))","v":"BI_BTP"},{"$f":"IF(Schema!I156=\"\",\"\",Schema!I156)","v":""},{"$f":"IF(Schema!J156=\"\",\"\",Schema!J156)","v":""},{"$f":"IF(Schema!K156=\"\",\"\",Schema!K156)","v":""},{"$f":"IF(Schema!L156=\"\",\"\",Schema!L156)","v":""},{"$f":"IF(Schema!N156=\"\",\"\",Schema!N156)","v":"LEEG"}]
[{"$f":"Schema!A157&Schema!B157&Schema!C157&Schema!D157","v":"CODE"},"BI",{"$f":"IF(A150=\"\",\"\",IF(LEN(Schema!A157)=2,1,IF(LEN(Schema!B157)=2,10,IF(LEN(Schema!C157)=2,100,0))))","v":0},10,{"$f":"IF(A150=\"\",\"\",SUM(Tabel2[[#This Row],[I1]:[I2]]))","v":10},{"$error":"#REF!"},"BI","",{"$error":"#REF!"},{"$f":"IF(C150=\"\",\"\",IF(LEN(Tabel2[[#This Row],[Entiteit of attribuut]])=2,\"\",Tabel2[[#This Row],[Entiteit]]&\"_\"&Tabel2[[#This Row],[Entiteit of attribuut]]))","v":"BI_CODE"},{"$f":"IF(Schema!I157=\"\",\"\",Schema!I157)","v":""},{"$f":"IF(Schema!J157=\"\",\"\",Schema!J157)","v":""},{"$f":"IF(Schema!K157=\"\",\"\",Schema!K157)","v":""},{"$f":"IF(Schema!L157=\"\",\"\",Schema!L157)","v":""},{"$f":"IF(Schema!N157=\"\",\"\",Schema!N157)","v":"O"}]
[{"$f":"Schema!A158&Schema!B158&Schema!C158&Schema!D158","v":"COLFACT"},"BI",{"$f":"IF(A151=\"\",\"\",IF(LEN(Schema!A158)=2,1,IF(LEN(Schema!B158)=2,10,IF(LEN(Schema!C158)=2,100,0))))","v":0},10,{"$f":"IF(A151=\"\",\"\",SUM(Tabel2[[#This Row],[I1]:[I2]]))","v":10},{"$error":"#REF!"},"BI","",{"$error":"#REF!"},{"$f":"IF(C151=\"\",\"\",IF(LEN(Tabel2[[#This Row],[Entiteit of attribuut]])=2,\"\",Tabel2[[#This Row],[Entiteit]]&\"_\"&Tabel2[[#This Row],[Entiteit of attribuut]]))","v":"BI_COLFACT"},{"$f":"IF(Schema!I158=\"\",\"\",Schema!I158)","v":""},{"$f":"IF(Schema!J158=\"\",\"\",Schema!J158)","v":""},{"$f":"IF(Schema!K158=\"\",\"\",Schema!K158)","v":""},{"$f":"IF(Schema!L158=\"\",\"\",Schema!L158)","v":""},{"$f":"IF(Schema!N158=\"\",\"\",Schema!N158)","v":"O"}]
[{"$f":"Schema!A159&Schema!B159&Schema!C159&Schema!D159","v":"ERB"},"BI",{"$f":"IF(A152=\"\",\"\",IF(LEN(Schema!A159)=2,1,IF(LEN(Schema!B159)=2,10,IF(LEN(Schema!C159)=2,100,0))))","v":0},10,{"$f":"IF(A152=\"\",\"\",SUM(Tabel2[[#This Row],[I1]:[I2]]))","v":10},{"$error":"#REF!"},"BI","",{"$error":"#REF!"},{"$f":"IF(C152=\"\",\"\",IF(LEN(Tabel2[[#This Row],[Entiteit of attribuut]])=2,\"\",Tabel2[[#This Row],[Entiteit]]&\"_\"&Tabel2[[#This Row],[Entiteit of attribuut]]))","v":"BI_ERB"},{"$f":"IF(Schema!I159=\"\",\"\",Schema!I159)","v":""},{"$f":"IF(Schema!J159=\"\",\"\",Schema!J159)","v":""},{"$f":"IF(Schema!K159=\"\",\"\",Schema!K159)","v":""},{"$f":"IF(Schema!L159=\"\",\"\",Schema!L159)","v":""},{"$f":"IF(Schema!N159=\"\",\"\",Schema!N159)","v":"O"}]
[{"$f":"Schema!A160&Schema!B160&Schema!C160&Schema!D160","v":"GADEKCD"},"BI",{"$f":"IF(A153=\"\",\"\",IF(LEN(Schema!A160)=2,1,IF(LEN(Schema!B160)=2,10,IF(LEN(Schema!C160)=2,100,0))))","v":0},10,{"$f":"IF(A153=\"\",\"\",SUM(Tabel2[[#This Row],[I1]:[I2]]))","v":10},{"$error":"#REF!"},"BI","",{"$error":"#REF!"},{"$f":"IF(C153=\"\",\"\",IF(LEN(Tabel2[[#This Row],[Entiteit of attribuut]])=2,\"\",Tabel2[[#This Row],[Entiteit]]&\"_\"&Tabel2[[#This Row],[Entiteit of attribuut]]))","v":"BI_GADEKCD"},{"$f":"IF(Schema!I160=\"\",\"\",Schema!I160)","v":""},{"$f":"IF(Schema!J160=\"\",\"\",Schema!J160)","v":""},{"$f":"IF(Schema!K160=\"\",\"\",Schema!K160)","v":""},{"$f":"IF(Schema!L160=\"\",\"\",Schema!L160)","v":""},{"$f":"IF(Schema!N160=\"\",\"\",Schema!N160)","v":"V"}]
[{"$f":"Schema!A161&Schema!B161&Schema!C161&Schema!D161","v":"GADEKCO"},"BI",{"$f":"IF(A154=\"\",\"\",IF(LEN(Schema!A161)=2,1,IF(LEN(Schema!B161)=2,10,IF(LEN(Schema!C161)=2,100,0))))","v":0},10,{"$f":"IF(A154=\"\",\"\",SUM(Tabel2[[#This Row],[I1]:[I2]]))","v":10},{"$error":"#REF!"},"BI","",{"$error":"#REF!"},{"$f":"IF(C154=\"\",\"\",IF(LEN(Tabel2[[#This Row],[Entiteit of attribuut]])=2,\"\",Tabel2[[#This Row],[Entiteit]]&\"_\"&Tabel2[[#This Row],[Entiteit of attribuut]]))","v":"BI_GADEKCO"},{"$f":"IF(Schema!I161=\"\",\"\",Schema!I161)","v":""},{"$f":"IF(Schema!J161=\"\",\"\",Schema!J161)","v":""},{"$f":"IF(Schema!K161=\"\",\"\",Schema!K161)","v":""},{"$f":"IF(Schema!L161=\"\",\"\",Schema!L161)","v":""},{"$f":"IF(Schema!N161=\"\",\"\",Schema!N161)","v":"V"}]
[{"$f":"Schema!A162&Schema!B162&Schema!C162&Schema!D162","v":"MYCODE"},"BI",{"$f":"IF(A155=\"\",\"\",IF(LEN(Schema!A162)=2,1,IF(LEN(Schema!B162)=2,10,IF(LEN(Schema!C162)=2,100,0))))","v":0},10,{"$f":"IF(A155=\"\",\"\",SUM(Tabel2[[#This Row],[I1]:[I2]]))","v":10},{"$error":"#REF!"},"BI","",{"$error":"#REF!"},{"$f":"IF(C155=\"\",\"\",IF(LEN(Tabel2[[#This Row],[Entiteit of attribuut]])=2,\"\",Tabel2[[#This Row],[Entiteit]]&\"_\"&Tabel2[[#This Row],[Entiteit of attribuut]]))","v":"BI_MYCODE"},{"$f":"IF(Schema!I162=\"\",\"\",Schema!I162)","v":""},{"$f":"IF(Schema!J162=\"\",\"\",Schema!J162)","v":""},{"$f":"IF(Schema!K162=\"\",\"\",Schema!K162)","v":""},{"$f":"IF(Schema!L162=\"\",\"\",Schema!L162)","v":""},{"$f":"IF(Schema!N162=\"\",\"\",Schema!N162)","v":"O"}]
[{"$f":"Schema!A163&Schema!B163&Schema!C163&Schema!D163","v":"NJP"},"BI",{"$f":"IF(A156=\"\",\"\",IF(LEN(Schema!A163)=2,1,IF(LEN(Schema!B163)=2,10,IF(LEN(Schema!C163)=2,100,0))))","v":0},10,{"$f":"IF(A156=\"\",\"\",SUM(Tabel2[[#This Row],[I1]:[I2]]))","v":10},{"$error":"#REF!"},"BI","",{"$error":"#REF!"},{"$f":"IF(C156=\"\",\"\",IF(LEN(Tabel2[[#This Row],[Entiteit of attribuut]])=2,\"\",Tabel2[[#This Row],[Entiteit]]&\"_\"&Tabel2[[#This Row],[Entiteit of attribuut]]))","v":"BI_NJP"},{"$f":"IF(Schema!I163=\"\",\"\",Schema!I163)","v":""},{"$f":"IF(Schema!J163=\"\",\"\",Schema!J163)","v":""},{"$f":"IF(Schema!K163=\"\",\"\",Schema!K163)","v":""},{"$f":"IF(Schema!L163=\"\",\"\",Schema!L163)","v":""},{"$f":"IF(Schema!N163=\"\",\"\",Schema!N163)","v":"O"}]
[{"$f":"Schema!A164&Schema!B164&Schema!C164&Schema!D164","v":"PAFWST"},"BI",{"$f":"IF(A157=\"\",\"\",IF(LEN(Schema!A164)=2,1,IF(LEN(Schema!B164)=2,10,IF(LEN(Schema!C164)=2,100,0))))","v":0},10,{"$f":"IF(A157=\"\",\"\",SUM(Tabel2[[#This Row],[I1]:[I2]]))","v":10},{"$error":"#REF!"},"BI","",{"$error":"#REF!"},{"$f":"IF(C157=\"\",\"\",IF(LEN(Tabel2[[#This Row],[Entiteit of attribuut]])=2,\"\",Tabel2[[#This Row],[Entiteit]]&\"_\"&Tabel2[[#This Row],[Entiteit of attribuut]]))","v":"BI_PAFWST"},{"$f":"IF(Schema!I164=\"\",\"\",Schema!I164)","v":""},{"$f":"IF(Schema!J164=\"\",\"\",Schema!J164)","v":""},{"$f":"IF(Schema!K164=\"\",\"\",Schema!K164)","v":""},{"$f":"IF(Schema!L164=\"\",\"\",Schema!L164)","v":""},{"$f":"IF(Schema!N164=\"\",\"\",Schema!N164)","v":"O"}]
[{"$f":"Schema!A165&Schema!B165&Schema!C165&Schema!D165","v":"PPRC"},"BI",{"$f":"IF(A158=\"\",\"\",IF(LEN(Schema!A165)=2,1,IF(LEN(Schema!B165)=2,10,IF(LEN(Schema!C165)=2,100,0))))","v":0},10,{"$f":"IF(A158=\"\",\"\",SUM(Tabel2[[#This Row],[I1]:[I2]]))","v":10},{"$error":"#REF!"},"BI","",{"$error":"#REF!"},{"$f":"IF(C158=\"\",\"\",IF(LEN(Tabel2[[#This Row],[Entiteit of attribuut]])=2,\"\",Tabel2[[#This Row],[Entiteit]]&\"_\"&Tabel2[[#This Row],[Entiteit of attribuut]]))","v":"BI_PPRC"},{"$f":"IF(Schema!I165=\"\",\"\",Schema!I165)","v":""},{"$f":"IF(Schema!J165=\"\",\"\",Schema!J165)","v":""},{"$f":"IF(Schema!K165=\"\",\"\",Schema!K165)","v":""},{"$f":"IF(Schema!L165=\"\",\"\",Schema!L165)","v":""},{"$f":"IF(Schema!N165=\"\",\"\",Schema!N165)","v":"O"}]
[{"$f":"Schema!A166&Schema!B166&Schema!C166&Schema!D166","v":"PRCPKKT"},"BI",{"$f":"IF(A159=\"\",\"\",IF(LEN(Schema!A166)=2,1,IF(LEN(Schema!B166)=2,10,IF(LEN(Schema!C166)=2,100,0))))","v":0},10,{"$f":"IF(A159=\"\",\"\",SUM(Tabel2[[#This Row],[I1]:[I2]]))","v":10},{"$error":"#REF!"},"BI","",{"$error":"#REF!"},{"$f":"IF(C159=\"\",\"\",IF(LEN(Tabel2[[#This Row],[Entiteit of attribuut]])=2,\"\",Tabel2[[#This Row],[Entiteit]]&\"_\"&Tabel2[[#This Row],[Entiteit of attribuut]]))","v":"BI_PRCPKKT"},{"$f":"IF(Schema!I166=\"\",\"\",Schema!I166)","v":""},{"$f":"IF(Schema!J166=\"\",\"\",Schema!J166)","v":""},{"$f":"IF(Schema!K166=\"\",\"\",Schema!K166)","v":""},{"$f":"IF(Schema!L166=\"\",\"\",Schema!L166)","v":""},{"$f":"IF(Schema!N166=\"\",\"\",Schema!N166)","v":"O"}]
[{"$f":"Schema!A167&Schema!B167&Schema!C167&Schema!D167","v":"PRCTEKC"},"BI",{"$f":"IF(A160=\"\",\"\",IF(LEN(Schema!A167)=2,1,IF(LEN(Schema!B167)=2,10,IF(LEN(Schema!C167)=2,100,0))))","v":0},10,{"$f":"IF(A160=\"\",\"\",SUM(Tabel2[[#This Row],[I1]:[I2]]))","v":10},{"$error":"#REF!"},"BI","",{"$error":"#REF!"},{"$f":"IF(C160=\"\",\"\",IF(LEN(Tabel2[[#This Row],[Entiteit of attribuut]])=2,\"\",Tabel2[[#This Row],[Entiteit]]&\"_\"&Tabel2[[#This Row],[Entiteit of attribuut]]))","v":"BI_PRCTEKC"},{"$f":"IF(Schema!I167=\"\",\"\",Schema!I167)","v":""},{"$f":"IF(Schema!J167=\"\",\"\",Schema!J167)","v":""},{"$f":"IF(Schema!K167=\"\",\"\",Schema!K167)","v":""},{"$f":"IF(Schema!L167=\"\",\"\",Schema!L167)","v":""},{"$f":"IF(Schema!N167=\"\",\"\",Schema!N167)","v":"O"}]
[{"$f":"Schema!A168&Schema!B168&Schema!C168&Schema!D168","v":"PRMPROM"},"BI",{"$f":"IF(A161=\"\",\"\",IF(LEN(Schema!A168)=2,1,IF(LEN(Schema!B168)=2,10,IF(LEN(Schema!C168)=2,100,0))))","v":0},10,{"$f":"IF(A161=\"\",\"\",SUM(Tabel2[[#This Row],[I1]:[I2]]))","v":10},{"$error":"#REF!"},"BI","",{"$error":"#REF!"},{"$f":"IF(C161=\"\",\"\",IF(LEN(Tabel2[[#This Row],[Entiteit of attribuut]])=2,\"\",Tabel2[[#This Row],[Entiteit]]&\"_\"&Tabel2[[#This Row],[Entiteit of attribuut]]))","v":"BI_PRMPROM"},{"$f":"IF(Schema!I168=\"\",\"\",Schema!I168)","v":""},{"$f":"IF(Schema!J168=\"\",\"\",Schema!J168)","v":""},{"$f":"IF(Schema!K168=\"\",\"\",Schema!K168)","v":""},{"$f":"IF(Schema!L168=\"\",\"\",Schema!L168)","v":""},{"$f":"IF(Schema!N168=\"\",\"\",Schema!N168)","v":"O"}]
[{"$f":"Schema!A169&Schema!B169&Schema!C169&Schema!D169","v":"RELVRH"},"BI",{"$f":"IF(A162=\"\",\"\",IF(LEN(Schema!A169)=2,1,IF(LEN(Schema!B169)=2,10,IF(LEN(Schema!C169)=2,100,0))))","v":0},10,{"$f":"IF(A162=\"\",\"\",SUM(Tabel2[[#This Row],[I1]:[I2]]))","v":10},{"$error":"#REF!"},"BI","",{"$error":"#REF!"},{"$f":"IF(C162=\"\",\"\",IF(LEN(Tabel2[[#This Row],[Entiteit of attribuut]])=2,\"\",Tabel2[[#This Row],[Entiteit]]&\"_\"&Tabel2[[#This Row],[Entiteit of attribuut]]))","v":"BI_RELVRH"},{"$f":"IF(Schema!I169=\"\",\"\",Schema!I169)","v":""},{"$f":"IF(Schema!J169=\"\",\"\",Schema!J169)","v":""},{"$f":"IF(Schema!K169=\"\",\"\",Schema!K169)","v":""},{"$f":"IF(Schema!L169=\"\",\"\",Schema!L169)","v":""},{"$f":"IF(Schema!N169=\"\",\"\",Schema!N169)","v":"O"}]
[{"$f":"Schema!A170&Schema!B170&Schema!C170&Schema!D170","v":"RELVVNR"},"BI",{"$f":"IF(A163=\"\",\"\",IF(LEN(Schema!A170)=2,1,IF(LEN(Schema!B170)=2,10,IF(LEN(Schema!C170)=2,100,0))))","v":0},10,{"$f":"IF(A163=\"\",\"\",SUM(Tabel2[[#This Row],[I1]:[I2]]))","v":10},{"$error":"#REF!"},"BI","",{"$error":"#REF!"},{"$f":"IF(C163=\"\",\"\",IF(LEN(Tabel2[[#This Row],[Entiteit of attribuut]])=2,\"\",Tabel2[[#This Row],[Entiteit]]&\"_\"&Tabel2[[#This Row],[Entiteit of attribuut]]))","v":"BI_RELVVNR"},{"$f":"IF(Schema!I170=\"\",\"\",Schema!I170)","v":""},{"$f":"IF(Schema!J170=\"\",\"\",Schema!J170)","v":""},{"$f":"IF(Schema!K170=\"\",\"\",Schema!K170)","v":""},{"$f":"IF(Schema!L170=\"\",\"\",Schema!L170)","v":""},{"$f":"IF(Schema!N170=\"\",\"\",Schema!N170)","v":"O"}]
[{"$f":"Schema!A171&Schema!B171&Schema!C171&Schema!D171","v":"RJRCOR"},"BI",{"$f":"IF(A164=\"\",\"\",IF(LEN(Schema!A171)=2,1,IF(LEN(Schema!B171)=2,10,IF(LEN(Schema!C171)=2,100,0))))","v":0},10,{"$f":"IF(A164=\"\",\"\",SUM(Tabel2[[#This Row],[I1]:[I2]]))","v":10},{"$error":"#REF!"},"BI","",{"$error":"#REF!"},{"$f":"IF(C164=\"\",\"\",IF(LEN(Tabel2[[#This Row],[Entiteit of attribuut]])=2,\"\",Tabel2[[#This Row],[Entiteit]]&\"_\"&Tabel2[[#This Row],[Entiteit of attribuut]]))","v":"BI_RJRCOR"},{"$f":"IF(Schema!I171=\"\",\"\",Schema!I171)","v":""},{"$f":"IF(Schema!J171=\"\",\"\",Schema!J171)","v":""},{"$f":"IF(Schema!K171=\"\",\"\",Schema!K171)","v":""},{"$f":"IF(Schema!L171=\"\",\"\",Schema!L171)","v":""},{"$f":"IF(Schema!N171=\"\",\"\",Schema!N171)","v":"O"}]
[{"$f":"Schema!A172&Schema!B172&Schema!C172&Schema!D172","v":"TCORBDR"},"BI",{"$f":"IF(A165=\"\",\"\",IF(LEN(Schema!A172)=2,1,IF(LEN(Schema!B172)=2,10,IF(LEN(Schema!C172)=2,100,0))))","v":0},10,{"$f":"IF(A165=\"\",\"\",SUM(Tabel2[[#This Row],[I1]:[I2]]))","v":10},{"$error":"#REF!"},"BI","",{"$error":"#REF!"},{"$f":"IF(C165=\"\",\"\",IF(LEN(Tabel2[[#This Row],[Entiteit of attribuut]])=2,\"\",Tabel2[[#This Row],[Entiteit]]&\"_\"&Tabel2[[#This Row],[Entiteit of attribuut]]))","v":"BI_TCORBDR"},{"$f":"IF(Schema!I172=\"\",\"\",Schema!I172)","v":""},{"$f":"IF(Schema!J172=\"\",\"\",Schema!J172)","v":""},{"$f":"IF(Schema!K172=\"\",\"\",Schema!K172)","v":""},{"$f":"IF(Schema!L172=\"\",\"\",Schema!L172)","v":""},{"$f":"IF(Schema!N172=\"\",\"\",Schema!N172)","v":"O"}]
[{"$f":"Schema!A173&Schema!B173&Schema!C173&Schema!D173","v":"VERZSOM"},"BI",{"$f":"IF(A166=\"\",\"\",IF(LEN(Schema!A173)=2,1,IF(LEN(Schema!B173)=2,10,IF(LEN(Schema!C173)=2,100,0))))","v":0},10,{"$f":"IF(A166=\"\",\"\",SUM(Tabel2[[#This Row],[I1]:[I2]]))","v":10},{"$error":"#REF!"},"BI","",{"$error":"#REF!"},{"$f":"IF(C166=\"\",\"\",IF(LEN(Tabel2[[#This Row],[Entiteit of attribuut]])=2,\"\",Tabel2[[#This Row],[Entiteit]]&\"_\"&Tabel2[[#This Row],[Entiteit of attribuut]]))","v":"BI_VERZSOM"},{"$f":"IF(Schema!I173=\"\",\"\",Schema!I173)","v":""},{"$f":"IF(Schema!J173=\"\",\"\",Schema!J173)","v":""},{"$f":"IF(Schema!K173=\"\",\"\",Schema!K173)","v":""},{"$f":"IF(Schema!L173=\"\",\"\",Schema!L173)","v":""},{"$f":"IF(Schema!N173=\"\",\"\",Schema!N173)","v":"O"}]
[{"$f":"Schema!A174&Schema!B174&Schema!C174&Schema!D174","v":"VGBRA"},"BI",{"$f":"IF(A167=\"\",\"\",IF(LEN(Schema!A174)=2,1,IF(LEN(Schema!B174)=2,10,IF(LEN(Schema!C174)=2,100,0))))","v":0},10,{"$f":"IF(A167=\"\",\"\",SUM(Tabel2[[#This Row],[I1]:[I2]]))","v":10},{"$error":"#REF!"},"BI","",{"$error":"#REF!"},{"$f":"IF(C167=\"\",\"\",IF(LEN(Tabel2[[#This Row],[Entiteit of attribuut]])=2,\"\",Tabel2[[#This Row],[Entiteit]]&\"_\"&Tabel2[[#This Row],[Entiteit of attribuut]]))","v":"BI_VGBRA"},{"$f":"IF(Schema!I174=\"\",\"\",Schema!I174)","v":""},{"$f":"IF(Schema!J174=\"\",\"\",Schema!J174)","v":""},{"$f":"IF(Schema!K174=\"\",\"\",Schema!K174)","v":""},{"$f":"IF(Schema!L174=\"\",\"\",Schema!L174)","v":""},{"$f":"IF(Schema!N174=\"\",\"\",Schema!N174)","v":"O"}]
[{"$f":"Schema!A175&Schema!B175&Schema!C175&Schema!D175","v":"VOLGNUM"},"BI",{"$f":"IF(A168=\"\",\"\",IF(LEN(Schema!A175)=2,1,IF(LEN(Schema!B175)=2,10,IF(LEN(Schema!C175)=2,100,0))))","v":0},10,{"$f":"IF(A168=\"\",\"\",SUM(Tabel2[[#This Row],[I1]:[I2]]))","v":10},{"$error":"#REF!"},"BI","",{"$error":"#REF!"},{"$f":"IF(C168=\"\",\"\",IF(LEN(Tabel2[[#This Row],[Entiteit of attribuut]])=2,\"\",Tabel2[[#This Row],[Entiteit]]&\"_\"&Tabel2[[#This Row],[Entiteit of attribuut]]))","v":"BI_VOLGNUM"},{"$f":"IF(Schema!I175=\"\",\"\",Schema!I175)","v":""},{"$f":"IF(Schema!J175=\"\",\"\",Schema!J175)","v":""},{"$f":"IF(Schema!K175=\"\",\"\",Schema!K175)","v":""},{"$f":"IF(Schema!L175=\"\",\"\",Schema!L175)","v":""},{"$f":"IF(Schema!N175=\"\",\"\",Schema!N175)","v":"LEEG"}]
[{"$f":"Schema!A176&Schema!B176&Schema!C176&Schema!D176","v":"VRWRKCD"},"BI",{"$f":"IF(A169=\"\",\"\",IF(LEN(Schema!A176)=2,1,IF(LEN(Schema!B176)=2,10,IF(LEN(Schema!C176)=2,100,0))))","v":0},10,{"$f":"IF(A169=\"\",\"\",SUM(Tabel2[[#This Row],[I1]:[I2]]))","v":10},{"$error":"#REF!"},"BI","",{"$error":"#REF!"},{"$f":"IF(C169=\"\",\"\",IF(LEN(Tabel2[[#This Row],[Entiteit of attribuut]])=2,\"\",Tabel2[[#This Row],[Entiteit]]&\"_\"&Tabel2[[#This Row],[Entiteit of attribuut]]))","v":"BI_VRWRKCD"},{"$f":"IF(Schema!I176=\"\",\"\",Schema!I176)","v":""},{"$f":"IF(Schema!J176=\"\",\"\",Schema!J176)","v":""},{"$f":"IF(Schema!K176=\"\",\"\",Schema!K176)","v":""},{"$f":"IF(Schema!L176=\"\",\"\",Schema!L176)","v":""},{"$f":"IF(Schema!N176=\"\",\"\",Schema!N176)","v":"LEEG"}]
[{"$f":"Schema!A177&Schema!B177&Schema!C177&Schema!D177","v":"WPREMBP"},"BI",{"$f":"IF(A170=\"\",\"\",IF(LEN(Schema!A177)=2,1,IF(LEN(Schema!B177)=2,10,IF(LEN(Schema!C177)=2,100,0))))","v":0},10,{"$f":"IF(A170=\"\",\"\",SUM(Tabel2[[#This Row],[I1]:[I2]]))","v":10},{"$error":"#REF!"},"BI","",{"$error":"#REF!"},{"$f":"IF(C170=\"\",\"\",IF(LEN(Tabel2[[#This Row],[Entiteit of attribuut]])=2,\"\",Tabel2[[#This Row],[Entiteit]]&\"_\"&Tabel2[[#This Row],[Entiteit of attribuut]]))","v":"BI_WPREMBP"},{"$f":"IF(Schema!I177=\"\",\"\",Schema!I177)","v":""},{"$f":"IF(Schema!J177=\"\",\"\",Schema!J177)","v":""},{"$f":"IF(Schema!K177=\"\",\"\",Schema!K177)","v":""},{"$f":"IF(Schema!L177=\"\",\"\",Schema!L177)","v":""},{"$f":"IF(Schema!N177=\"\",\"\",Schema!N177)","v":"O"}]
[{"$f":"Schema!A178&Schema!B178&Schema!C178&Schema!D178","v":"MP"},"MP",{"$f":"IF(A171=\"\",\"\",IF(LEN(Schema!A178)=2,1,IF(LEN(Schema!B178)=2,10,IF(LEN(Schema!C178)=2,100,0))))","v":100},100,{"$f":"IF(A171=\"\",\"\",SUM(Tabel2[[#This Row],[I1]:[I2]]))","v":200},{"$error":"#REF!"},"BI","MP",{"$error":"#REF!"},{"$f":"IF(C171=\"\",\"\",IF(LEN(Tabel2[[#This Row],[Entiteit of attribuut]])=2,\"\",Tabel2[[#This Row],[Entiteit]]&\"_\"&Tabel2[[#This Row],[Entiteit of attribuut]]))","v":""},{"$f":"IF(Schema!I178=\"\",\"\",Schema!I178)","v":""},{"$f":"IF(Schema!J178=\"\",\"\",Schema!J178)","v":""},{"$f":"IF(Schema!K178=\"\",\"\",Schema!K178)","v":""},{"$f":"IF(Schema!L178=\"\",\"\",Schema!L178)","v":""},{"$f":"IF(Schema!N178=\"\",\"\",Schema!N178)","v":"O"}]
[{"$f":"Schema!A179&Schema!B179&Schema!C179&Schema!D179","v":"MYAAND"},"MP",{"$f":"IF(A172=\"\",\"\",IF(LEN(Schema!A179)=2,1,IF(LEN(Schema!B179)=2,10,IF(LEN(Schema!C179)=2,100,0))))","v":0},100,{"$f":"IF(A172=\"\",\"\",SUM(Tabel2[[#This Row],[I1]:[I2]]))","v":100},{"$error":"#REF!"},"BI","MP",{"$error":"#REF!"},{"$f":"IF(C172=\"\",\"\",IF(LEN(Tabel2[[#This Row],[Entiteit of attribuut]])=2,\"\",Tabel2[[#This Row],[Entiteit]]&\"_\"&Tabel2[[#This Row],[Entiteit of attribuut]]))","v":"MP_MYAAND"},{"$f":"IF(Schema!I179=\"\",\"\",Schema!I179)","v":""},{"$f":"IF(Schema!J179=\"\",\"\",Schema!J179)","v":""},{"$f":"IF(Schema!K179=\"\",\"\",Schema!K179)","v":""},{"$f":"IF(Schema!L179=\"\",\"\",Schema!L179)","v":""},{"$f":"IF(Schema!N179=\"\",\"\",Schema!N179)","v":"O"}]
[{"$f":"Schema!A180&Schema!B180&Schema!C180&Schema!D180","v":"PLLEAD"},"MP",{"$f":"IF(A173=\"\",\"\",IF(LEN(Schema!A180)=2,1,IF(LEN(Schema!B180)=2,10,IF(LEN(Schema!C180)=2,100,0))))","v":0},100,{"$f":"IF(A173=\"\",\"\",SUM(Tabel2[[#This Row],[I1]:[I2]]))","v":100},{"$error":"#REF!"},"BI","MP",{"$error":"#REF!"},{"$f":"IF(C173=\"\",\"\",IF(LEN(Tabel2[[#This Row],[Entiteit of attribuut]])=2,\"\",Tabel2[[#This Row],[Entiteit]]&\"_\"&Tabel2[[#This Row],[Entiteit of attribuut]]))","v":"MP_PLLEAD"},{"$f":"IF(Schema!I180=\"\",\"\",Schema!I180)","v":""},{"$f":"IF(Schema!J180=\"\",\"\",Schema!J180)","v":""},{"$f":"IF(Schema!K180=\"\",\"\",Schema!K180)","v":""},{"$f":"IF(Schema!L180=\"\",\"\",Schema!L180)","v":""},{"$f":"IF(Schema!N180=\"\",\"\",Schema!N180)","v":"O"}]
[{"$f":"Schema!A181&Schema!B181&Schema!C181&Schema!D181","v":"POOLNUM"},"MP",{"$f":"IF(A174=\"\",\"\",IF(LEN(Schema!A181)=2,1,IF(LEN(Schema!B181)=2,10,IF(LEN(Schema!C181)=2,100,0))))","v":0},100,{"$f":"IF(A174=\"\",\"\",SUM(Tabel2[[#This Row],[I1]:[I2]]))","v":100},{"$error":"#REF!"},"BI","MP",{"$error":"#REF!"},{"$f":"IF(C174=\"\",\"\",IF(LEN(Tabel2[[#This Row],[Entiteit of attribuut]])=2,\"\",Tabel2[[#This Row],[Entiteit]]&\"_\"&Tabel2[[#This Row],[Entiteit of attribuut]]))","v":"MP_POOLNUM"},{"$f":"IF(Schema!I181=\"\",\"\",Schema!I181)","v":""},{"$f":"IF(Schema!J181=\"\",\"\",Schema!J181)","v":""},{"$f":"IF(Schema!K181=\"\",\"\",Schema!K181)","v":""},{"$f":"IF(Schema!L181=\"\",\"\",Schema!L181)","v":""},{"$f":"IF(Schema!N181=\"\",\"\",Schema!N181)","v":"V"}]
[{"$f":"Schema!A182&Schema!B182&Schema!C182&Schema!D182","v":"POOLPRC"},"MP",{"$f":"IF(A175=\"\",\"\",IF(LEN(Schema!A182)=2,1,IF(LEN(Schema!B182)=2,10,IF(LEN(Schema!C182)=2,100,0))))","v":0},100,{"$f":"IF(A175=\"\",\"\",SUM(Tabel2[[#This Row],[I1]:[I2]]))","v":100},{"$error":"#REF!"},"BI","MP",{"$error":"#REF!"},{"$f":"IF(C175=\"\",\"\",IF(LEN(Tabel2[[#This Row],[Entiteit of attribuut]])=2,\"\",Tabel2[[#This Row],[Entiteit]]&\"_\"&Tabel2[[#This Row],[Entiteit of attribuut]]))","v":"MP_POOLPRC"},{"$f":"IF(Schema!I182=\"\",\"\",Schema!I182)","v":""},{"$f":"IF(Schema!J182=\"\",\"\",Schema!J182)","v":""},{"$f":"IF(Schema!K182=\"\",\"\",Schema!K182)","v":""},{"$f":"IF(Schema!L182=\"\",\"\",Schema!L182)","v":""},{"$f":"IF(Schema!N182=\"\",\"\",Schema!N182)","v":"V"}]
[{"$f":"Schema!A183&Schema!B183&Schema!C183&Schema!D183","v":"DF"},"DF",{"$f":"IF(A176=\"\",\"\",IF(LEN(Schema!A183)=2,1,IF(LEN(Schema!B183)=2,10,IF(LEN(Schema!C183)=2,100,0))))","v":10},10,{"$f":"IF(A176=\"\",\"\",SUM(Tabel2[[#This Row],[I1]:[I2]]))","v":20},{"$error":"#REF!"},"DF","",{"$error":"#REF!"},{"$f":"IF(C176=\"\",\"\",IF(LEN(Tabel2[[#This Row],[Entiteit of attribuut]])=2,\"\",Tabel2[[#This Row],[Entiteit]]&\"_\"&Tabel2[[#This Row],[Entiteit of attribuut]]))","v":""},{"$f":"IF(Schema!I183=\"\",\"\",Schema!I183)","v":""},{"$f":"IF(Schema!J183=\"\",\"\",Schema!J183)","v":""},{"$f":"IF(Schema!K183=\"\",\"\",Schema!K183)","v":""},{"$f":"IF(Schema!L183=\"\",\"\",Schema!L183)","v":""},{"$f":"IF(Schema!N183=\"\",\"\",Schema!N183)","v":"O"}]
[{"$f":"Schema!A184&Schema!B184&Schema!C184&Schema!D184","v":"BAFWST"},"DF",{"$f":"IF(A177=\"\",\"\",IF(LEN(Schema!A184)=2,1,IF(LEN(Schema!B184)=2,10,IF(LEN(Schema!C184)=2,100,0))))","v":0},10,{"$f":"IF(A177=\"\",\"\",SUM(Tabel2[[#This Row],[I1]:[I2]]))","v":10},{"$error":"#REF!"},"DF","",{"$error":"#REF!"},{"$f":"IF(C177=\"\",\"\",IF(LEN(Tabel2[[#This Row],[Entiteit of attribuut]])=2,\"\",Tabel2[[#This Row],[Entiteit]]&\"_\"&Tabel2[[#This Row],[Entiteit of attribuut]]))","v":"DF_BAFWST"},{"$f":"IF(Schema!I184=\"\",\"\",Schema!I184)","v":""},{"$f":"IF(Schema!J184=\"\",\"\",Schema!J184)","v":""},{"$f":"IF(Schema!K184=\"\",\"\",Schema!K184)","v":""},{"$f":"IF(Schema!L184=\"\",\"\",Schema!L184)","v":""},{"$f":"IF(Schema!N184=\"\",\"\",Schema!N184)","v":"O"}]
[{"$f":"Schema!A185&Schema!B185&Schema!C185&Schema!D185","v":"BTP"},"DF",{"$f":"IF(A178=\"\",\"\",IF(LEN(Schema!A185)=2,1,IF(LEN(Schema!B185)=2,10,IF(LEN(Schema!C185)=2,100,0))))","v":0},10,{"$f":"IF(A178=\"\",\"\",SUM(Tabel2[[#This Row],[I1]:[I2]]))","v":10},{"$error":"#REF!"},"DF","",{"$error":"#REF!"},{"$f":"IF(C178=\"\",\"\",IF(LEN(Tabel2[[#This Row],[Entiteit of attribuut]])=2,\"\",Tabel2[[#This Row],[Entiteit]]&\"_\"&Tabel2[[#This Row],[Entiteit of attribuut]]))","v":"DF_BTP"},{"$f":"IF(Schema!I185=\"\",\"\",Schema!I185)","v":""},{"$f":"IF(Schema!J185=\"\",\"\",Schema!J185)","v":""},{"$f":"IF(Schema!K185=\"\",\"\",Schema!K185)","v":""},{"$f":"IF(Schema!L185=\"\",\"\",Schema!L185)","v":""},{"$f":"IF(Schema!N185=\"\",\"\",Schema!N185)","v":"LEEG"}]
[{"$f":"Schema!A186&Schema!B186&Schema!C186&Schema!D186","v":"COLFACT"},"DF",{"$f":"IF(A179=\"\",\"\",IF(LEN(Schema!A186)=2,1,IF(LEN(Schema!B186)=2,10,IF(LEN(Schema!C186)=2,100,0))))","v":0},10,{"$f":"IF(A179=\"\",\"\",SUM(Tabel2[[#This Row],[I1]:[I2]]))","v":10},{"$error":"#REF!"},"DF","",{"$error":"#REF!"},{"$f":"IF(C179=\"\",\"\",IF(LEN(Tabel2[[#This Row],[Entiteit of attribuut]])=2,\"\",Tabel2[[#This Row],[Entiteit]]&\"_\"&Tabel2[[#This Row],[Entiteit of attribuut]]))","v":"DF_COLFACT"},{"$f":"IF(Schema!I186=\"\",\"\",Schema!I186)","v":""},{"$f":"IF(Schema!J186=\"\",\"\",Schema!J186)","v":""},{"$f":"IF(Schema!K186=\"\",\"\",Schema!K186)","v":""},{"$f":"IF(Schema!L186=\"\",\"\",Schema!L186)","v":""},{"$f":"IF(Schema!N186=\"\",\"\",Schema!N186)","v":"O"}]
[{"$f":"Schema!A187&Schema!B187&Schema!C187&Schema!D187","v":"CODE"},"DF",{"$f":"IF(A180=\"\",\"\",IF(LEN(Schema!A187)=2,1,IF(LEN(Schema!B187)=2,10,IF(LEN(Schema!C187)=2,100,0))))","v":0},10,{"$f":"IF(A180=\"\",\"\",SUM(Tabel2[[#This Row],[I1]:[I2]]))","v":10},{"$error":"#REF!"},"DF","",{"$error":"#REF!"},{"$f":"IF(C180=\"\",\"\",IF(LEN(Tabel2[[#This Row],[Entiteit of attribuut]])=2,\"\",Tabel2[[#This Row],[Entiteit]]&\"_\"&Tabel2[[#This Row],[Entiteit of attribuut]]))","v":"DF_CODE"},{"$f":"IF(Schema!I187=\"\",\"\",Schema!I187)","v":""},{"$f":"IF(Schema!J187=\"\",\"\",Schema!J187)","v":""},{"$f":"IF(Schema!K187=\"\",\"\",Schema!K187)","v":""},{"$f":"IF(Schema!L187=\"\",\"\",Schema!L187)","v":""},{"$f":"IF(Schema!N187=\"\",\"\",Schema!N187)","v":"O"}]
[{"$f":"Schema!A188&Schema!B188&Schema!C188&Schema!D188","v":"GADEKCD"},"DF",{"$f":"IF(A181=\"\",\"\",IF(LEN(Schema!A188)=2,1,IF(LEN(Schema!B188)=2,10,IF(LEN(Schema!C188)=2,100,0))))","v":0},10,{"$f":"IF(A181=\"\",\"\",SUM(Tabel2[[#This Row],[I1]:[I2]]))","v":10},{"$error":"#REF!"},"DF","",{"$error":"#REF!"},{"$f":"IF(C181=\"\",\"\",IF(LEN(Tabel2[[#This Row],[Entiteit of attribuut]])=2,\"\",Tabel2[[#This Row],[Entiteit]]&\"_\"&Tabel2[[#This Row],[Entiteit of attribuut]]))","v":"DF_GADEKCD"},{"$f":"IF(Schema!I188=\"\",\"\",Schema!I188)","v":""},{"$f":"IF(Schema!J188=\"\",\"\",Schema!J188)","v":""},{"$f":"IF(Schema!K188=\"\",\"\",Schema!K188)","v":""},{"$f":"IF(Schema!L188=\"\",\"\",Schema!L188)","v":""},{"$f":"IF(Schema!N188=\"\",\"\",Schema!N188)","v":"V"}]
[{"$f":"Schema!A189&Schema!B189&Schema!C189&Schema!D189","v":"GADEKCO"},"DF",{"$f":"IF(A182=\"\",\"\",IF(LEN(Schema!A189)=2,1,IF(LEN(Schema!B189)=2,10,IF(LEN(Schema!C189)=2,100,0))))","v":0},10,{"$f":"IF(A182=\"\",\"\",SUM(Tabel2[[#This Row],[I1]:[I2]]))","v":10},{"$error":"#REF!"},"DF","",{"$error":"#REF!"},{"$f":"IF(C182=\"\",\"\",IF(LEN(Tabel2[[#This Row],[Entiteit of attribuut]])=2,\"\",Tabel2[[#This Row],[Entiteit]]&\"_\"&Tabel2[[#This Row],[Entiteit of attribuut]]))","v":"DF_GADEKCO"},{"$f":"IF(Schema!I189=\"\",\"\",Schema!I189)","v":""},{"$f":"IF(Schema!J189=\"\",\"\",Schema!J189)","v":""},{"$f":"IF(Schema!K189=\"\",\"\",Schema!K189)","v":""},{"$f":"IF(Schema!L189=\"\",\"\",Schema!L189)","v":""},{"$f":"IF(Schema!N189=\"\",\"\",Schema!N189)","v":"V"}]
[{"$f":"Schema!#REF!&Schema!#REF!&Schema!#REF!&Schema!#REF!","v":{"$error":"#REF!"}},{"$error":"#REF!"},{"$f":"IF(A183=\"\",\"\",IF(LEN(Schema!#REF!)=2,1,IF(LEN(Schema!#REF!)=2,10,IF(LEN(Schema!#REF!)=2,100,0))))","v":{"$error":"#REF!"}},{"$error":"#REF!"},{"$f":"IF(A183=\"\",\"\",SUM(Tabel2[[#This Row],[I1]:[I2]]))","v":{"$error":"#REF!"}},{"$error":"#REF!"},{"$error":"#REF!"},{"$error":"#REF!"},{"$error":"#REF!"},{"$f":"IF(C183=\"\",\"\",IF(LEN(Tabel2[[#This Row],[Entiteit of attribuut]])=2,\"\",Tabel2[[#This Row],[Entiteit]]&\"_\"&Tabel2[[#This Row],[Entiteit of attribuut]]))","v":{"$error":"#REF!"}},{"$f":"IF(Schema!#REF!=\"\",\"\",Schema!#REF!)","v":{"$error":"#REF!"}},{"$f":"IF(Schema!#REF!=\"\",\"\",Schema!#REF!)","v":{"$error":"#REF!"}},{"$f":"IF(Schema!#REF!=\"\",\"\",Schema!#REF!)","v":{"$error":"#REF!"}},{"$f":"IF(Schema!#REF!=\"\",\"\",Schema!#REF!)","v":{"$error":"#REF!"}},{"$f":"IF(Schema!#REF!=\"\",\"\",Schema!#REF!)","v":{"$error":"#REF!"}}]
[{"$f":"Schema!A190&Schema!B190&Schema!C190&Schema!D190","v":"MYCODE"},{"$error":"#REF!"},{"$f":"IF(A184=\"\",\"\",IF(LEN(Schema!A190)=2,1,IF(LEN(Schema!B190)=2,10,IF(LEN(Schema!C190)=2,100,0))))","v":0},{"$error":"#REF!"},{"$f":"IF(A184=\"\",\"\",SUM(Tabel2[[#This Row],[I1]:[I2]]))","v":{"$error":"#REF!"}},{"$error":"#REF!"},{"$error":"#REF!"},{"$error":"#REF!"},{"$error":"#REF!"},{"$f":"IF(C184=\"\",\"\",IF(LEN(Tabel2[[#This Row],[Entiteit of attribuut]])=2,\"\",Tabel2[[#This Row],[Entiteit]]&\"_\"&Tabel2[[#This Row],[Entiteit of attribuut]]))","v":{"$error":"#REF!"}},{"$f":"IF(Schema!I190=\"\",\"\",Schema!I190)","v":""},{"$f":"IF(Schema!J190=\"\",\"\",Schema!J190)","v":""},{"$f":"IF(Schema!K190=\"\",\"\",Schema!K190)","v":""},{"$f":"IF(Schema!L190=\"\",\"\",Schema!L190)","v":""},{"$f":"IF(Schema!N190=\"\",\"\",Schema!N190)","v":"O"}]
[{"$f":"Schema!A191&Schema!B191&Schema!C191&Schema!D191","v":"NJP"},{"$error":"#REF!"},{"$f":"IF(A185=\"\",\"\",IF(LEN(Schema!A191)=2,1,IF(LEN(Schema!B191)=2,10,IF(LEN(Schema!C191)=2,100,0))))","v":0},{"$error":"#REF!"},{"$f":"IF(A185=\"\",\"\",SUM(Tabel2[[#This Row],[I1]:[I2]]))","v":{"$error":"#REF!"}},{"$error":"#REF!"},{"$error":"#REF!"},{"$error":"#REF!"},{"$error":"#REF!"},{"$f":"IF(C185=\"\",\"\",IF(LEN(Tabel2[[#This Row],[Entiteit of attribuut]])=2,\"\",Tabel2[[#This Row],[Entiteit]]&\"_\"&Tabel2[[#This Row],[Entiteit of attribuut]]))","v":{"$error":"#REF!"}},{"$f":"IF(Schema!I191=\"\",\"\",Schema!I191)","v":""},{"$f":"IF(Schema!J191=\"\",\"\",Schema!J191)","v":""},{"$f":"IF(Schema!K191=\"\",\"\",Schema!K191)","v":""},{"$f":"IF(Schema!L191=\"\",\"\",Schema!L191)","v":""},{"$f":"IF(Schema!N191=\"\",\"\",Schema!N191)","v":"O"}]
[{"$f":"Schema!A192&Schema!B192&Schema!C192&Schema!D192","v":"PAFWST"},{"$error":"#REF!"},{"$f":"IF(A186=\"\",\"\",IF(LEN(Schema!A192)=2,1,IF(LEN(Schema!B192)=2,10,IF(LEN(Schema!C192)=2,100,0))))","v":0},{"$error":"#REF!"},{"$f":"IF(A186=\"\",\"\",SUM(Tabel2[[#This Row],[I1]:[I2]]))","v":{"$error":"#REF!"}},{"$error":"#REF!"},{"$error":"#REF!"},{"$error":"#REF!"},{"$error":"#REF!"},{"$f":"IF(C186=\"\",\"\",IF(LEN(Tabel2[[#This Row],[Entiteit of attribuut]])=2,\"\",Tabel2[[#This Row],[Entiteit]]&\"_\"&Tabel2[[#This Row],[Entiteit of attribuut]]))","v":{"$error":"#REF!"}},{"$f":"IF(Schema!I192=\"\",\"\",Schema!I192)","v":""},{"$f":"IF(Schema!J192=\"\",\"\",Schema!J192)","v":""},{"$f":"IF(Schema!K192=\"\",\"\",Schema!K192)","v":""},{"$f":"IF(Schema!L192=\"\",\"\",Schema!L192)","v":""},{"$f":"IF(Schema!N192=\"\",\"\",Schema!N192)","v":"O"}]
[{"$f":"Schema!A193&Schema!B193&Schema!C193&Schema!D193","v":"PPRC"},{"$error":"#REF!"},{"$f":"IF(A187=\"\",\"\",IF(LEN(Schema!A193)=2,1,IF(LEN(Schema!B193)=2,10,IF(LEN(Schema!C193)=2,100,0))))","v":0},{"$error":"#REF!"},{"$f":"IF(A187=\"\",\"\",SUM(Tabel2[[#This Row],[I1]:[I2]]))","v":{"$error":"#REF!"}},{"$error":"#REF!"},{"$error":"#REF!"},{"$error":"#REF!"},{"$error":"#REF!"},{"$f":"IF(C187=\"\",\"\",IF(LEN(Tabel2[[#This Row],[Entiteit of attribuut]])=2,\"\",Tabel2[[#This Row],[Entiteit]]&\"_\"&Tabel2[[#This Row],[Entiteit of attribuut]]))","v":{"$error":"#REF!"}},{"$f":"IF(Schema!I193=\"\",\"\",Schema!I193)","v":""},{"$f":"IF(Schema!J193=\"\",\"\",Schema!J193)","v":""},{"$f":"IF(Schema!K193=\"\",\"\",Schema!K193)","v":""},{"$f":"IF(Schema!L193=\"\",\"\",Schema!L193)","v":""},{"$f":"IF(Schema!N193=\"\",\"\",Schema!N193)","v":"O"}]
[{"$f":"Schema!A194&Schema!B194&Schema!C194&Schema!D194","v":"PRCPKKT"},{"$error":"#REF!"},{"$f":"IF(A188=\"\",\"\",IF(LEN(Schema!A194)=2,1,IF(LEN(Schema!B194)=2,10,IF(LEN(Schema!C194)=2,100,0))))","v":0},{"$error":"#REF!"},{"$f":"IF(A188=\"\",\"\",SUM(Tabel2[[#This Row],[I1]:[I2]]))","v":{"$error":"#REF!"}},{"$error":"#REF!"},{"$error":"#REF!"},{"$error":"#REF!"},{"$error":"#REF!"},{"$f":"IF(C188=\"\",\"\",IF(LEN(Tabel2[[#This Row],[Entiteit of attribuut]])=2,\"\",Tabel2[[#This Row],[Entiteit]]&\"_\"&Tabel2[[#This Row],[Entiteit of attribuut]]))","v":{"$error":"#REF!"}},{"$f":"IF(Schema!I194=\"\",\"\",Schema!I194)","v":""},{"$f":"IF(Schema!J194=\"\",\"\",Schema!J194)","v":""},{"$f":"IF(Schema!K194=\"\",\"\",Schema!K194)","v":""},{"$f":"IF(Schema!L194=\"\",\"\",Schema!L194)","v":""},{"$f":"IF(Schema!N194=\"\",\"\",Schema!N194)","v":"O"}]
[{"$f":"Schema!A195&Schema!B195&Schema!C195&Schema!D195","v":"PRCTEKC"},{"$error":"#REF!"},{"$f":"IF(A189=\"\",\"\",IF(LEN(Schema!A195)=2,1,IF(LEN(Schema!B195)=2,10,IF(LEN(Schema!C195)=2,100,0))))","v":0},{"$error":"#REF!"},{"$f":"IF(A189=\"\",\"\",SUM(Tabel2[[#This Row],[I1]:[I2]]))","v":{"$error":"#REF!"}},{"$error":"#REF!"},{"$error":"#REF!"},{"$error":"#REF!"},{"$error":"#REF!"},{"$f":"IF(C189=\"\",\"\",IF(LEN(Tabel2[[#This Row],[Entiteit of attribuut]])=2,\"\",Tabel2[[#This Row],[Entiteit]]&\"_\"&Tabel2[[#This Row],[Entiteit of attribuut]]))","v":{"$error":"#REF!"}},{"$f":"IF(Schema!I195=\"\",\"\",Schema!I195)","v":""},{"$f":"IF(Schema!J195=\"\",\"\",Schema!J195)","v":""},{"$f":"IF(Schema!K195=\"\",\"\",Schema!K195)","v":""},{"$f":"IF(Schema!L195=\"\",\"\",Schema!L195)","v":""},{"$f":"IF(Schema!N195=\"\",\"\",Schema!N195)","v":"O"}]
[{"$f":"Schema!A196&Schema!B196&Schema!C196&Schema!D196","v":"RELVRH"},{"$error":"#REF!"},{"$f":"IF(A190=\"\",\"\",IF(LEN(Schema!A196)=2,1,IF(LEN(Schema!B196)=2,10,IF(LEN(Schema!C196)=2,100,0))))","v":0},{"$error":"#REF!"},{"$f":"IF(A190=\"\",\"\",SUM(Tabel2[[#This Row],[I1]:[I2]]))","v":{"$error":"#REF!"}},{"$error":"#REF!"},{"$error":"#REF!"},{"$error":"#REF!"},{"$error":"#REF!"},{"$f":"IF(C190=\"\",\"\",IF(LEN(Tabel2[[#This Row],[Entiteit of attribuut]])=2,\"\",Tabel2[[#This Row],[Entiteit]]&\"_\"&Tabel2[[#This Row],[Entiteit of attribuut]]))","v":{"$error":"#REF!"}},{"$f":"IF(Schema!I196=\"\",\"\",Schema!I196)","v":""},{"$f":"IF(Schema!J196=\"\",\"\",Schema!J196)","v":""},{"$f":"IF(Schema!K196=\"\",\"\",Schema!K196)","v":""},{"$f":"IF(Schema!L196=\"\",\"\",Schema!L196)","v":""},{"$f":"IF(Schema!N196=\"\",\"\",Schema!N196)","v":"O"}]
[{"$f":"Schema!A197&Schema!B197&Schema!C197&Schema!D197","v":"RELVVNR"},{"$error":"#REF!"},{"$f":"IF(A191=\"\",\"\",IF(LEN(Schema!A197)=2,1,IF(LEN(Schema!B197)=2,10,IF(LEN(Schema!C197)=2,100,0))))","v":0},{"$error":"#REF!"},{"$f":"IF(A191=\"\",\"\",SUM(Tabel2[[#This Row],[I1]:[I2]]))","v":{"$error":"#REF!"}},{"$error":"#REF!"},{"$error":"#REF!"},{"$error":"#REF!"},{"$error":"#REF!"},{"$f":"IF(C191=\"\",\"\",IF(LEN(Tabel2[[#This Row],[Entiteit of attribuut]])=2,\"\",Tabel2[[#This Row],[Entiteit]]&\"_\"&Tabel2[[#This Row],[Entiteit of attribuut]]))","v":{"$error":"#REF!"}},{"$f":"IF(Schema!I197=\"\",\"\",Schema!I197)","v":""},{"$f":"IF(Schema!J197=\"\",\"\",Schema!J197)","v":""},{"$f":"IF(Schema!K197=\"\",\"\",Schema!K197)","v":""},{"$f":"IF(Schema!L197=\"\",\"\",Schema!L197)","v":""},{"$f":"IF(Schema!N197=\"\",\"\",Schema!N197)","v":"O"}]
[{"$f":"Schema!A198&Schema!B198&Schema!C198&Schema!D198","v":"RJRCOR"},{"$error":"#REF!"},{"$f":"IF(A192=\"\",\"\",IF(LEN(Schema!A198)=2,1,IF(LEN(Schema!B198)=2,10,IF(LEN(Schema!C198)=2,100,0))))","v":0},{"$error":"#REF!"},{"$f":"IF(A192=\"\",\"\",SUM(Tabel2[[#This Row],[I1]:[I2]]))","v":{"$error":"#REF!"}},{"$error":"#REF!"},{"$error":"#REF!"},{"$error":"#REF!"},{"$error":"#REF!"},{"$f":"IF(C192=\"\",\"\",IF(LEN(Tabel2[[#This Row],[Entiteit of attribuut]])=2,\"\",Tabel2[[#This Row],[Entiteit]]&\"_\"&Tabel2[[#This Row],[Entiteit of attribuut]]))","v":{"$error":"#REF!"}},{"$f":"IF(Schema!I198=\"\",\"\",Schema!I198)","v":""},{"$f":"IF(Schema!J198=\"\",\"\",Schema!J198)","v":""},{"$f":"IF(Schema!K198=\"\",\"\",Schema!K198)","v":""},{"$f":"IF(Schema!L198=\"\",\"\",Schema!L198)","v":""},{"$f":"IF(Schema!N198=\"\",\"\",Schema!N198)","v":"O"}]
[{"$f":"Schema!A199&Schema!B199&Schema!C199&Schema!D199","v":"TCORBDR"},{"$error":"#REF!"},{"$f":"IF(A193=\"\",\"\",IF(LEN(Schema!A199)=2,1,IF(LEN(Schema!B199)=2,10,IF(LEN(Schema!C199)=2,100,0))))","v":0},{"$error":"#REF!"},{"$f":"IF(A193=\"\",\"\",SUM(Tabel2[[#This Row],[I1]:[I2]]))","v":{"$error":"#REF!"}},{"$error":"#REF!"},{"$error":"#REF!"},{"$error":"#REF!"},{"$error":"#REF!"},{"$f":"IF(C193=\"\",\"\",IF(LEN(Tabel2[[#This Row],[Entiteit of attribuut]])=2,\"\",Tabel2[[#This Row],[Entiteit]]&\"_\"&Tabel2[[#This Row],[Entiteit of attribuut]]))","v":{"$error":"#REF!"}},{"$f":"IF(Schema!I199=\"\",\"\",Schema!I199)","v":""},{"$f":"IF(Schema!J199=\"\",\"\",Schema!J199)","v":""},{"$f":"IF(Schema!K199=\"\",\"\",Schema!K199)","v":""},{"$f":"IF(Schema!L199=\"\",\"\",Schema!L199)","v":""},{"$f":"IF(Schema!N199=\"\",\"\",Schema!N199)","v":"O"}]
[{"$f":"Schema!A200&Schema!B200&Schema!C200&Schema!D200","v":"VEERB"},{"$error":"#REF!"},{"$f":"IF(A194=\"\",\"\",IF(LEN(Schema!A200)=2,1,IF(LEN(Schema!B200)=2,10,IF(LEN(Schema!C200)=2,100,0))))","v":0},{"$error":"#REF!"},{"$f":"IF(A194=\"\",\"\",SUM(Tabel2[[#This Row],[I1]:[I2]]))","v":{"$error":"#REF!"}},{"$error":"#REF!"},{"$error":"#REF!"},{"$error":"#REF!"},{"$error":"#REF!"},{"$f":"IF(C194=\"\",\"\",IF(LEN(Tabel2[[#This Row],[Entiteit of attribuut]])=2,\"\",Tabel2[[#This Row],[Entiteit]]&\"_\"&Tabel2[[#This Row],[Entiteit of attribuut]]))","v":{"$error":"#REF!"}},{"$f":"IF(Schema!I200=\"\",\"\",Schema!I200)","v":""},{"$f":"IF(Schema!J200=\"\",\"\",Schema!J200)","v":""},{"$f":"IF(Schema!K200=\"\",\"\",Schema!K200)","v":""},{"$f":"IF(Schema!L200=\"\",\"\",Schema!L200)","v":""},{"$f":"IF(Schema!N200=\"\",\"\",Schema!N200)","v":"LEEG"}]
[{"$f":"Schema!A201&Schema!B201&Schema!C201&Schema!D201","v":"VERZSOM"},{"$f":"IF(LEN(A195)=2,A195,IF(A195=\"\",\"Leeg\",B194))","v":{"$error":"#REF!"}},{"$f":"IF(A195=\"\",\"\",IF(LEN(Schema!A201)=2,1,IF(LEN(Schema!B201)=2,10,IF(LEN(Schema!C201)=2,100,0))))","v":0},{"$f":"IF(C195=0,D194,C195)","v":{"$error":"#REF!"}},{"$f":"IF(A195=\"\",\"\",SUM(Tabel2[[#This Row],[I1]:[I2]]))","v":{"$error":"#REF!"}},{"$f":"IF(A195=\"\",\"\",IF(C195=1,B195,F194))","v":{"$error":"#REF!"}},{"$f":"IF(C195=10,A195,IF(OR(C195=0,C195=100),G194,\"\"))","v":{"$error":"#REF!"}},{"$f":"IF(E195=200,B195,IF(C195=0,H194,\"\"))","v":{"$error":"#REF!"}},{"$f":"IF(C195=\"\",\"\",IF(OR(E195=1,E195=10,E195=100),I194,IF(E195=2,F195,IF(E195=20,F195&\"/\"&G195,IF(E195=200,F195&\"/\"&G195&\"/\"&H195)))))","v":{"$error":"#REF!"}},{"$f":"IF(C195=\"\",\"\",IF(LEN(Tabel2[[#This Row],[Entiteit of attribuut]])=2,\"\",Tabel2[[#This Row],[Entiteit]]&\"_\"&Tabel2[[#This Row],[Entiteit of attribuut]]))","v":{"$error":"#REF!"}},{"$f":"IF(Schema!I201=\"\",\"\",Schema!I201)","v":""},{"$f":"IF(Schema!J201=\"\",\"\",Schema!J201)","v":""},{"$f":"IF(Schema!K201=\"\",\"\",Schema!K201)","v":""},{"$f":"IF(Schema!L201=\"\",\"\",Schema!L201)","v":""},{"$f":"IF(Schema!N201=\"\",\"\",Schema!N201)","v":"O"}]
[{"$f":"Schema!A202&Schema!B202&Schema!C202&Schema!D202","v":"VGBRA"},{"$error":"#REF!"},{"$f":"IF(A196=\"\",\"\",IF(LEN(Schema!A202)=2,1,IF(LEN(Schema!B202)=2,10,IF(LEN(Schema!C202)=2,100,0))))","v":0},{"$error":"#REF!"},{"$f":"IF(A196=\"\",\"\",SUM(Tabel2[[#This Row],[I1]:[I2]]))","v":{"$error":"#REF!"}},{"$error":"#REF!"},{"$error":"#REF!"},{"$error":"#REF!"},{"$error":"#REF!"},{"$f":"IF(C196=\"\",\"\",IF(LEN(Tabel2[[#This Row],[Entiteit of attribuut]])=2,\"\",Tabel2[[#This Row],[Entiteit]]&\"_\"&Tabel2[[#This Row],[Entiteit of attribuut]]))","v":{"$error":"#REF!"}},{"$f":"IF(Schema!I202=\"\",\"\",Schema!I202)","v":""},{"$f":"IF(Schema!J202=\"\",\"\",Schema!J202)","v":""},{"$f":"IF(Schema!K202=\"\",\"\",Schema!K202)","v":""},{"$f":"IF(Schema!L202=\"\",\"\",Schema!L202)","v":""},{"$f":"IF(Schema!N202=\"\",\"\",Schema!N202)","v":"O"}]
[{"$f":"Schema!A203&Schema!B203&Schema!C203&Schema!D203","v":"VOLGNUM"},{"$error":"#REF!"},{"$f":"IF(A197=\"\",\"\",IF(LEN(Schema!A203)=2,1,IF(LEN(Schema!B203)=2,10,IF(LEN(Schema!C203)=2,100,0))))","v":0},{"$error":"#REF!"},{"$f":"IF(A197=\"\",\"\",SUM(Tabel2[[#This Row],[I1]:[I2]]))","v":{"$error":"#REF!"}},{"$error":"#REF!"},{"$error":"#REF!"},{"$error":"#REF!"},{"$error":"#REF!"},{"$f":"IF(C197=\"\",\"\",IF(LEN(Tabel2[[#This Row],[Entiteit of attribuut]])=2,\"\",Tabel2[[#This Row],[Entiteit]]&\"_\"&Tabel2[[#This Row],[Entiteit of attribuut]]))","v":{"$error":"#REF!"}},{"$f":"IF(Schema!I203=\"\",\"\",Schema!I203)","v":""},{"$f":"IF(Schema!J203=\"\",\"\",Schema!J203)","v":""},{"$f":"IF(Schema!K203=\"\",\"\",Schema!K203)","v":""},{"$f":"IF(Schema!L203=\"\",\"\",Schema!L203)","v":""},{"$f":"IF(Schema!N203=\"\",\"\",Schema!N203)","v":"LEEG"}]
[{"$f":"Schema!A204&Schema!B204&Schema!C204&Schema!D204","v":"VRWRKCD"},{"$error":"#REF!"},{"$f":"IF(A198=\"\",\"\",IF(LEN(Schema!A204)=2,1,IF(LEN(Schema!B204)=2,10,IF(LEN(Schema!C204)=2,100,0))))","v":0},{"$error":"#REF!"},{"$f":"IF(A198=\"\",\"\",SUM(Tabel2[[#This Row],[I1]:[I2]]))","v":{"$error":"#REF!"}},{"$error":"#REF!"},{"$error":"#REF!"},{"$error":"#REF!"},{"$error":"#REF!"},{"$f":"IF(C198=\"\",\"\",IF(LEN(Tabel2[[#This Row],[Entiteit of attribuut]])=2,\"\",Tabel2[[#This Row],[Entiteit]]&\"_\"&Tabel2[[#This Row],[Entiteit of attribuut]]))","v":{"$error":"#REF!"}},{"$f":"IF(Schema!I204=\"\",\"\",Schema!I204)","v":""},{"$f":"IF(Schema!J204=\"\",\"\",Schema!J204)","v":""},{"$f":"IF(Schema!K204=\"\",\"\",Schema!K204)","v":""},{"$f":"IF(Schema!L204=\"\",\"\",Schema!L204)","v":""},{"$f":"IF(Schema!N204=\"\",\"\",Schema!N204)","v":"LEEG"}]
[{"$f":"Schema!A205&Schema!B205&Schema!C205&Schema!D205","v":"WPREMBP"},{"$error":"#REF!"},{"$f":"IF(A199=\"\",\"\",IF(LEN(Schema!A205)=2,1,IF(LEN(Schema!B205)=2,10,IF(LEN(Schema!C205)=2,100,0))))","v":0},{"$error":"#REF!"},{"$f":"IF(A199=\"\",\"\",SUM(Tabel2[[#This Row],[I1]:[I2]]))","v":{"$error":"#REF!"}},{"$error":"#REF!"},{"$error":"#REF!"},{"$error":"#REF!"},{"$error":"#REF!"},{"$f":"IF(C199=\"\",\"\",IF(LEN(Tabel2[[#This Row],[Entiteit of attribuut]])=2,\"\",Tabel2[[#This Row],[Entiteit]]&\"_\"&Tabel2[[#This Row],[Entiteit of attribuut]]))","v":{"$error":"#REF!"}},{"$f":"IF(Schema!I205=\"\",\"\",Schema!I205)","v":""},{"$f":"IF(Schema!J205=\"\",\"\",Schema!J205)","v":""},{"$f":"IF(Schema!K205=\"\",\"\",Schema!K205)","v":""},{"$f":"IF(Schema!L205=\"\",\"\",Schema!L205)","v":""},{"$f":"IF(Schema!N205=\"\",\"\",Schema!N205)","v":"O"}]
[{"$f":"Schema!A206&Schema!B206&Schema!C206&Schema!D206","v":"MP"},"MP",{"$f":"IF(A200=\"\",\"\",IF(LEN(Schema!A206)=2,1,IF(LEN(Schema!B206)=2,10,IF(LEN(Schema!C206)=2,100,0))))","v":100},100,{"$f":"IF(A200=\"\",\"\",SUM(Tabel2[[#This Row],[I1]:[I2]]))","v":200},{"$error":"#REF!"},{"$error":"#REF!"},"MP",{"$error":"#REF!"},{"$f":"IF(C200=\"\",\"\",IF(LEN(Tabel2[[#This Row],[Entiteit of attribuut]])=2,\"\",Tabel2[[#This Row],[Entiteit]]&\"_\"&Tabel2[[#This Row],[Entiteit of attribuut]]))","v":""},{"$f":"IF(Schema!I206=\"\",\"\",Schema!I206)","v":""},{"$f":"IF(Schema!J206=\"\",\"\",Schema!J206)","v":""},{"$f":"IF(Schema!K206=\"\",\"\",Schema!K206)","v":""},{"$f":"IF(Schema!L206=\"\",\"\",Schema!L206)","v":""},{"$f":"IF(Schema!N206=\"\",\"\",Schema!N206)","v":"O"}]
[{"$f":"Schema!A207&Schema!B207&Schema!C207&Schema!D207","v":"MYAAND"},"MP",{"$f":"IF(A201=\"\",\"\",IF(LEN(Schema!A207)=2,1,IF(LEN(Schema!B207)=2,10,IF(LEN(Schema!C207)=2,100,0))))","v":0},100,{"$f":"IF(A201=\"\",\"\",SUM(Tabel2[[#This Row],[I1]:[I2]]))","v":100},{"$error":"#REF!"},{"$error":"#REF!"},"MP",{"$error":"#REF!"},{"$f":"IF(C201=\"\",\"\",IF(LEN(Tabel2[[#This Row],[Entiteit of attribuut]])=2,\"\",Tabel2[[#This Row],[Entiteit]]&\"_\"&Tabel2[[#This Row],[Entiteit of attribuut]]))","v":"MP_MYAAND"},{"$f":"IF(Schema!I207=\"\",\"\",Schema!I207)","v":""},{"$f":"IF(Schema!J207=\"\",\"\",Schema!J207)","v":""},{"$f":"IF(Schema!K207=\"\",\"\",Schema!K207)","v":""},{"$f":"IF(Schema!L207=\"\",\"\",Schema!L207)","v":""},{"$f":"IF(Schema!N207=\"\",\"\",Schema!N207)","v":"O"}]
[{"$f":"Schema!A208&Schema!B208&Schema!C208&Schema!D208","v":"PLLEAD"},"MP",{"$f":"IF(A202=\"\",\"\",IF(LEN(Schema!A208)=2,1,IF(LEN(Schema!B208)=2,10,IF(LEN(Schema!C208)=2,100,0))))","v":0},100,{"$f":"IF(A202=\"\",\"\",SUM(Tabel2[[#This Row],[I1]:[I2]]))","v":100},{"$error":"#REF!"},{"$error":"#REF!"},"MP",{"$error":"#REF!"},{"$f":"IF(C202=\"\",\"\",IF(LEN(Tabel2[[#This Row],[Entiteit of attribuut]])=2,\"\",Tabel2[[#This Row],[Entiteit]]&\"_\"&Tabel2[[#This Row],[Entiteit of attribuut]]))","v":"MP_PLLEAD"},{"$f":"IF(Schema!I208=\"\",\"\",Schema!I208)","v":""},{"$f":"IF(Schema!J208=\"\",\"\",Schema!J208)","v":""},{"$f":"IF(Schema!K208=\"\",\"\",Schema!K208)","v":""},{"$f":"IF(Schema!L208=\"\",\"\",Schema!L208)","v":""},{"$f":"IF(Schema!N208=\"\",\"\",Schema!N208)","v":"O"}]
[{"$f":"Schema!A209&Schema!B209&Schema!C209&Schema!D209","v":"POOLNUM"},"MP",{"$f":"IF(A203=\"\",\"\",IF(LEN(Schema!A209)=2,1,IF(LEN(Schema!B209)=2,10,IF(LEN(Schema!C209)=2,100,0))))","v":0},100,{"$f":"IF(A203=\"\",\"\",SUM(Tabel2[[#This Row],[I1]:[I2]]))","v":100},{"$error":"#REF!"},{"$error":"#REF!"},"MP",{"$error":"#REF!"},{"$f":"IF(C203=\"\",\"\",IF(LEN(Tabel2[[#This Row],[Entiteit of attribuut]])=2,\"\",Tabel2[[#This Row],[Entiteit]]&\"_\"&Tabel2[[#This Row],[Entiteit of attribuut]]))","v":"MP_POOLNUM"},{"$f":"IF(Schema!I209=\"\",\"\",Schema!I209)","v":""},{"$f":"IF(Schema!J209=\"\",\"\",Schema!J209)","v":""},{"$f":"IF(Schema!K209=\"\",\"\",Schema!K209)","v":""},{"$f":"IF(Schema!L209=\"\",\"\",Schema!L209)","v":""},{"$f":"IF(Schema!N209=\"\",\"\",Schema!N209)","v":"V"}]
[{"$f":"Schema!A210&Schema!B210&Schema!C210&Schema!D210","v":"POOLPRC"},"MP",{"$f":"IF(A204=\"\",\"\",IF(LEN(Schema!A210)=2,1,IF(LEN(Schema!B210)=2,10,IF(LEN(Schema!C210)=2,100,0))))","v":0},100,{"$f":"IF(A204=\"\",\"\",SUM(Tabel2[[#This Row],[I1]:[I2]]))","v":100},{"$error":"#REF!"},{"$error":"#REF!"},"MP",{"$error":"#REF!"},{"$f":"IF(C204=\"\",\"\",IF(LEN(Tabel2[[#This Row],[Entiteit of attribuut]])=2,\"\",Tabel2[[#This Row],[Entiteit]]&\"_\"&Tabel2[[#This Row],[Entiteit of attribuut]]))","v":"MP_POOLPRC"},{"$f":"IF(Schema!I210=\"\",\"\",Schema!I210)","v":""},{"$f":"IF(Schema!J210=\"\",\"\",Schema!J210)","v":""},{"$f":"IF(Schema!K210=\"\",\"\",Schema!K210)","v":""},{"$f":"IF(Schema!L210=\"\",\"\",Schema!L210)","v":""},{"$f":"IF(Schema!N210=\"\",\"\",Schema!N210)","v":"V"}]
[{"$f":"Schema!A211&Schema!B211&Schema!C211&Schema!D211","v":"DZ"},"DZ",{"$f":"IF(A205=\"\",\"\",IF(LEN(Schema!A211)=2,1,IF(LEN(Schema!B211)=2,10,IF(LEN(Schema!C211)=2,100,0))))","v":10},10,{"$f":"IF(A205=\"\",\"\",SUM(Tabel2[[#This Row],[I1]:[I2]]))","v":20},{"$error":"#REF!"},"DZ","",{"$error":"#REF!"},{"$f":"IF(C205=\"\",\"\",IF(LEN(Tabel2[[#This Row],[Entiteit of attribuut]])=2,\"\",Tabel2[[#This Row],[Entiteit]]&\"_\"&Tabel2[[#This Row],[Entiteit of attribuut]]))","v":""},{"$f":"IF(Schema!I211=\"\",\"\",Schema!I211)","v":""},{"$f":"IF(Schema!J211=\"\",\"\",Schema!J211)","v":""},{"$f":"IF(Schema!K211=\"\",\"\",Schema!K211)","v":""},{"$f":"IF(Schema!L211=\"\",\"\",Schema!L211)","v":""},{"$f":"IF(Schema!N211=\"\",\"\",Schema!N211)","v":"O"}]
[{"$f":"Schema!A212&Schema!B212&Schema!C212&Schema!D212","v":"BAFWST"},"DZ",{"$f":"IF(A206=\"\",\"\",IF(LEN(Schema!A212)=2,1,IF(LEN(Schema!B212)=2,10,IF(LEN(Schema!C212)=2,100,0))))","v":0},10,{"$f":"IF(A206=\"\",\"\",SUM(Tabel2[[#This Row],[I1]:[I2]]))","v":10},{"$error":"#REF!"},"DZ","",{"$error":"#REF!"},{"$f":"IF(C206=\"\",\"\",IF(LEN(Tabel2[[#This Row],[Entiteit of attribuut]])=2,\"\",Tabel2[[#This Row],[Entiteit]]&\"_\"&Tabel2[[#This Row],[Entiteit of attribuut]]))","v":"DZ_BAFWST"},{"$f":"IF(Schema!I212=\"\",\"\",Schema!I212)","v":""},{"$f":"IF(Schema!J212=\"\",\"\",Schema!J212)","v":""},{"$f":"IF(Schema!K212=\"\",\"\",Schema!K212)","v":""},{"$f":"IF(Schema!L212=\"\",\"\",Schema!L212)","v":""},{"$f":"IF(Schema!N212=\"\",\"\",Schema!N212)","v":"O"}]
[{"$f":"Schema!A213&Schema!B213&Schema!C213&Schema!D213","v":"BTP"},"DZ",{"$f":"IF(A207=\"\",\"\",IF(LEN(Schema!A213)=2,1,IF(LEN(Schema!B213)=2,10,IF(LEN(Schema!C213)=2,100,0))))","v":0},10,{"$f":"IF(A207=\"\",\"\",SUM(Tabel2[[#This Row],[I1]:[I2]]))","v":10},{"$error":"#REF!"},"DZ","",{"$error":"#REF!"},{"$f":"IF(C207=\"\",\"\",IF(LEN(Tabel2[[#This Row],[Entiteit of attribuut]])=2,\"\",Tabel2[[#This Row],[Entiteit]]&\"_\"&Tabel2[[#This Row],[Entiteit of attribuut]]))","v":"DZ_BTP"},{"$f":"IF(Schema!I213=\"\",\"\",Schema!I213)","v":""},{"$f":"IF(Schema!J213=\"\",\"\",Schema!J213)","v":""},{"$f":"IF(Schema!K213=\"\",\"\",Schema!K213)","v":""},{"$f":"IF(Schema!L213=\"\",\"\",Schema!L213)","v":""},{"$f":"IF(Schema!N213=\"\",\"\",Schema!N213)","v":"LEEG"}]
[{"$f":"Schema!A214&Schema!B214&Schema!C214&Schema!D214","v":"CODE"},"DZ",{"$f":"IF(A208=\"\",\"\",IF(LEN(Schema!A214)=2,1,IF(LEN(Schema!B214)=2,10,IF(LEN(Schema!C214)=2,100,0))))","v":0},10,{"$f":"IF(A208=\"\",\"\",SUM(Tabel2[[#This Row],[I1]:[I2]]))","v":10},{"$error":"#REF!"},"DZ","",{"$error":"#REF!"},{"$f":"IF(C208=\"\",\"\",IF(LEN(Tabel2[[#This Row],[Entiteit of attribuut]])=2,\"\",Tabel2[[#This Row],[Entiteit]]&\"_\"&Tabel2[[#This Row],[Entiteit of attribuut]]))","v":"DZ_CODE"},{"$f":"IF(Schema!I214=\"\",\"\",Schema!I214)","v":""},{"$f":"IF(Schema!J214=\"\",\"\",Schema!J214)","v":""},{"$f":"IF(Schema!K214=\"\",\"\",Schema!K214)","v":""},{"$f":"IF(Schema!L214=\"\",\"\",Schema!L214)","v":""},{"$f":"IF(Schema!N214=\"\",\"\",Schema!N214)","v":"O"}]
[{"$f":"Schema!A215&Schema!B215&Schema!C215&Schema!D215","v":"COLFACT"},"DZ",{"$f":"IF(A209=\"\",\"\",IF(LEN(Schema!A215)=2,1,IF(LEN(Schema!B215)=2,10,IF(LEN(Schema!C215)=2,100,0))))","v":0},10,{"$f":"IF(A209=\"\",\"\",SUM(Tabel2[[#This Row],[I1]:[I2]]))","v":10},{"$error":"#REF!"},"DZ","",{"$error":"#REF!"},{"$f":"IF(C209=\"\",\"\",IF(LEN(Tabel2[[#This Row],[Entiteit of attribuut]])=2,\"\",Tabel2[[#This Row],[Entiteit]]&\"_\"&Tabel2[[#This Row],[Entiteit of attribuut]]))","v":"DZ_COLFACT"},{"$f":"IF(Schema!I215=\"\",\"\",Schema!I215)","v":""},{"$f":"IF(Schema!J215=\"\",\"\",Schema!J215)","v":""},{"$f":"IF(Schema!K215=\"\",\"\",Schema!K215)","v":""},{"$f":"IF(Schema!L215=\"\",\"\",Schema!L215)","v":""},{"$f":"IF(Schema!N215=\"\",\"\",Schema!N215)","v":"O"}]
[{"$f":"Schema!A216&Schema!B216&Schema!C216&Schema!D216","v":"ERB"},"DZ",{"$f":"IF(A210=\"\",\"\",IF(LEN(Schema!A216)=2,1,IF(LEN(Schema!B216)=2,10,IF(LEN(Schema!C216)=2,100,0))))","v":0},10,{"$f":"IF(A210=\"\",\"\",SUM(Tabel2[[#This Row],[I1]:[I2]]))","v":10},{"$error":"#REF!"},"DZ","",{"$error":"#REF!"},{"$f":"IF(C210=\"\",\"\",IF(LEN(Tabel2[[#This Row],[Entiteit of attribuut]])=2,\"\",Tabel2[[#This Row],[Entiteit]]&\"_\"&Tabel2[[#This Row],[Entiteit of attribuut]]))","v":"DZ_ERB"},{"$f":"IF(Schema!I216=\"\",\"\",Schema!I216)","v":""},{"$f":"IF(Schema!J216=\"\",\"\",Schema!J216)","v":""},{"$f":"IF(Schema!K216=\"\",\"\",Schema!K216)","v":""},{"$f":"IF(Schema!L216=\"\",\"\",Schema!L216)","v":""},{"$f":"IF(Schema!N216=\"\",\"\",Schema!N216)","v":"O"}]
[{"$f":"Schema!A217&Schema!B217&Schema!C217&Schema!D217","v":"GADEKCD"},"DZ",{"$f":"IF(A211=\"\",\"\",IF(LEN(Schema!A217)=2,1,IF(LEN(Schema!B217)=2,10,IF(LEN(Schema!C217)=2,100,0))))","v":0},10,{"$f":"IF(A211=\"\",\"\",SUM(Tabel2[[#This Row],[I1]:[I2]]))","v":10},{"$error":"#REF!"},"DZ","",{"$error":"#REF!"},{"$f":"IF(C211=\"\",\"\",IF(LEN(Tabel2[[#This Row],[Entiteit of attribuut]])=2,\"\",Tabel2[[#This Row],[Entiteit]]&\"_\"&Tabel2[[#This Row],[Entiteit of attribuut]]))","v":"DZ_GADEKCD"},{"$f":"IF(Schema!I217=\"\",\"\",Schema!I217)","v":""},{"$f":"IF(Schema!J217=\"\",\"\",Schema!J217)","v":""},{"$f":"IF(Schema!K217=\"\",\"\",Schema!K217)","v":""},{"$f":"IF(Schema!L217=\"\",\"\",Schema!L217)","v":""},{"$f":"IF(Schema!N217=\"\",\"\",Schema!N217)","v":"V"}]
[{"$f":"Schema!A218&Schema!B218&Schema!C218&Schema!D218","v":"GADEKCO"},"DZ",{"$f":"IF(A212=\"\",\"\",IF(LEN(Schema!A218)=2,1,IF(LEN(Schema!B218)=2,10,IF(LEN(Schema!C218)=2,100,0))))","v":0},10,{"$f":"IF(A212=\"\",\"\",SUM(Tabel2[[#This Row],[I1]:[I2]]))","v":10},{"$error":"#REF!"},"DZ","",{"$error":"#REF!"},{"$f":"IF(C212=\"\",\"\",IF(LEN(Tabel2[[#This Row],[Entiteit of attribuut]])=2,\"\",Tabel2[[#This Row],[Entiteit]]&\"_\"&Tabel2[[#This Row],[Entiteit of attribuut]]))","v":"DZ_GADEKCO"},{"$f":"IF(Schema!I218=\"\",\"\",Schema!I218)","v":""},{"$f":"IF(Schema!J218=\"\",\"\",Schema!J218)","v":""},{"$f":"IF(Schema!K218=\"\",\"\",Schema!K218)","v":""},{"$f":"IF(Schema!L218=\"\",\"\",Schema!L218)","v":""},{"$f":"IF(Schema!N218=\"\",\"\",Schema!N218)","v":"V"}]
[{"$f":"Schema!A219&Schema!B219&Schema!C219&Schema!D219","v":"MYCODE"},"DZ",{"$f":"IF(A213=\"\",\"\",IF(LEN(Schema!A219)=2,1,IF(LEN(Schema!B219)=2,10,IF(LEN(Schema!C219)=2,100,0))))","v":0},10,{"$f":"IF(A213=\"\",\"\",SUM(Tabel2[[#This Row],[I1]:[I2]]))","v":10},{"$error":"#REF!"},"DZ","",{"$error":"#REF!"},{"$f":"IF(C213=\"\",\"\",IF(LEN(Tabel2[[#This Row],[Entiteit of attribuut]])=2,\"\",Tabel2[[#This Row],[Entiteit]]&\"_\"&Tabel2[[#This Row],[Entiteit of attribuut]]))","v":"DZ_MYCODE"},{"$f":"IF(Schema!I219=\"\",\"\",Schema!I219)","v":""},{"$f":"IF(Schema!J219=\"\",\"\",Schema!J219)","v":""},{"$f":"IF(Schema!K219=\"\",\"\",Schema!K219)","v":""},{"$f":"IF(Schema!L219=\"\",\"\",Schema!L219)","v":""},{"$f":"IF(Schema!N219=\"\",\"\",Schema!N219)","v":"O"}]
[{"$f":"Schema!A220&Schema!B220&Schema!C220&Schema!D220","v":"NJP"},"DZ",{"$f":"IF(A214=\"\",\"\",IF(LEN(Schema!A220)=2,1,IF(LEN(Schema!B220)=2,10,IF(LEN(Schema!C220)=2,100,0))))","v":0},10,{"$f":"IF(A214=\"\",\"\",SUM(Tabel2[[#This Row],[I1]:[I2]]))","v":10},{"$error":"#REF!"},"DZ","",{"$error":"#REF!"},{"$f":"IF(C214=\"\",\"\",IF(LEN(Tabel2[[#This Row],[Entiteit of attribuut]])=2,\"\",Tabel2[[#This Row],[Entiteit]]&\"_\"&Tabel2[[#This Row],[Entiteit of attribuut]]))","v":"DZ_NJP"},{"$f":"IF(Schema!I220=\"\",\"\",Schema!I220)","v":""},{"$f":"IF(Schema!J220=\"\",\"\",Schema!J220)","v":""},{"$f":"IF(Schema!K220=\"\",\"\",Schema!K220)","v":""},{"$f":"IF(Schema!L220=\"\",\"\",Schema!L220)","v":""},{"$f":"IF(Schema!N220=\"\",\"\",Schema!N220)","v":"O"}]
[{"$f":"Schema!A221&Schema!B221&Schema!C221&Schema!D221","v":"PAFWST"},"DZ",{"$f":"IF(A215=\"\",\"\",IF(LEN(Schema!A221)=2,1,IF(LEN(Schema!B221)=2,10,IF(LEN(Schema!C221)=2,100,0))))","v":0},10,{"$f":"IF(A215=\"\",\"\",SUM(Tabel2[[#This Row],[I1]:[I2]]))","v":10},{"$error":"#REF!"},"DZ","",{"$error":"#REF!"},{"$f":"IF(C215=\"\",\"\",IF(LEN(Tabel2[[#This Row],[Entiteit of attribuut]])=2,\"\",Tabel2[[#This Row],[Entiteit]]&\"_\"&Tabel2[[#This Row],[Entiteit of attribuut]]))","v":"DZ_PAFWST"},{"$f":"IF(Schema!I221=\"\",\"\",Schema!I221)","v":""},{"$f":"IF(Schema!J221=\"\",\"\",Schema!J221)","v":""},{"$f":"IF(Schema!K221=\"\",\"\",Schema!K221)","v":""},{"$f":"IF(Schema!L221=\"\",\"\",Schema!L221)","v":""},{"$f":"IF(Schema!N221=\"\",\"\",Schema!N221)","v":"O"}]
[{"$f":"Schema!A222&Schema!B222&Schema!C222&Schema!D222","v":"PPRC"},"DZ",{"$f":"IF(A216=\"\",\"\",IF(LEN(Schema!A222)=2,1,IF(LEN(Schema!B222)=2,10,IF(LEN(Schema!C222)=2,100,0))))","v":0},10,{"$f":"IF(A216=\"\",\"\",SUM(Tabel2[[#This Row],[I1]:[I2]]))","v":10},{"$error":"#REF!"},"DZ","",{"$error":"#REF!"},{"$f":"IF(C216=\"\",\"\",IF(LEN(Tabel2[[#This Row],[Entiteit of attribuut]])=2,\"\",Tabel2[[#This Row],[Entiteit]]&\"_\"&Tabel2[[#This Row],[Entiteit of attribuut]]))","v":"DZ_PPRC"},{"$f":"IF(Schema!I222=\"\",\"\",Schema!I222)","v":""},{"$f":"IF(Schema!J222=\"\",\"\",Schema!J222)","v":""},{"$f":"IF(Schema!K222=\"\",\"\",Schema!K222)","v":""},{"$f":"IF(Schema!L222=\"\",\"\",Schema!L222)","v":""},{"$f":"IF(Schema!N222=\"\",\"\",Schema!N222)","v":"O"}]
[{"$f":"Schema!A223&Schema!B223&Schema!C223&Schema!D223","v":"PRCPKKT"},"DZ",{"$f":"IF(A217=\"\",\"\",IF(LEN(Schema!A223)=2,1,IF(LEN(Schema!B223)=2,10,IF(LEN(Schema!C223)=2,100,0))))","v":0},10,{"$f":"IF(A217=\"\",\"\",SUM(Tabel2[[#This Row],[I1]:[I2]]))","v":10},{"$error":"#REF!"},"DZ","",{"$error":"#REF!"},{"$f":"IF(C217=\"\",\"\",IF(LEN(Tabel2[[#This Row],[Entiteit of attribuut]])=2,\"\",Tabel2[[#This Row],[Entiteit]]&\"_\"&Tabel2[[#This Row],[Entiteit of attribuut]]))","v":"DZ_PRCPKKT"},{"$f":"IF(Schema!I223=\"\",\"\",Schema!I223)","v":""},{"$f":"IF(Schema!J223=\"\",\"\",Schema!J223)","v":""},{"$f":"IF(Schema!K223=\"\",\"\",Schema!K223)","v":""},{"$f":"IF(Schema!L223=\"\",\"\",Schema!L223)","v":""},{"$f":"IF(Schema!N223=\"\",\"\",Schema!N223)","v":"O"}]
[{"$f":"Schema!A224&Schema!B224&Schema!C224&Schema!D224","v":"PRCTEKC"},"DZ",{"$f":"IF(A218=\"\",\"\",IF(LEN(Schema!A224)=2,1,IF(LEN(Schema!B224)=2,10,IF(LEN(Schema!C224)=2,100,0))))","v":0},10,{"$f":"IF(A218=\"\",\"\",SUM(Tabel2[[#This Row],[I1]:[I2]]))","v":10},{"$error":"#REF!"},"DZ","",{"$error":"#REF!"},{"$f":"IF(C218=\"\",\"\",IF(LEN(Tabel2[[#This Row],[Entiteit of attribuut]])=2,\"\",Tabel2[[#This Row],[Entiteit]]&\"_\"&Tabel2[[#This Row],[Entiteit of attribuut]]))","v":"DZ_PRCTEKC"},{"$f":"IF(Schema!I224=\"\",\"\",Schema!I224)","v":""},{"$f":"IF(Schema!J224=\"\",\"\",Schema!J224)","v":""},{"$f":"IF(Schema!K224=\"\",\"\",Schema!K224)","v":""},{"$f":"IF(Schema!L224=\"\",\"\",Schema!L224)","v":""},{"$f":"IF(Schema!N224=\"\",\"\",Schema!N224)","v":"O"}]
[{"$f":"Schema!A225&Schema!B225&Schema!C225&Schema!D225","v":"RELVRH"},"DZ",{"$f":"IF(A219=\"\",\"\",IF(LEN(Schema!A225)=2,1,IF(LEN(Schema!B225)=2,10,IF(LEN(Schema!C225)=2,100,0))))","v":0},10,{"$f":"IF(A219=\"\",\"\",SUM(Tabel2[[#This Row],[I1]:[I2]]))","v":10},{"$error":"#REF!"},"DZ","",{"$error":"#REF!"},{"$f":"IF(C219=\"\",\"\",IF(LEN(Tabel2[[#This Row],[Entiteit of attribuut]])=2,\"\",Tabel2[[#This Row],[Entiteit]]&\"_\"&Tabel2[[#This Row],[Entiteit of attribuut]]))","v":"DZ_RELVRH"},{"$f":"IF(Schema!I225=\"\",\"\",Schema!I225)","v":""},{"$f":"IF(Schema!J225=\"\",\"\",Schema!J225)","v":""},{"$f":"IF(Schema!K225=\"\",\"\",Schema!K225)","v":""},{"$f":"IF(Schema!L225=\"\",\"\",Schema!L225)","v":""},{"$f":"IF(Schema!N225=\"\",\"\",Schema!N225)","v":"O"}]
[{"$f":"Schema!A226&Schema!B226&Schema!C226&Schema!D226","v":"RELVVNR"},"DZ",{"$f":"IF(A220=\"\",\"\",IF(LEN(Schema!A226)=2,1,IF(LEN(Schema!B226)=2,10,IF(LEN(Schema!C226)=2,100,0))))","v":0},10,{"$f":"IF(A220=\"\",\"\",SUM(Tabel2[[#This Row],[I1]:[I2]]))","v":10},{"$error":"#REF!"},"DZ","",{"$error":"#REF!"},{"$f":"IF(C220=\"\",\"\",IF(LEN(Tabel2[[#This Row],[Entiteit of attribuut]])=2,\"\",Tabel2[[#This Row],[Entiteit]]&\"_\"&Tabel2[[#This Row],[Entiteit of attribuut]]))","v":"DZ_RELVVNR"},{"$f":"IF(Schema!I226=\"\",\"\",Schema!I226)","v":""},{"$f":"IF(Schema!J226=\"\",\"\",Schema!J226)","v":""},{"$f":"IF(Schema!K226=\"\",\"\",Schema!K226)","v":""},{"$f":"IF(Schema!L226=\"\",\"\",Schema!L226)","v":""},{"$f":"IF(Schema!N226=\"\",\"\",Schema!N226)","v":"O"}]
[{"$f":"Schema!A227&Schema!B227&Schema!C227&Schema!D227","v":"RJRCOR"},"DZ",{"$f":"IF(A221=\"\",\"\",IF(LEN(Schema!A227)=2,1,IF(LEN(Schema!B227)=2,10,IF(LEN(Schema!C227)=2,100,0))))","v":0},10,{"$f":"IF(A221=\"\",\"\",SUM(Tabel2[[#This Row],[I1]:[I2]]))","v":10},{"$error":"#REF!"},"DZ","",{"$error":"#REF!"},{"$f":"IF(C221=\"\",\"\",IF(LEN(Tabel2[[#This Row],[Entiteit of attribuut]])=2,\"\",Tabel2[[#This Row],[Entiteit]]&\"_\"&Tabel2[[#This Row],[Entiteit of attribuut]]))","v":"DZ_RJRCOR"},{"$f":"IF(Schema!I227=\"\",\"\",Schema!I227)","v":""},{"$f":"IF(Schema!J227=\"\",\"\",Schema!J227)","v":""},{"$f":"IF(Schema!K227=\"\",\"\",Schema!K227)","v":""},{"$f":"IF(Schema!L227=\"\",\"\",Schema!L227)","v":""},{"$f":"IF(Schema!N227=\"\",\"\",Schema!N227)","v":"O"}]
[{"$f":"Schema!A228&Schema!B228&Schema!C228&Schema!D228","v":"TCORBDR"},"DZ",{"$f":"IF(A222=\"\",\"\",IF(LEN(Schema!A228)=2,1,IF(LEN(Schema!B228)=2,10,IF(LEN(Schema!C228)=2,100,0))))","v":0},10,{"$f":"IF(A222=\"\",\"\",SUM(Tabel2[[#This Row],[I1]:[I2]]))","v":10},{"$error":"#REF!"},"DZ","",{"$error":"#REF!"},{"$f":"IF(C222=\"\",\"\",IF(LEN(Tabel2[[#This Row],[Entiteit of attribuut]])=2,\"\",Tabel2[[#This Row],[Entiteit]]&\"_\"&Tabel2[[#This Row],[Entiteit of attribuut]]))","v":"DZ_TCORBDR"},{"$f":"IF(Schema!I228=\"\",\"\",Schema!I228)","v":""},{"$f":"IF(Schema!J228=\"\",\"\",Schema!J228)","v":""},{"$f":"IF(Schema!K228=\"\",\"\",Schema!K228)","v":""},{"$f":"IF(Schema!L228=\"\",\"\",Schema!L228)","v":""},{"$f":"IF(Schema!N228=\"\",\"\",Schema!N228)","v":"O"}]
[{"$f":"Schema!A229&Schema!B229&Schema!C229&Schema!D229","v":"VERZSOM"},"DZ",{"$f":"IF(A223=\"\",\"\",IF(LEN(Schema!A229)=2,1,IF(LEN(Schema!B229)=2,10,IF(LEN(Schema!C229)=2,100,0))))","v":0},10,{"$f":"IF(A223=\"\",\"\",SUM(Tabel2[[#This Row],[I1]:[I2]]))","v":10},{"$error":"#REF!"},"DZ","",{"$error":"#REF!"},{"$f":"IF(C223=\"\",\"\",IF(LEN(Tabel2[[#This Row],[Entiteit of attribuut]])=2,\"\",Tabel2[[#This Row],[Entiteit]]&\"_\"&Tabel2[[#This Row],[Entiteit of attribuut]]))","v":"DZ_VERZSOM"},{"$f":"IF(Schema!I229=\"\",\"\",Schema!I229)","v":""},{"$f":"IF(Schema!J229=\"\",\"\",Schema!J229)","v":""},{"$f":"IF(Schema!K229=\"\",\"\",Schema!K229)","v":""},{"$f":"IF(Schema!L229=\"\",\"\",Schema!L229)","v":""},{"$f":"IF(Schema!N229=\"\",\"\",Schema!N229)","v":"O"}]
[{"$f":"Schema!A230&Schema!B230&Schema!C230&Schema!D230","v":"VGBRA"},"DZ",{"$f":"IF(A224=\"\",\"\",IF(LEN(Schema!A230)=2,1,IF(LEN(Schema!B230)=2,10,IF(LEN(Schema!C230)=2,100,0))))","v":0},10,{"$f":"IF(A224=\"\",\"\",SUM(Tabel2[[#This Row],[I1]:[I2]]))","v":10},{"$error":"#REF!"},"DZ","",{"$error":"#REF!"},{"$f":"IF(C224=\"\",\"\",IF(LEN(Tabel2[[#This Row],[Entiteit of attribuut]])=2,\"\",Tabel2[[#This Row],[Entiteit]]&\"_\"&Tabel2[[#This Row],[Entiteit of attribuut]]))","v":"DZ_VGBRA"},{"$f":"IF(Schema!I230=\"\",\"\",Schema!I230)","v":""},{"$f":"IF(Schema!J230=\"\",\"\",Schema!J230)","v":""},{"$f":"IF(Schema!K230=\"\",\"\",Schema!K230)","v":""},{"$f":"IF(Schema!L230=\"\",\"\",Schema!L230)","v":""},{"$f":"IF(Schema!N230=\"\",\"\",Schema!N230)","v":"O"}]
[{"$f":"Schema!A231&Schema!B231&Schema!C231&Schema!D231","v":"VOLGNUM"},"DZ",{"$f":"IF(A225=\"\",\"\",IF(LEN(Schema!A231)=2,1,IF(LEN(Schema!B231)=2,10,IF(LEN(Schema!C231)=2,100,0))))","v":0},10,{"$f":"IF(A225=\"\",\"\",SUM(Tabel2[[#This Row],[I1]:[I2]]))","v":10},{"$error":"#REF!"},"DZ","",{"$error":"#REF!"},{"$f":"IF(C225=\"\",\"\",IF(LEN(Tabel2[[#This Row],[Entiteit of attribuut]])=2,\"\",Tabel2[[#This Row],[Entiteit]]&\"_\"&Tabel2[[#This Row],[Entiteit of attribuut]]))","v":"DZ_VOLGNUM"},{"$f":"IF(Schema!I231=\"\",\"\",Schema!I231)","v":""},{"$f":"IF(Schema!J231=\"\",\"\",Schema!J231)","v":""},{"$f":"IF(Schema!K231=\"\",\"\",Schema!K231)","v":""},{"$f":"IF(Schema!L231=\"\",\"\",Schema!L231)","v":""},{"$f":"IF(Schema!N231=\"\",\"\",Schema!N231)","v":"LEEG"}]
[{"$f":"Schema!A232&Schema!B232&Schema!C232&Schema!D232","v":"VRWRKCD"},"DZ",{"$f":"IF(A226=\"\",\"\",IF(LEN(Schema!A232)=2,1,IF(LEN(Schema!B232)=2,10,IF(LEN(Schema!C232)=2,100,0))))","v":0},10,{"$f":"IF(A226=\"\",\"\",SUM(Tabel2[[#This Row],[I1]:[I2]]))","v":10},{"$error":"#REF!"},"DZ","",{"$error":"#REF!"},{"$f":"IF(C226=\"\",\"\",IF(LEN(Tabel2[[#This Row],[Entiteit of attribuut]])=2,\"\",Tabel2[[#This Row],[Entiteit]]&\"_\"&Tabel2[[#This Row],[Entiteit of attribuut]]))","v":"DZ_VRWRKCD"},{"$f":"IF(Schema!I232=\"\",\"\",Schema!I232)","v":""},{"$f":"IF(Schema!J232=\"\",\"\",Schema!J232)","v":""},{"$f":"IF(Schema!K232=\"\",\"\",Schema!K232)","v":""},{"$f":"IF(Schema!L232=\"\",\"\",Schema!L232)","v":""},{"$f":"IF(Schema!N232=\"\",\"\",Schema!N232)","v":"LEEG"}]
[{"$f":"Schema!A233&Schema!B233&Schema!C233&Schema!D233","v":"WPREMBP"},"DZ",{"$f":"IF(A227=\"\",\"\",IF(LEN(Schema!A233)=2,1,IF(LEN(Schema!B233)=2,10,IF(LEN(Schema!C233)=2,100,0))))","v":0},10,{"$f":"IF(A227=\"\",\"\",SUM(Tabel2[[#This Row],[I1]:[I2]]))","v":10},{"$error":"#REF!"},"DZ","",{"$error":"#REF!"},{"$f":"IF(C227=\"\",\"\",IF(LEN(Tabel2[[#This Row],[Entiteit of attribuut]])=2,\"\",Tabel2[[#This Row],[Entiteit]]&\"_\"&Tabel2[[#This Row],[Entiteit of attribuut]]))","v":"DZ_WPREMBP"},{"$f":"IF(Schema!I233=\"\",\"\",Schema!I233)","v":""},{"$f":"IF(Schema!J233=\"\",\"\",Schema!J233)","v":""},{"$f":"IF(Schema!K233=\"\",\"\",Schema!K233)","v":""},{"$f":"IF(Schema!L233=\"\",\"\",Schema!L233)","v":""},{"$f":"IF(Schema!N233=\"\",\"\",Schema!N233)","v":"O"}]
[{"$f":"Schema!A234&Schema!B234&Schema!C234&Schema!D234","v":"MP"},"MP",{"$f":"IF(A228=\"\",\"\",IF(LEN(Schema!A234)=2,1,IF(LEN(Schema!B234)=2,10,IF(LEN(Schema!C234)=2,100,0))))","v":100},100,{"$f":"IF(A228=\"\",\"\",SUM(Tabel2[[#This Row],[I1]:[I2]]))","v":200},{"$error":"#REF!"},"DZ","MP",{"$error":"#REF!"},{"$f":"IF(C228=\"\",\"\",IF(LEN(Tabel2[[#This Row],[Entiteit of attribuut]])=2,\"\",Tabel2[[#This Row],[Entiteit]]&\"_\"&Tabel2[[#This Row],[Entiteit of attribuut]]))","v":""},{"$f":"IF(Schema!I234=\"\",\"\",Schema!I234)","v":""},{"$f":"IF(Schema!J234=\"\",\"\",Schema!J234)","v":""},{"$f":"IF(Schema!K234=\"\",\"\",Schema!K234)","v":""},{"$f":"IF(Schema!L234=\"\",\"\",Schema!L234)","v":""},{"$f":"IF(Schema!N234=\"\",\"\",Schema!N234)","v":"O"}]
[{"$f":"Schema!A235&Schema!B235&Schema!C235&Schema!D235","v":"MYAAND"},"MP",{"$f":"IF(A229=\"\",\"\",IF(LEN(Schema!A235)=2,1,IF(LEN(Schema!B235)=2,10,IF(LEN(Schema!C235)=2,100,0))))","v":0},100,{"$f":"IF(A229=\"\",\"\",SUM(Tabel2[[#This Row],[I1]:[I2]]))","v":100},{"$error":"#REF!"},"DZ","MP",{"$error":"#REF!"},{"$f":"IF(C229=\"\",\"\",IF(LEN(Tabel2[[#This Row],[Entiteit of attribuut]])=2,\"\",Tabel2[[#This Row],[Entiteit]]&\"_\"&Tabel2[[#This Row],[Entiteit of attribuut]]))","v":"MP_MYAAND"},{"$f":"IF(Schema!I235=\"\",\"\",Schema!I235)","v":""},{"$f":"IF(Schema!J235=\"\",\"\",Schema!J235)","v":""},{"$f":"IF(Schema!K235=\"\",\"\",Schema!K235)","v":""},{"$f":"IF(Schema!L235=\"\",\"\",Schema!L235)","v":""},{"$f":"IF(Schema!N235=\"\",\"\",Schema!N235)","v":"O"}]
[{"$f":"Schema!A236&Schema!B236&Schema!C236&Schema!D236","v":"PLLEAD"},"MP",{"$f":"IF(A230=\"\",\"\",IF(LEN(Schema!A236)=2,1,IF(LEN(Schema!B236)=2,10,IF(LEN(Schema!C236)=2,100,0))))","v":0},100,{"$f":"IF(A230=\"\",\"\",SUM(Tabel2[[#This Row],[I1]:[I2]]))","v":100},{"$error":"#REF!"},"DZ","MP",{"$error":"#REF!"},{"$f":"IF(C230=\"\",\"\",IF(LEN(Tabel2[[#This Row],[Entiteit of attribuut]])=2,\"\",Tabel2[[#This Row],[Entiteit]]&\"_\"&Tabel2[[#This Row],[Entiteit of attribuut]]))","v":"MP_PLLEAD"},{"$f":"IF(Schema!I236=\"\",\"\",Schema!I236)","v":""},{"$f":"IF(Schema!J236=\"\",\"\",Schema!J236)","v":""},{"$f":"IF(Schema!K236=\"\",\"\",Schema!K236)","v":""},{"$f":"IF(Schema!L236=\"\",\"\",Schema!L236)","v":""},{"$f":"IF(Schema!N236=\"\",\"\",Schema!N236)","v":"O"}]
[{"$f":"Schema!A237&Schema!B237&Schema!C237&Schema!D237","v":"POOLNUM"},"MP",{"$f":"IF(A231=\"\",\"\",IF(LEN(Schema!A237)=2,1,IF(LEN(Schema!B237)=2,10,IF(LEN(Schema!C237)=2,100,0))))","v":0},100,{"$f":"IF(A231=\"\",\"\",SUM(Tabel2[[#This Row],[I1]:[I2]]))","v":100},{"$error":"#REF!"},"DZ","MP",{"$error":"#REF!"},{"$f":"IF(C231=\"\",\"\",IF(LEN(Tabel2[[#This Row],[Entiteit of attribuut]])=2,\"\",Tabel2[[#This Row],[Entiteit]]&\"_\"&Tabel2[[#This Row],[Entiteit of attribuut]]))","v":"MP_POOLNUM"},{"$f":"IF(Schema!I237=\"\",\"\",Schema!I237)","v":""},{"$f":"IF(Schema!J237=\"\",\"\",Schema!J237)","v":""},{"$f":"IF(Schema!K237=\"\",\"\",Schema!K237)","v":""},{"$f":"IF(Schema!L237=\"\",\"\",Schema!L237)","v":""},{"$f":"IF(Schema!N237=\"\",\"\",Schema!N237)","v":"V"}]
[{"$f":"Schema!A238&Schema!B238&Schema!C238&Schema!D238","v":"POOLPRC"},"MP",{"$f":"IF(A232=\"\",\"\",IF(LEN(Schema!A238)=2,1,IF(LEN(Schema!B238)=2,10,IF(LEN(Schema!C238)=2,100,0))))","v":0},100,{"$f":"IF(A232=\"\",\"\",SUM(Tabel2[[#This Row],[I1]:[I2]]))","v":100},{"$error":"#REF!"},"DZ","MP",{"$error":"#REF!"},{"$f":"IF(C232=\"\",\"\",IF(LEN(Tabel2[[#This Row],[Entiteit of attribuut]])=2,\"\",Tabel2[[#This Row],[Entiteit]]&\"_\"&Tabel2[[#This Row],[Entiteit of attribuut]]))","v":"MP_POOLPRC"},{"$f":"IF(Schema!I238=\"\",\"\",Schema!I238)","v":""},{"$f":"IF(Schema!J238=\"\",\"\",Schema!J238)","v":""},{"$f":"IF(Schema!K238=\"\",\"\",Schema!K238)","v":""},{"$f":"IF(Schema!L238=\"\",\"\",Schema!L238)","v":""},{"$f":"IF(Schema!N238=\"\",\"\",Schema!N238)","v":"V"}]
[{"$f":"Schema!A239&Schema!B239&Schema!C239&Schema!D239","v":"EC"},"EC",{"$f":"IF(A233=\"\",\"\",IF(LEN(Schema!A239)=2,1,IF(LEN(Schema!B239)=2,10,IF(LEN(Schema!C239)=2,100,0))))","v":10},10,{"$f":"IF(A233=\"\",\"\",SUM(Tabel2[[#This Row],[I1]:[I2]]))","v":20},{"$error":"#REF!"},"EC","",{"$error":"#REF!"},{"$f":"IF(C233=\"\",\"\",IF(LEN(Tabel2[[#This Row],[Entiteit of attribuut]])=2,\"\",Tabel2[[#This Row],[Entiteit]]&\"_\"&Tabel2[[#This Row],[Entiteit of attribuut]]))","v":""},{"$f":"IF(Schema!I239=\"\",\"\",Schema!I239)","v":""},{"$f":"IF(Schema!J239=\"\",\"\",Schema!J239)","v":""},{"$f":"IF(Schema!K239=\"\",\"\",Schema!K239)","v":""},{"$f":"IF(Schema!L239=\"\",\"\",Schema!L239)","v":""},{"$f":"IF(Schema!N239=\"\",\"\",Schema!N239)","v":"O"}]
[{"$f":"Schema!A240&Schema!B240&Schema!C240&Schema!D240","v":"BAFWST"},"EC",{"$f":"IF(A234=\"\",\"\",IF(LEN(Schema!A240)=2,1,IF(LEN(Schema!B240)=2,10,IF(LEN(Schema!C240)=2,100,0))))","v":0},10,{"$f":"IF(A234=\"\",\"\",SUM(Tabel2[[#This Row],[I1]:[I2]]))","v":10},{"$error":"#REF!"},"EC","",{"$error":"#REF!"},{"$f":"IF(C234=\"\",\"\",IF(LEN(Tabel2[[#This Row],[Entiteit of attribuut]])=2,\"\",Tabel2[[#This Row],[Entiteit]]&\"_\"&Tabel2[[#This Row],[Entiteit of attribuut]]))","v":"EC_BAFWST"},{"$f":"IF(Schema!I240=\"\",\"\",Schema!I240)","v":""},{"$f":"IF(Schema!J240=\"\",\"\",Schema!J240)","v":""},{"$f":"IF(Schema!K240=\"\",\"\",Schema!K240)","v":""},{"$f":"IF(Schema!L240=\"\",\"\",Schema!L240)","v":""},{"$f":"IF(Schema!N240=\"\",\"\",Schema!N240)","v":"O"}]
[{"$f":"Schema!A241&Schema!B241&Schema!C241&Schema!D241","v":"BTP"},"EC",{"$f":"IF(A235=\"\",\"\",IF(LEN(Schema!A241)=2,1,IF(LEN(Schema!B241)=2,10,IF(LEN(Schema!C241)=2,100,0))))","v":0},10,{"$f":"IF(A235=\"\",\"\",SUM(Tabel2[[#This Row],[I1]:[I2]]))","v":10},{"$error":"#REF!"},"EC","",{"$error":"#REF!"},{"$f":"IF(C235=\"\",\"\",IF(LEN(Tabel2[[#This Row],[Entiteit of attribuut]])=2,\"\",Tabel2[[#This Row],[Entiteit]]&\"_\"&Tabel2[[#This Row],[Entiteit of attribuut]]))","v":"EC_BTP"},{"$f":"IF(Schema!I241=\"\",\"\",Schema!I241)","v":""},{"$f":"IF(Schema!J241=\"\",\"\",Schema!J241)","v":""},{"$f":"IF(Schema!K241=\"\",\"\",Schema!K241)","v":""},{"$f":"IF(Schema!L241=\"\",\"\",Schema!L241)","v":""},{"$f":"IF(Schema!N241=\"\",\"\",Schema!N241)","v":"LEEG"}]
[{"$f":"Schema!A242&Schema!B242&Schema!C242&Schema!D242","v":"CODE"},"EC",{"$f":"IF(A236=\"\",\"\",IF(LEN(Schema!A242)=2,1,IF(LEN(Schema!B242)=2,10,IF(LEN(Schema!C242)=2,100,0))))","v":0},10,{"$f":"IF(A236=\"\",\"\",SUM(Tabel2[[#This Row],[I1]:[I2]]))","v":10},{"$error":"#REF!"},"EC","",{"$error":"#REF!"},{"$f":"IF(C236=\"\",\"\",IF(LEN(Tabel2[[#This Row],[Entiteit of attribuut]])=2,\"\",Tabel2[[#This Row],[Entiteit]]&\"_\"&Tabel2[[#This Row],[Entiteit of attribuut]]))","v":"EC_CODE"},{"$f":"IF(Schema!I242=\"\",\"\",Schema!I242)","v":""},{"$f":"IF(Schema!J242=\"\",\"\",Schema!J242)","v":""},{"$f":"IF(Schema!K242=\"\",\"\",Schema!K242)","v":""},{"$f":"IF(Schema!L242=\"\",\"\",Schema!L242)","v":""},{"$f":"IF(Schema!N242=\"\",\"\",Schema!N242)","v":"O"}]
[{"$f":"Schema!A243&Schema!B243&Schema!C243&Schema!D243","v":"COLFACT"},"EC",{"$f":"IF(A237=\"\",\"\",IF(LEN(Schema!A243)=2,1,IF(LEN(Schema!B243)=2,10,IF(LEN(Schema!C243)=2,100,0))))","v":0},10,{"$f":"IF(A237=\"\",\"\",SUM(Tabel2[[#This Row],[I1]:[I2]]))","v":10},{"$error":"#REF!"},"EC","",{"$error":"#REF!"},{"$f":"IF(C237=\"\",\"\",IF(LEN(Tabel2[[#This Row],[Entiteit of attribuut]])=2,\"\",Tabel2[[#This Row],[Entiteit]]&\"_\"&Tabel2[[#This Row],[Entiteit of attribuut]]))","v":"EC_COLFACT"},{"$f":"IF(Schema!I243=\"\",\"\",Schema!I243)","v":""},{"$f":"IF(Schema!J243=\"\",\"\",Schema!J243)","v":""},{"$f":"IF(Schema!K243=\"\",\"\",Schema!K243)","v":""},{"$f":"IF(Schema!L243=\"\",\"\",Schema!L243)","v":""},{"$f":"IF(Schema!N243=\"\",\"\",Schema!N243)","v":"O"}]
[{"$f":"Schema!A244&Schema!B244&Schema!C244&Schema!D244","v":"ERB"},"EC",{"$f":"IF(A238=\"\",\"\",IF(LEN(Schema!A244)=2,1,IF(LEN(Schema!B244)=2,10,IF(LEN(Schema!C244)=2,100,0))))","v":0},10,{"$f":"IF(A238=\"\",\"\",SUM(Tabel2[[#This Row],[I1]:[I2]]))","v":10},{"$error":"#REF!"},"EC","",{"$error":"#REF!"},{"$f":"IF(C238=\"\",\"\",IF(LEN(Tabel2[[#This Row],[Entiteit of attribuut]])=2,\"\",Tabel2[[#This Row],[Entiteit]]&\"_\"&Tabel2[[#This Row],[Entiteit of attribuut]]))","v":"EC_ERB"},{"$f":"IF(Schema!I244=\"\",\"\",Schema!I244)","v":""},{"$f":"IF(Schema!J244=\"\",\"\",Schema!J244)","v":""},{"$f":"IF(Schema!K244=\"\",\"\",Schema!K244)","v":""},{"$f":"IF(Schema!L244=\"\",\"\",Schema!L244)","v":""},{"$f":"IF(Schema!N244=\"\",\"\",Schema!N244)","v":"O"}]
[{"$f":"Schema!A245&Schema!B245&Schema!C245&Schema!D245","v":"GADEKCD"},"EC",{"$f":"IF(A239=\"\",\"\",IF(LEN(Schema!A245)=2,1,IF(LEN(Schema!B245)=2,10,IF(LEN(Schema!C245)=2,100,0))))","v":0},10,{"$f":"IF(A239=\"\",\"\",SUM(Tabel2[[#This Row],[I1]:[I2]]))","v":10},{"$error":"#REF!"},"EC","",{"$error":"#REF!"},{"$f":"IF(C239=\"\",\"\",IF(LEN(Tabel2[[#This Row],[Entiteit of attribuut]])=2,\"\",Tabel2[[#This Row],[Entiteit]]&\"_\"&Tabel2[[#This Row],[Entiteit of attribuut]]))","v":"EC_GADEKCD"},{"$f":"IF(Schema!I245=\"\",\"\",Schema!I245)","v":""},{"$f":"IF(Schema!J245=\"\",\"\",Schema!J245)","v":""},{"$f":"IF(Schema!K245=\"\",\"\",Schema!K245)","v":""},{"$f":"IF(Schema!L245=\"\",\"\",Schema!L245)","v":""},{"$f":"IF(Schema!N245=\"\",\"\",Schema!N245)","v":"V"}]
[{"$f":"Schema!A246&Schema!B246&Schema!C246&Schema!D246","v":"GADEKCO"},"EC",{"$f":"IF(A240=\"\",\"\",IF(LEN(Schema!A246)=2,1,IF(LEN(Schema!B246)=2,10,IF(LEN(Schema!C246)=2,100,0))))","v":0},10,{"$f":"IF(A240=\"\",\"\",SUM(Tabel2[[#This Row],[I1]:[I2]]))","v":10},{"$error":"#REF!"},"EC","",{"$error":"#REF!"},{"$f":"IF(C240=\"\",\"\",IF(LEN(Tabel2[[#This Row],[Entiteit of attribuut]])=2,\"\",Tabel2[[#This Row],[Entiteit]]&\"_\"&Tabel2[[#This Row],[Entiteit of attribuut]]))","v":"EC_GADEKCO"},{"$f":"IF(Schema!I246=\"\",\"\",Schema!I246)","v":""},{"$f":"IF(Schema!J246=\"\",\"\",Schema!J246)","v":""},{"$f":"IF(Schema!K246=\"\",\"\",Schema!K246)","v":""},{"$f":"IF(Schema!L246=\"\",\"\",Schema!L246)","v":""},{"$f":"IF(Schema!N246=\"\",\"\",Schema!N246)","v":"V"}]
[{"$f":"Schema!A247&Schema!B247&Schema!C247&Schema!D247","v":"MYCODE"},"EC",{"$f":"IF(A241=\"\",\"\",IF(LEN(Schema!A247)=2,1,IF(LEN(Schema!B247)=2,10,IF(LEN(Schema!C247)=2,100,0))))","v":0},10,{"$f":"IF(A241=\"\",\"\",SUM(Tabel2[[#This Row],[I1]:[I2]]))","v":10},{"$error":"#REF!"},"EC","",{"$error":"#REF!"},{"$f":"IF(C241=\"\",\"\",IF(LEN(Tabel2[[#This Row],[Entiteit of attribuut]])=2,\"\",Tabel2[[#This Row],[Entiteit]]&\"_\"&Tabel2[[#This Row],[Entiteit of attribuut]]))","v":"EC_MYCODE"},{"$f":"IF(Schema!I247=\"\",\"\",Schema!I247)","v":""},{"$f":"IF(Schema!J247=\"\",\"\",Schema!J247)","v":""},{"$f":"IF(Schema!K247=\"\",\"\",Schema!K247)","v":""},{"$f":"IF(Schema!L247=\"\",\"\",Schema!L247)","v":""},{"$f":"IF(Schema!N247=\"\",\"\",Schema!N247)","v":"O"}]
[{"$f":"Schema!A248&Schema!B248&Schema!C248&Schema!D248","v":"NJP"},"EC",{"$f":"IF(A242=\"\",\"\",IF(LEN(Schema!A248)=2,1,IF(LEN(Schema!B248)=2,10,IF(LEN(Schema!C248)=2,100,0))))","v":0},10,{"$f":"IF(A242=\"\",\"\",SUM(Tabel2[[#This Row],[I1]:[I2]]))","v":10},{"$error":"#REF!"},"EC","",{"$error":"#REF!"},{"$f":"IF(C242=\"\",\"\",IF(LEN(Tabel2[[#This Row],[Entiteit of attribuut]])=2,\"\",Tabel2[[#This Row],[Entiteit]]&\"_\"&Tabel2[[#This Row],[Entiteit of attribuut]]))","v":"EC_NJP"},{"$f":"IF(Schema!I248=\"\",\"\",Schema!I248)","v":""},{"$f":"IF(Schema!J248=\"\",\"\",Schema!J248)","v":""},{"$f":"IF(Schema!K248=\"\",\"\",Schema!K248)","v":""},{"$f":"IF(Schema!L248=\"\",\"\",Schema!L248)","v":""},{"$f":"IF(Schema!N248=\"\",\"\",Schema!N248)","v":"O"}]
[{"$f":"Schema!A249&Schema!B249&Schema!C249&Schema!D249","v":"PAFWST"},"EC",{"$f":"IF(A243=\"\",\"\",IF(LEN(Schema!A249)=2,1,IF(LEN(Schema!B249)=2,10,IF(LEN(Schema!C249)=2,100,0))))","v":0},10,{"$f":"IF(A243=\"\",\"\",SUM(Tabel2[[#This Row],[I1]:[I2]]))","v":10},{"$error":"#REF!"},"EC","",{"$error":"#REF!"},{"$f":"IF(C243=\"\",\"\",IF(LEN(Tabel2[[#This Row],[Entiteit of attribuut]])=2,\"\",Tabel2[[#This Row],[Entiteit]]&\"_\"&Tabel2[[#This Row],[Entiteit of attribuut]]))","v":"EC_PAFWST"},{"$f":"IF(Schema!I249=\"\",\"\",Schema!I249)","v":""},{"$f":"IF(Schema!J249=\"\",\"\",Schema!J249)","v":""},{"$f":"IF(Schema!K249=\"\",\"\",Schema!K249)","v":""},{"$f":"IF(Schema!L249=\"\",\"\",Schema!L249)","v":""},{"$f":"IF(Schema!N249=\"\",\"\",Schema!N249)","v":"O"}]
[{"$f":"Schema!A250&Schema!B250&Schema!C250&Schema!D250","v":"PPRC"},"EC",{"$f":"IF(A244=\"\",\"\",IF(LEN(Schema!A250)=2,1,IF(LEN(Schema!B250)=2,10,IF(LEN(Schema!C250)=2,100,0))))","v":0},10,{"$f":"IF(A244=\"\",\"\",SUM(Tabel2[[#This Row],[I1]:[I2]]))","v":10},{"$error":"#REF!"},"EC","",{"$error":"#REF!"},{"$f":"IF(C244=\"\",\"\",IF(LEN(Tabel2[[#This Row],[Entiteit of attribuut]])=2,\"\",Tabel2[[#This Row],[Entiteit]]&\"_\"&Tabel2[[#This Row],[Entiteit of attribuut]]))","v":"EC_PPRC"},{"$f":"IF(Schema!I250=\"\",\"\",Schema!I250)","v":""},{"$f":"IF(Schema!J250=\"\",\"\",Schema!J250)","v":""},{"$f":"IF(Schema!K250=\"\",\"\",Schema!K250)","v":""},{"$f":"IF(Schema!L250=\"\",\"\",Schema!L250)","v":""},{"$f":"IF(Schema!N250=\"\",\"\",Schema!N250)","v":"O"}]
[{"$f":"Schema!A251&Schema!B251&Schema!C251&Schema!D251","v":"PRCPKKT"},"EC",{"$f":"IF(A245=\"\",\"\",IF(LEN(Schema!A251)=2,1,IF(LEN(Schema!B251)=2,10,IF(LEN(Schema!C251)=2,100,0))))","v":0},10,{"$f":"IF(A245=\"\",\"\",SUM(Tabel2[[#This Row],[I1]:[I2]]))","v":10},{"$error":"#REF!"},"EC","",{"$error":"#REF!"},{"$f":"IF(C245=\"\",\"\",IF(LEN(Tabel2[[#This Row],[Entiteit of attribuut]])=2,\"\",Tabel2[[#This Row],[Entiteit]]&\"_\"&Tabel2[[#This Row],[Entiteit of attribuut]]))","v":"EC_PRCPKKT"},{"$f":"IF(Schema!I251=\"\",\"\",Schema!I251)","v":""},{"$f":"IF(Schema!J251=\"\",\"\",Schema!J251)","v":""},{"$f":"IF(Schema!K251=\"\",\"\",Schema!K251)","v":""},{"$f":"IF(Schema!L251=\"\",\"\",Schema!L251)","v":""},{"$f":"IF(Schema!N251=\"\",\"\",Schema!N251)","v":"O"}]
[{"$f":"Schema!A252&Schema!B252&Schema!C252&Schema!D252","v":"PRCTEKC"},"EC",{"$f":"IF(A246=\"\",\"\",IF(LEN(Schema!A252)=2,1,IF(LEN(Schema!B252)=2,10,IF(LEN(Schema!C252)=2,100,0))))","v":0},10,{"$f":"IF(A246=\"\",\"\",SUM(Tabel2[[#This Row],[I1]:[I2]]))","v":10},{"$error":"#REF!"},"EC","",{"$error":"#REF!"},{"$f":"IF(C246=\"\",\"\",IF(LEN(Tabel2[[#This Row],[Entiteit of attribuut]])=2,\"\",Tabel2[[#This Row],[Entiteit]]&\"_\"&Tabel2[[#This Row],[Entiteit of attribuut]]))","v":"EC_PRCTEKC"},{"$f":"IF(Schema!I252=\"\",\"\",Schema!I252)","v":""},{"$f":"IF(Schema!J252=\"\",\"\",Schema!J252)","v":""},{"$f":"IF(Schema!K252=\"\",\"\",Schema!K252)","v":""},{"$f":"IF(Schema!L252=\"\",\"\",Schema!L252)","v":""},{"$f":"IF(Schema!N252=\"\",\"\",Schema!N252)","v":"O"}]
[{"$f":"Schema!A253&Schema!B253&Schema!C253&Schema!D253","v":"PRMPROM"},"EC",{"$f":"IF(A247=\"\",\"\",IF(LEN(Schema!A253)=2,1,IF(LEN(Schema!B253)=2,10,IF(LEN(Schema!C253)=2,100,0))))","v":0},10,{"$f":"IF(A247=\"\",\"\",SUM(Tabel2[[#This Row],[I1]:[I2]]))","v":10},{"$error":"#REF!"},"EC","",{"$error":"#REF!"},{"$f":"IF(C247=\"\",\"\",IF(LEN(Tabel2[[#This Row],[Entiteit of attribuut]])=2,\"\",Tabel2[[#This Row],[Entiteit]]&\"_\"&Tabel2[[#This Row],[Entiteit of attribuut]]))","v":"EC_PRMPROM"},{"$f":"IF(Schema!I253=\"\",\"\",Schema!I253)","v":""},{"$f":"IF(Schema!J253=\"\",\"\",Schema!J253)","v":""},{"$f":"IF(Schema!K253=\"\",\"\",Schema!K253)","v":""},{"$f":"IF(Schema!L253=\"\",\"\",Schema!L253)","v":""},{"$f":"IF(Schema!N253=\"\",\"\",Schema!N253)","v":"O"}]
[{"$f":"Schema!A254&Schema!B254&Schema!C254&Schema!D254","v":"RELVRH"},"EC",{"$f":"IF(A248=\"\",\"\",IF(LEN(Schema!A254)=2,1,IF(LEN(Schema!B254)=2,10,IF(LEN(Schema!C254)=2,100,0))))","v":0},10,{"$f":"IF(A248=\"\",\"\",SUM(Tabel2[[#This Row],[I1]:[I2]]))","v":10},{"$error":"#REF!"},"EC","",{"$error":"#REF!"},{"$f":"IF(C248=\"\",\"\",IF(LEN(Tabel2[[#This Row],[Entiteit of attribuut]])=2,\"\",Tabel2[[#This Row],[Entiteit]]&\"_\"&Tabel2[[#This Row],[Entiteit of attribuut]]))","v":"EC_RELVRH"},{"$f":"IF(Schema!I254=\"\",\"\",Schema!I254)","v":""},{"$f":"IF(Schema!J254=\"\",\"\",Schema!J254)","v":""},{"$f":"IF(Schema!K254=\"\",\"\",Schema!K254)","v":""},{"$f":"IF(Schema!L254=\"\",\"\",Schema!L254)","v":""},{"$f":"IF(Schema!N254=\"\",\"\",Schema!N254)","v":"O"}]
[{"$f":"Schema!A255&Schema!B255&Schema!C255&Schema!D255","v":"RELVVNR"},"EC",{"$f":"IF(A249=\"\",\"\",IF(LEN(Schema!A255)=2,1,IF(LEN(Schema!B255)=2,10,IF(LEN(Schema!C255)=2,100,0))))","v":0},10,{"$f":"IF(A249=\"\",\"\",SUM(Tabel2[[#This Row],[I1]:[I2]]))","v":10},{"$error":"#REF!"},"EC","",{"$error":"#REF!"},{"$f":"IF(C249=\"\",\"\",IF(LEN(Tabel2[[#This Row],[Entiteit of attribuut]])=2,\"\",Tabel2[[#This Row],[Entiteit]]&\"_\"&Tabel2[[#This Row],[Entiteit of attribuut]]))","v":"EC_RELVVNR"},{"$f":"IF(Schema!I255=\"\",\"\",Schema!I255)","v":""},{"$f":"IF(Schema!J255=\"\",\"\",Schema!J255)","v":""},{"$f":"IF(Schema!K255=\"\",\"\",Schema!K255)","v":""},{"$f":"IF(Schema!L255=\"\",\"\",Schema!L255)","v":""},{"$f":"IF(Schema!N255=\"\",\"\",Schema!N255)","v":"O"}]
[{"$f":"Schema!A256&Schema!B256&Schema!C256&Schema!D256","v":"RJRCOR"},"EC",{"$f":"IF(A250=\"\",\"\",IF(LEN(Schema!A256)=2,1,IF(LEN(Schema!B256)=2,10,IF(LEN(Schema!C256)=2,100,0))))","v":0},10,{"$f":"IF(A250=\"\",\"\",SUM(Tabel2[[#This Row],[I1]:[I2]]))","v":10},{"$error":"#REF!"},"EC","",{"$error":"#REF!"},{"$f":"IF(C250=\"\",\"\",IF(LEN(Tabel2[[#This Row],[Entiteit of attribuut]])=2,\"\",Tabel2[[#This Row],[Entiteit]]&\"_\"&Tabel2[[#This Row],[Entiteit of attribuut]]))","v":"EC_RJRCOR"},{"$f":"IF(Schema!I256=\"\",\"\",Schema!I256)","v":""},{"$f":"IF(Schema!J256=\"\",\"\",Schema!J256)","v":""},{"$f":"IF(Schema!K256=\"\",\"\",Schema!K256)","v":""},{"$f":"IF(Schema!L256=\"\",\"\",Schema!L256)","v":""},{"$f":"IF(Schema!N256=\"\",\"\",Schema!N256)","v":"O"}]
[{"$f":"Schema!A257&Schema!B257&Schema!C257&Schema!D257","v":"TCORBDR"},"EC",{"$f":"IF(A251=\"\",\"\",IF(LEN(Schema!A257)=2,1,IF(LEN(Schema!B257)=2,10,IF(LEN(Schema!C257)=2,100,0))))","v":0},10,{"$f":"IF(A251=\"\",\"\",SUM(Tabel2[[#This Row],[I1]:[I2]]))","v":10},{"$error":"#REF!"},"EC","",{"$error":"#REF!"},{"$f":"IF(C251=\"\",\"\",IF(LEN(Tabel2[[#This Row],[Entiteit of attribuut]])=2,\"\",Tabel2[[#This Row],[Entiteit]]&\"_\"&Tabel2[[#This Row],[Entiteit of attribuut]]))","v":"EC_TCORBDR"},{"$f":"IF(Schema!I257=\"\",\"\",Schema!I257)","v":""},{"$f":"IF(Schema!J257=\"\",\"\",Schema!J257)","v":""},{"$f":"IF(Schema!K257=\"\",\"\",Schema!K257)","v":""},{"$f":"IF(Schema!L257=\"\",\"\",Schema!L257)","v":""},{"$f":"IF(Schema!N257=\"\",\"\",Schema!N257)","v":"O"}]
[{"$f":"Schema!A258&Schema!B258&Schema!C258&Schema!D258","v":"VERZSOM"},"EC",{"$f":"IF(A252=\"\",\"\",IF(LEN(Schema!A258)=2,1,IF(LEN(Schema!B258)=2,10,IF(LEN(Schema!C258)=2,100,0))))","v":0},10,{"$f":"IF(A252=\"\",\"\",SUM(Tabel2[[#This Row],[I1]:[I2]]))","v":10},{"$error":"#REF!"},"EC","",{"$error":"#REF!"},{"$f":"IF(C252=\"\",\"\",IF(LEN(Tabel2[[#This Row],[Entiteit of attribuut]])=2,\"\",Tabel2[[#This Row],[Entiteit]]&\"_\"&Tabel2[[#This Row],[Entiteit of attribuut]]))","v":"EC_VERZSOM"},{"$f":"IF(Schema!I258=\"\",\"\",Schema!I258)","v":""},{"$f":"IF(Schema!J258=\"\",\"\",Schema!J258)","v":""},{"$f":"IF(Schema!K258=\"\",\"\",Schema!K258)","v":""},{"$f":"IF(Schema!L258=\"\",\"\",Schema!L258)","v":""},{"$f":"IF(Schema!N258=\"\",\"\",Schema!N258)","v":"O"}]
[{"$f":"Schema!A259&Schema!B259&Schema!C259&Schema!D259","v":"VGBRA"},"EC",{"$f":"IF(A253=\"\",\"\",IF(LEN(Schema!A259)=2,1,IF(LEN(Schema!B259)=2,10,IF(LEN(Schema!C259)=2,100,0))))","v":0},10,{"$f":"IF(A253=\"\",\"\",SUM(Tabel2[[#This Row],[I1]:[I2]]))","v":10},{"$error":"#REF!"},"EC","",{"$error":"#REF!"},{"$f":"IF(C253=\"\",\"\",IF(LEN(Tabel2[[#This Row],[Entiteit of attribuut]])=2,\"\",Tabel2[[#This Row],[Entiteit]]&\"_\"&Tabel2[[#This Row],[Entiteit of attribuut]]))","v":"EC_VGBRA"},{"$f":"IF(Schema!I259=\"\",\"\",Schema!I259)","v":""},{"$f":"IF(Schema!J259=\"\",\"\",Schema!J259)","v":""},{"$f":"IF(Schema!K259=\"\",\"\",Schema!K259)","v":""},{"$f":"IF(Schema!L259=\"\",\"\",Schema!L259)","v":""},{"$f":"IF(Schema!N259=\"\",\"\",Schema!N259)","v":"O"}]
[{"$f":"Schema!A260&Schema!B260&Schema!C260&Schema!D260","v":"VOLGNUM"},"EC",{"$f":"IF(A254=\"\",\"\",IF(LEN(Schema!A260)=2,1,IF(LEN(Schema!B260)=2,10,IF(LEN(Schema!C260)=2,100,0))))","v":0},10,{"$f":"IF(A254=\"\",\"\",SUM(Tabel2[[#This Row],[I1]:[I2]]))","v":10},{"$error":"#REF!"},"EC","",{"$error":"#REF!"},{"$f":"IF(C254=\"\",\"\",IF(LEN(Tabel2[[#This Row],[Entiteit of attribuut]])=2,\"\",Tabel2[[#This Row],[Entiteit]]&\"_\"&Tabel2[[#This Row],[Entiteit of attribuut]]))","v":"EC_VOLGNUM"},{"$f":"IF(Schema!I260=\"\",\"\",Schema!I260)","v":""},{"$f":"IF(Schema!J260=\"\",\"\",Schema!J260)","v":""},{"$f":"IF(Schema!K260=\"\",\"\",Schema!K260)","v":""},{"$f":"IF(Schema!L260=\"\",\"\",Schema!L260)","v":""},{"$f":"IF(Schema!N260=\"\",\"\",Schema!N260)","v":"LEEG"}]
[{"$f":"Schema!A261&Schema!B261&Schema!C261&Schema!D261","v":"WPREMBP"},"EC",{"$f":"IF(A255=\"\",\"\",IF(LEN(Schema!A261)=2,1,IF(LEN(Schema!B261)=2,10,IF(LEN(Schema!C261)=2,100,0))))","v":0},10,{"$f":"IF(A255=\"\",\"\",SUM(Tabel2[[#This Row],[I1]:[I2]]))","v":10},{"$error":"#REF!"},"EC","",{"$error":"#REF!"},{"$f":"IF(C255=\"\",\"\",IF(LEN(Tabel2[[#This Row],[Entiteit of attribuut]])=2,\"\",Tabel2[[#This Row],[Entiteit]]&\"_\"&Tabel2[[#This Row],[Entiteit of attribuut]]))","v":"EC_WPREMBP"},{"$f":"IF(Schema!I261=\"\",\"\",Schema!I261)","v":""},{"$f":"IF(Schema!J261=\"\",\"\",Schema!J261)","v":""},{"$f":"IF(Schema!K261=\"\",\"\",Schema!K261)","v":""},{"$f":"IF(Schema!L261=\"\",\"\",Schema!L261)","v":""},{"$f":"IF(Schema!N261=\"\",\"\",Schema!N261)","v":"O"}]
[{"$f":"Schema!A262&Schema!B262&Schema!C262&Schema!D262","v":"MP"},"MP",{"$f":"IF(A256=\"\",\"\",IF(LEN(Schema!A262)=2,1,IF(LEN(Schema!B262)=2,10,IF(LEN(Schema!C262)=2,100,0))))","v":100},100,{"$f":"IF(A256=\"\",\"\",SUM(Tabel2[[#This Row],[I1]:[I2]]))","v":200},{"$error":"#REF!"},"EC","MP",{"$error":"#REF!"},{"$f":"IF(C256=\"\",\"\",IF(LEN(Tabel2[[#This Row],[Entiteit of attribuut]])=2,\"\",Tabel2[[#This Row],[Entiteit]]&\"_\"&Tabel2[[#This Row],[Entiteit of attribuut]]))","v":""},{"$f":"IF(Schema!I262=\"\",\"\",Schema!I262)","v":""},{"$f":"IF(Schema!J262=\"\",\"\",Schema!J262)","v":""},{"$f":"IF(Schema!K262=\"\",\"\",Schema!K262)","v":""},{"$f":"IF(Schema!L262=\"\",\"\",Schema!L262)","v":""},{"$f":"IF(Schema!N262=\"\",\"\",Schema!N262)","v":"O"}]
[{"$f":"Schema!A263&Schema!B263&Schema!C263&Schema!D263","v":"MYAAND"},"MP",{"$f":"IF(A257=\"\",\"\",IF(LEN(Schema!A263)=2,1,IF(LEN(Schema!B263)=2,10,IF(LEN(Schema!C263)=2,100,0))))","v":0},100,{"$f":"IF(A257=\"\",\"\",SUM(Tabel2[[#This Row],[I1]:[I2]]))","v":100},{"$error":"#REF!"},"EC","MP",{"$error":"#REF!"},{"$f":"IF(C257=\"\",\"\",IF(LEN(Tabel2[[#This Row],[Entiteit of attribuut]])=2,\"\",Tabel2[[#This Row],[Entiteit]]&\"_\"&Tabel2[[#This Row],[Entiteit of attribuut]]))","v":"MP_MYAAND"},{"$f":"IF(Schema!I263=\"\",\"\",Schema!I263)","v":""},{"$f":"IF(Schema!J263=\"\",\"\",Schema!J263)","v":""},{"$f":"IF(Schema!K263=\"\",\"\",Schema!K263)","v":""},{"$f":"IF(Schema!L263=\"\",\"\",Schema!L263)","v":""},{"$f":"IF(Schema!N263=\"\",\"\",Schema!N263)","v":"O"}]
[{"$f":"Schema!A264&Schema!B264&Schema!C264&Schema!D264","v":"PLLEAD"},"MP",{"$f":"IF(A258=\"\",\"\",IF(LEN(Schema!A264)=2,1,IF(LEN(Schema!B264)=2,10,IF(LEN(Schema!C264)=2,100,0))))","v":0},100,{"$f":"IF(A258=\"\",\"\",SUM(Tabel2[[#This Row],[I1]:[I2]]))","v":100},{"$error":"#REF!"},"EC","MP",{"$error":"#REF!"},{"$f":"IF(C258=\"\",\"\",IF(LEN(Tabel2[[#This Row],[Entiteit of attribuut]])=2,\"\",Tabel2[[#This Row],[Entiteit]]&\"_\"&Tabel2[[#This Row],[Entiteit of attribuut]]))","v":"MP_PLLEAD"},{"$f":"IF(Schema!I264=\"\",\"\",Schema!I264)","v":""},{"$f":"IF(Schema!J264=\"\",\"\",Schema!J264)","v":""},{"$f":"IF(Schema!K264=\"\",\"\",Schema!K264)","v":""},{"$f":"IF(Schema!L264=\"\",\"\",Schema!L264)","v":""},{"$f":"IF(Schema!N264=\"\",\"\",Schema!N264)","v":"O"}]
[{"$f":"Schema!A265&Schema!B265&Schema!C265&Schema!D265","v":"POOLNUM"},{"$f":"IF(LEN(A259)=2,A259,IF(A259=\"\",\"Leeg\",B258))","v":"MP"},{"$f":"IF(A259=\"\",\"\",IF(LEN(Schema!A265)=2,1,IF(LEN(Schema!B265)=2,10,IF(LEN(Schema!C265)=2,100,0))))","v":0},{"$f":"IF(C259=0,D258,C259)","v":100},{"$f":"IF(A259=\"\",\"\",SUM(Tabel2[[#This Row],[I1]:[I2]]))","v":100},{"$f":"IF(A259=\"\",\"\",IF(C259=1,B259,F258))","v":{"$error":"#REF!"}},{"$f":"IF(C259=10,A259,IF(OR(C259=0,C259=100),G258,\"\"))","v":"EC"},{"$f":"IF(E259=200,B259,IF(C259=0,H258,\"\"))","v":"MP"},{"$f":"IF(C259=\"\",\"\",IF(OR(E259=1,E259=10,E259=100),I258,IF(E259=2,F259,IF(E259=20,F259&\"/\"&G259,IF(E259=200,F259&\"/\"&G259&\"/\"&H259)))))","v":{"$error":"#REF!"}},{"$f":"IF(C259=\"\",\"\",IF(LEN(Tabel2[[#This Row],[Entiteit of attribuut]])=2,\"\",Tabel2[[#This Row],[Entiteit]]&\"_\"&Tabel2[[#This Row],[Entiteit of attribuut]]))","v":"MP_POOLNUM"},{"$f":"IF(Schema!I265=\"\",\"\",Schema!I265)","v":""},{"$f":"IF(Schema!J265=\"\",\"\",Schema!J265)","v":""},{"$f":"IF(Schema!K265=\"\",\"\",Schema!K265)","v":""},{"$f":"IF(Schema!L265=\"\",\"\",Schema!L265)","v":""},{"$f":"IF(Schema!N265=\"\",\"\",Schema!N265)","v":"V"}]
[{"$f":"Schema!A266&Schema!B266&Schema!C266&Schema!D266","v":"POOLPRC"},"MP",{"$f":"IF(A260=\"\",\"\",IF(LEN(Schema!A266)=2,1,IF(LEN(Schema!B266)=2,10,IF(LEN(Schema!C266)=2,100,0))))","v":0},100,{"$f":"IF(A260=\"\",\"\",SUM(Tabel2[[#This Row],[I1]:[I2]]))","v":100},{"$error":"#REF!"},"EC","MP",{"$error":"#REF!"},{"$f":"IF(C260=\"\",\"\",IF(LEN(Tabel2[[#This Row],[Entiteit of attribuut]])=2,\"\",Tabel2[[#This Row],[Entiteit]]&\"_\"&Tabel2[[#This Row],[Entiteit of attribuut]]))","v":"MP_POOLPRC"},{"$f":"IF(Schema!I266=\"\",\"\",Schema!I266)","v":""},{"$f":"IF(Schema!J266=\"\",\"\",Schema!J266)","v":""},{"$f":"IF(Schema!K266=\"\",\"\",Schema!K266)","v":""},{"$f":"IF(Schema!L266=\"\",\"\",Schema!L266)","v":""},{"$f":"IF(Schema!N266=\"\",\"\",Schema!N266)","v":"V"}]
[{"$f":"Schema!A267&Schema!B267&Schema!C267&Schema!D267","v":"GP"},"GP",{"$f":"IF(A261=\"\",\"\",IF(LEN(Schema!A267)=2,1,IF(LEN(Schema!B267)=2,10,IF(LEN(Schema!C267)=2,100,0))))","v":10},10,{"$f":"IF(A261=\"\",\"\",SUM(Tabel2[[#This Row],[I1]:[I2]]))","v":20},{"$error":"#REF!"},"GP","",{"$error":"#REF!"},{"$f":"IF(C261=\"\",\"\",IF(LEN(Tabel2[[#This Row],[Entiteit of attribuut]])=2,\"\",Tabel2[[#This Row],[Entiteit]]&\"_\"&Tabel2[[#This Row],[Entiteit of attribuut]]))","v":""},{"$f":"IF(Schema!I267=\"\",\"\",Schema!I267)","v":""},{"$f":"IF(Schema!J267=\"\",\"\",Schema!J267)","v":""},{"$f":"IF(Schema!K267=\"\",\"\",Schema!K267)","v":""},{"$f":"IF(Schema!L267=\"\",\"\",Schema!L267)","v":""},{"$f":"IF(Schema!N267=\"\",\"\",Schema!N267)","v":"O"}]
[{"$f":"Schema!A268&Schema!B268&Schema!C268&Schema!D268","v":"BAFWST"},"GP",{"$f":"IF(A262=\"\",\"\",IF(LEN(Schema!A268)=2,1,IF(LEN(Schema!B268)=2,10,IF(LEN(Schema!C268)=2,100,0))))","v":0},10,{"$f":"IF(A262=\"\",\"\",SUM(Tabel2[[#This Row],[I1]:[I2]]))","v":10},{"$error":"#REF!"},"GP","",{"$error":"#REF!"},{"$f":"IF(C262=\"\",\"\",IF(LEN(Tabel2[[#This Row],[Entiteit of attribuut]])=2,\"\",Tabel2[[#This Row],[Entiteit]]&\"_\"&Tabel2[[#This Row],[Entiteit of attribuut]]))","v":"GP_BAFWST"},{"$f":"IF(Schema!I268=\"\",\"\",Schema!I268)","v":""},{"$f":"IF(Schema!J268=\"\",\"\",Schema!J268)","v":""},{"$f":"IF(Schema!K268=\"\",\"\",Schema!K268)","v":""},{"$f":"IF(Schema!L268=\"\",\"\",Schema!L268)","v":""},{"$f":"IF(Schema!N268=\"\",\"\",Schema!N268)","v":"O"}]
[{"$f":"Schema!A269&Schema!B269&Schema!C269&Schema!D269","v":"BTP"},"GP",{"$f":"IF(A263=\"\",\"\",IF(LEN(Schema!A269)=2,1,IF(LEN(Schema!B269)=2,10,IF(LEN(Schema!C269)=2,100,0))))","v":0},10,{"$f":"IF(A263=\"\",\"\",SUM(Tabel2[[#This Row],[I1]:[I2]]))","v":10},{"$error":"#REF!"},"GP","",{"$error":"#REF!"},{"$f":"IF(C263=\"\",\"\",IF(LEN(Tabel2[[#This Row],[Entiteit of attribuut]])=2,\"\",Tabel2[[#This Row],[Entiteit]]&\"_\"&Tabel2[[#This Row],[Entiteit of attribuut]]))","v":"GP_BTP"},{"$f":"IF(Schema!I269=\"\",\"\",Schema!I269)","v":""},{"$f":"IF(Schema!J269=\"\",\"\",Schema!J269)","v":""},{"$f":"IF(Schema!K269=\"\",\"\",Schema!K269)","v":""},{"$f":"IF(Schema!L269=\"\",\"\",Schema!L269)","v":""},{"$f":"IF(Schema!N269=\"\",\"\",Schema!N269)","v":"LEEG"}]
[{"$f":"Schema!A270&Schema!B270&Schema!C270&Schema!D270","v":"CODE"},"GP",{"$f":"IF(A264=\"\",\"\",IF(LEN(Schema!A270)=2,1,IF(LEN(Schema!B270)=2,10,IF(LEN(Schema!C270)=2,100,0))))","v":0},10,{"$f":"IF(A264=\"\",\"\",SUM(Tabel2[[#This Row],[I1]:[I2]]))","v":10},{"$error":"#REF!"},"GP","",{"$error":"#REF!"},{"$f":"IF(C264=\"\",\"\",IF(LEN(Tabel2[[#This Row],[Entiteit of attribuut]])=2,\"\",Tabel2[[#This Row],[Entiteit]]&\"_\"&Tabel2[[#This Row],[Entiteit of attribuut]]))","v":"GP_CODE"},{"$f":"IF(Schema!I270=\"\",\"\",Schema!I270)","v":""},{"$f":"IF(Schema!J270=\"\",\"\",Schema!J270)","v":""},{"$f":"IF(Schema!K270=\"\",\"\",Schema!K270)","v":""},{"$f":"IF(Schema!L270=\"\",\"\",Schema!L270)","v":""},{"$f":"IF(Schema!N270=\"\",\"\",Schema!N270)","v":"O"}]
[{"$f":"Schema!A271&Schema!B271&Schema!C271&Schema!D271","v":"COLFACT"},"GP",{"$f":"IF(A265=\"\",\"\",IF(LEN(Schema!A271)=2,1,IF(LEN(Schema!B271)=2,10,IF(LEN(Schema!C271)=2,100,0))))","v":0},10,{"$f":"IF(A265=\"\",\"\",SUM(Tabel2[[#This Row],[I1]:[I2]]))","v":10},{"$error":"#REF!"},"GP","",{"$error":"#REF!"},{"$f":"IF(C265=\"\",\"\",IF(LEN(Tabel2[[#This Row],[Entiteit of attribuut]])=2,\"\",Tabel2[[#This Row],[Entiteit]]&\"_\"&Tabel2[[#This Row],[Entiteit of attribuut]]))","v":"GP_COLFACT"},{"$f":"IF(Schema!I271=\"\",\"\",Schema!I271)","v":""},{"$f":"IF(Schema!J271=\"\",\"\",Schema!J271)","v":""},{"$f":"IF(Schema!K271=\"\",\"\",Schema!K271)","v":""},{"$f":"IF(Schema!L271=\"\",\"\",Schema!L271)","v":""},{"$f":"IF(Schema!N271=\"\",\"\",Schema!N271)","v":"O"}]
[{"$f":"Schema!A272&Schema!B272&Schema!C272&Schema!D272","v":"ERB"},"GP",{"$f":"IF(A266=\"\",\"\",IF(LEN(Schema!A272)=2,1,IF(LEN(Schema!B272)=2,10,IF(LEN(Schema!C272)=2,100,0))))","v":0},10,{"$f":"IF(A266=\"\",\"\",SUM(Tabel2[[#This Row],[I1]:[I2]]))","v":10},{"$error":"#REF!"},"GP","",{"$error":"#REF!"},{"$f":"IF(C266=\"\",\"\",IF(LEN(Tabel2[[#This Row],[Entiteit of attribuut]])=2,\"\",Tabel2[[#This Row],[Entiteit]]&\"_\"&Tabel2[[#This Row],[Entiteit of attribuut]]))","v":"GP_ERB"},{"$f":"IF(Schema!I272=\"\",\"\",Schema!I272)","v":""},{"$f":"IF(Schema!J272=\"\",\"\",Schema!J272)","v":""},{"$f":"IF(Schema!K272=\"\",\"\",Schema!K272)","v":""},{"$f":"IF(Schema!L272=\"\",\"\",Schema!L272)","v":""},{"$f":"IF(Schema!N272=\"\",\"\",Schema!N272)","v":"O"}]
[{"$f":"Schema!A273&Schema!B273&Schema!C273&Schema!D273","v":"GADEKCD"},"GP",{"$f":"IF(A267=\"\",\"\",IF(LEN(Schema!A273)=2,1,IF(LEN(Schema!B273)=2,10,IF(LEN(Schema!C273)=2,100,0))))","v":0},10,{"$f":"IF(A267=\"\",\"\",SUM(Tabel2[[#This Row],[I1]:[I2]]))","v":10},{"$error":"#REF!"},"GP","",{"$error":"#REF!"},{"$f":"IF(C267=\"\",\"\",IF(LEN(Tabel2[[#This Row],[Entiteit of attribuut]])=2,\"\",Tabel2[[#This Row],[Entiteit]]&\"_\"&Tabel2[[#This Row],[Entiteit of attribuut]]))","v":"GP_GADEKCD"},{"$f":"IF(Schema!I273=\"\",\"\",Schema!I273)","v":""},{"$f":"IF(Schema!J273=\"\",\"\",Schema!J273)","v":""},{"$f":"IF(Schema!K273=\"\",\"\",Schema!K273)","v":""},{"$f":"IF(Schema!L273=\"\",\"\",Schema!L273)","v":""},{"$f":"IF(Schema!N273=\"\",\"\",Schema!N273)","v":"V"}]
[{"$f":"Schema!A274&Schema!B274&Schema!C274&Schema!D274","v":"GADEKCO"},"GP",{"$f":"IF(A268=\"\",\"\",IF(LEN(Schema!A274)=2,1,IF(LEN(Schema!B274)=2,10,IF(LEN(Schema!C274)=2,100,0))))","v":0},10,{"$f":"IF(A268=\"\",\"\",SUM(Tabel2[[#This Row],[I1]:[I2]]))","v":10},{"$error":"#REF!"},"GP","",{"$error":"#REF!"},{"$f":"IF(C268=\"\",\"\",IF(LEN(Tabel2[[#This Row],[Entiteit of attribuut]])=2,\"\",Tabel2[[#This Row],[Entiteit]]&\"_\"&Tabel2[[#This Row],[Entiteit of attribuut]]))","v":"GP_GADEKCO"},{"$f":"IF(Schema!I274=\"\",\"\",Schema!I274)","v":""},{"$f":"IF(Schema!J274=\"\",\"\",Schema!J274)","v":""},{"$f":"IF(Schema!K274=\"\",\"\",Schema!K274)","v":""},{"$f":"IF(Schema!L274=\"\",\"\",Schema!L274)","v":""},{"$f":"IF(Schema!N274=\"\",\"\",Schema!N274)","v":"V"}]
[{"$f":"Schema!A275&Schema!B275&Schema!C275&Schema!D275","v":"MYCODE"},"GP",{"$f":"IF(A269=\"\",\"\",IF(LEN(Schema!A275)=2,1,IF(LEN(Schema!B275)=2,10,IF(LEN(Schema!C275)=2,100,0))))","v":0},10,{"$f":"IF(A269=\"\",\"\",SUM(Tabel2[[#This Row],[I1]:[I2]]))","v":10},{"$error":"#REF!"},"GP","",{"$error":"#REF!"},{"$f":"IF(C269=\"\",\"\",IF(LEN(Tabel2[[#This Row],[Entiteit of attribuut]])=2,\"\",Tabel2[[#This Row],[Entiteit]]&\"_\"&Tabel2[[#This Row],[Entiteit of attribuut]]))","v":"GP_MYCODE"},{"$f":"IF(Schema!I275=\"\",\"\",Schema!I275)","v":""},{"$f":"IF(Schema!J275=\"\",\"\",Schema!J275)","v":""},{"$f":"IF(Schema!K275=\"\",\"\",Schema!K275)","v":""},{"$f":"IF(Schema!L275=\"\",\"\",Schema!L275)","v":""},{"$f":"IF(Schema!N275=\"\",\"\",Schema!N275)","v":"O"}]
[{"$f":"Schema!A276&Schema!B276&Schema!C276&Schema!D276","v":"NJP"},"GP",{"$f":"IF(A270=\"\",\"\",IF(LEN(Schema!A276)=2,1,IF(LEN(Schema!B276)=2,10,IF(LEN(Schema!C276)=2,100,0))))","v":0},10,{"$f":"IF(A270=\"\",\"\",SUM(Tabel2[[#This Row],[I1]:[I2]]))","v":10},{"$error":"#REF!"},"GP","",{"$error":"#REF!"},{"$f":"IF(C270=\"\",\"\",IF(LEN(Tabel2[[#This Row],[Entiteit of attribuut]])=2,\"\",Tabel2[[#This Row],[Entiteit]]&\"_\"&Tabel2[[#This Row],[Entiteit of attribuut]]))","v":"GP_NJP"},{"$f":"IF(Schema!I276=\"\",\"\",Schema!I276)","v":""},{"$f":"IF(Schema!J276=\"\",\"\",Schema!J276)","v":""},{"$f":"IF(Schema!K276=\"\",\"\",Schema!K276)","v":""},{"$f":"IF(Schema!L276=\"\",\"\",Schema!L276)","v":""},{"$f":"IF(Schema!N276=\"\",\"\",Schema!N276)","v":"O"}]
[{"$f":"Schema!A277&Schema!B277&Schema!C277&Schema!D277","v":"PAFWST"},"GP",{"$f":"IF(A271=\"\",\"\",IF(LEN(Schema!A277)=2,1,IF(LEN(Schema!B277)=2,10,IF(LEN(Schema!C277)=2,100,0))))","v":0},10,{"$f":"IF(A271=\"\",\"\",SUM(Tabel2[[#This Row],[I1]:[I2]]))","v":10},{"$error":"#REF!"},"GP","",{"$error":"#REF!"},{"$f":"IF(C271=\"\",\"\",IF(LEN(Tabel2[[#This Row],[Entiteit of attribuut]])=2,\"\",Tabel2[[#This Row],[Entiteit]]&\"_\"&Tabel2[[#This Row],[Entiteit of attribuut]]))","v":"GP_PAFWST"},{"$f":"IF(Schema!I277=\"\",\"\",Schema!I277)","v":""},{"$f":"IF(Schema!J277=\"\",\"\",Schema!J277)","v":""},{"$f":"IF(Schema!K277=\"\",\"\",Schema!K277)","v":""},{"$f":"IF(Schema!L277=\"\",\"\",Schema!L277)","v":""},{"$f":"IF(Schema!N277=\"\",\"\",Schema!N277)","v":"O"}]
[{"$f":"Schema!A278&Schema!B278&Schema!C278&Schema!D278","v":"PPRC"},"GP",{"$f":"IF(A272=\"\",\"\",IF(LEN(Schema!A278)=2,1,IF(LEN(Schema!B278)=2,10,IF(LEN(Schema!C278)=2,100,0))))","v":0},10,{"$f":"IF(A272=\"\",\"\",SUM(Tabel2[[#This Row],[I1]:[I2]]))","v":10},{"$error":"#REF!"},"GP","",{"$error":"#REF!"},{"$f":"IF(C272=\"\",\"\",IF(LEN(Tabel2[[#This Row],[Entiteit of attribuut]])=2,\"\",Tabel2[[#This Row],[Entiteit]]&\"_\"&Tabel2[[#This Row],[Entiteit of attribuut]]))","v":"GP_PPRC"},{"$f":"IF(Schema!I278=\"\",\"\",Schema!I278)","v":""},{"$f":"IF(Schema!J278=\"\",\"\",Schema!J278)","v":""},{"$f":"IF(Schema!K278=\"\",\"\",Schema!K278)","v":""},{"$f":"IF(Schema!L278=\"\",\"\",Schema!L278)","v":""},{"$f":"IF(Schema!N278=\"\",\"\",Schema!N278)","v":"O"}]
[{"$f":"Schema!A279&Schema!B279&Schema!C279&Schema!D279","v":"PRCPKKT"},"GP",{"$f":"IF(A273=\"\",\"\",IF(LEN(Schema!A279)=2,1,IF(LEN(Schema!B279)=2,10,IF(LEN(Schema!C279)=2,100,0))))","v":0},10,{"$f":"IF(A273=\"\",\"\",SUM(Tabel2[[#This Row],[I1]:[I2]]))","v":10},{"$error":"#REF!"},"GP","",{"$error":"#REF!"},{"$f":"IF(C273=\"\",\"\",IF(LEN(Tabel2[[#This Row],[Entiteit of attribuut]])=2,\"\",Tabel2[[#This Row],[Entiteit]]&\"_\"&Tabel2[[#This Row],[Entiteit of attribuut]]))","v":"GP_PRCPKKT"},{"$f":"IF(Schema!I279=\"\",\"\",Schema!I279)","v":""},{"$f":"IF(Schema!J279=\"\",\"\",Schema!J279)","v":""},{"$f":"IF(Schema!K279=\"\",\"\",Schema!K279)","v":""},{"$f":"IF(Schema!L279=\"\",\"\",Schema!L279)","v":""},{"$f":"IF(Schema!N279=\"\",\"\",Schema!N279)","v":"O"}]
[{"$f":"Schema!A280&Schema!B280&Schema!C280&Schema!D280","v":"PRCTEKC"},"GP",{"$f":"IF(A274=\"\",\"\",IF(LEN(Schema!A280)=2,1,IF(LEN(Schema!B280)=2,10,IF(LEN(Schema!C280)=2,100,0))))","v":0},10,{"$f":"IF(A274=\"\",\"\",SUM(Tabel2[[#This Row],[I1]:[I2]]))","v":10},{"$error":"#REF!"},"GP","",{"$error":"#REF!"},{"$f":"IF(C274=\"\",\"\",IF(LEN(Tabel2[[#This Row],[Entiteit of attribuut]])=2,\"\",Tabel2[[#This Row],[Entiteit]]&\"_\"&Tabel2[[#This Row],[Entiteit of attribuut]]))","v":"GP_PRCTEKC"},{"$f":"IF(Schema!I280=\"\",\"\",Schema!I280)","v":""},{"$f":"IF(Schema!J280=\"\",\"\",Schema!J280)","v":""},{"$f":"IF(Schema!K280=\"\",\"\",Schema!K280)","v":""},{"$f":"IF(Schema!L280=\"\",\"\",Schema!L280)","v":""},{"$f":"IF(Schema!N280=\"\",\"\",Schema!N280)","v":"O"}]
[{"$f":"Schema!A281&Schema!B281&Schema!C281&Schema!D281","v":"PRMPROM"},"GP",{"$f":"IF(A275=\"\",\"\",IF(LEN(Schema!A281)=2,1,IF(LEN(Schema!B281)=2,10,IF(LEN(Schema!C281)=2,100,0))))","v":0},10,{"$f":"IF(A275=\"\",\"\",SUM(Tabel2[[#This Row],[I1]:[I2]]))","v":10},{"$error":"#REF!"},"GP","",{"$error":"#REF!"},{"$f":"IF(C275=\"\",\"\",IF(LEN(Tabel2[[#This Row],[Entiteit of attribuut]])=2,\"\",Tabel2[[#This Row],[Entiteit]]&\"_\"&Tabel2[[#This Row],[Entiteit of attribuut]]))","v":"GP_PRMPROM"},{"$f":"IF(Schema!I281=\"\",\"\",Schema!I281)","v":""},{"$f":"IF(Schema!J281=\"\",\"\",Schema!J281)","v":""},{"$f":"IF(Schema!K281=\"\",\"\",Schema!K281)","v":""},{"$f":"IF(Schema!L281=\"\",\"\",Schema!L281)","v":""},{"$f":"IF(Schema!N281=\"\",\"\",Schema!N281)","v":"O"}]
[{"$f":"Schema!A282&Schema!B282&Schema!C282&Schema!D282","v":"RELVRH"},"GP",{"$f":"IF(A276=\"\",\"\",IF(LEN(Schema!A282)=2,1,IF(LEN(Schema!B282)=2,10,IF(LEN(Schema!C282)=2,100,0))))","v":0},10,{"$f":"IF(A276=\"\",\"\",SUM(Tabel2[[#This Row],[I1]:[I2]]))","v":10},{"$error":"#REF!"},"GP","",{"$error":"#REF!"},{"$f":"IF(C276=\"\",\"\",IF(LEN(Tabel2[[#This Row],[Entiteit of attribuut]])=2,\"\",Tabel2[[#This Row],[Entiteit]]&\"_\"&Tabel2[[#This Row],[Entiteit of attribuut]]))","v":"GP_RELVRH"},{"$f":"IF(Schema!I282=\"\",\"\",Schema!I282)","v":""},{"$f":"IF(Schema!J282=\"\",\"\",Schema!J282)","v":""},{"$f":"IF(Schema!K282=\"\",\"\",Schema!K282)","v":""},{"$f":"IF(Schema!L282=\"\",\"\",Schema!L282)","v":""},{"$f":"IF(Schema!N282=\"\",\"\",Schema!N282)","v":"O"}]
[{"$f":"Schema!A283&Schema!B283&Schema!C283&Schema!D283","v":"RELVVNR"},"GP",{"$f":"IF(A277=\"\",\"\",IF(LEN(Schema!A283)=2,1,IF(LEN(Schema!B283)=2,10,IF(LEN(Schema!C283)=2,100,0))))","v":0},10,{"$f":"IF(A277=\"\",\"\",SUM(Tabel2[[#This Row],[I1]:[I2]]))","v":10},{"$error":"#REF!"},"GP","",{"$error":"#REF!"},{"$f":"IF(C277=\"\",\"\",IF(LEN(Tabel2[[#This Row],[Entiteit of attribuut]])=2,\"\",Tabel2[[#This Row],[Entiteit]]&\"_\"&Tabel2[[#This Row],[Entiteit of attribuut]]))","v":"GP_RELVVNR"},{"$f":"IF(Schema!I283=\"\",\"\",Schema!I283)","v":""},{"$f":"IF(Schema!J283=\"\",\"\",Schema!J283)","v":""},{"$f":"IF(Schema!K283=\"\",\"\",Schema!K283)","v":""},{"$f":"IF(Schema!L283=\"\",\"\",Schema!L283)","v":""},{"$f":"IF(Schema!N283=\"\",\"\",Schema!N283)","v":"O"}]
[{"$f":"Schema!A284&Schema!B284&Schema!C284&Schema!D284","v":"RJRCOR"},"GP",{"$f":"IF(A278=\"\",\"\",IF(LEN(Schema!A284)=2,1,IF(LEN(Schema!B284)=2,10,IF(LEN(Schema!C284)=2,100,0))))","v":0},10,{"$f":"IF(A278=\"\",\"\",SUM(Tabel2[[#This Row],[I1]:[I2]]))","v":10},{"$error":"#REF!"},"GP","",{"$error":"#REF!"},{"$f":"IF(C278=\"\",\"\",IF(LEN(Tabel2[[#This Row],[Entiteit of attribuut]])=2,\"\",Tabel2[[#This Row],[Entiteit]]&\"_\"&Tabel2[[#This Row],[Entiteit of attribuut]]))","v":"GP_RJRCOR"},{"$f":"IF(Schema!I284=\"\",\"\",Schema!I284)","v":""},{"$f":"IF(Schema!J284=\"\",\"\",Schema!J284)","v":""},{"$f":"IF(Schema!K284=\"\",\"\",Schema!K284)","v":""},{"$f":"IF(Schema!L284=\"\",\"\",Schema!L284)","v":""},{"$f":"IF(Schema!N284=\"\",\"\",Schema!N284)","v":"O"}]
[{"$f":"Schema!A285&Schema!B285&Schema!C285&Schema!D285","v":"TCORBDR"},"GP",{"$f":"IF(A279=\"\",\"\",IF(LEN(Schema!A285)=2,1,IF(LEN(Schema!B285)=2,10,IF(LEN(Schema!C285)=2,100,0))))","v":0},10,{"$f":"IF(A279=\"\",\"\",SUM(Tabel2[[#This Row],[I1]:[I2]]))","v":10},{"$error":"#REF!"},"GP","",{"$error":"#REF!"},{"$f":"IF(C279=\"\",\"\",IF(LEN(Tabel2[[#This Row],[Entiteit of attribuut]])=2,\"\",Tabel2[[#This Row],[Entiteit]]&\"_\"&Tabel2[[#This Row],[Entiteit of attribuut]]))","v":"GP_TCORBDR"},{"$f":"IF(Schema!I285=\"\",\"\",Schema!I285)","v":""},{"$f":"IF(Schema!J285=\"\",\"\",Schema!J285)","v":""},{"$f":"IF(Schema!K285=\"\",\"\",Schema!K285)","v":""},{"$f":"IF(Schema!L285=\"\",\"\",Schema!L285)","v":""},{"$f":"IF(Schema!N285=\"\",\"\",Schema!N285)","v":"O"}]
[{"$f":"Schema!A286&Schema!B286&Schema!C286&Schema!D286","v":"VERZSOM"},"GP",{"$f":"IF(A280=\"\",\"\",IF(LEN(Schema!A286)=2,1,IF(LEN(Schema!B286)=2,10,IF(LEN(Schema!C286)=2,100,0))))","v":0},10,{"$f":"IF(A280=\"\",\"\",SUM(Tabel2[[#This Row],[I1]:[I2]]))","v":10},{"$error":"#REF!"},"GP","",{"$error":"#REF!"},{"$f":"IF(C280=\"\",\"\",IF(LEN(Tabel2[[#This Row],[Entiteit of attribuut]])=2,\"\",Tabel2[[#This Row],[Entiteit]]&\"_\"&Tabel2[[#This Row],[Entiteit of attribuut]]))","v":"GP_VERZSOM"},{"$f":"IF(Schema!I286=\"\",\"\",Schema!I286)","v":""},{"$f":"IF(Schema!J286=\"\",\"\",Schema!J286)","v":""},{"$f":"IF(Schema!K286=\"\",\"\",Schema!K286)","v":""},{"$f":"IF(Schema!L286=\"\",\"\",Schema!L286)","v":""},{"$f":"IF(Schema!N286=\"\",\"\",Schema!N286)","v":"O"}]
[{"$f":"Schema!A287&Schema!B287&Schema!C287&Schema!D287","v":"VGBRA"},"GP",{"$f":"IF(A281=\"\",\"\",IF(LEN(Schema!A287)=2,1,IF(LEN(Schema!B287)=2,10,IF(LEN(Schema!C287)=2,100,0))))","v":0},10,{"$f":"IF(A281=\"\",\"\",SUM(Tabel2[[#This Row],[I1]:[I2]]))","v":10},{"$error":"#REF!"},"GP","",{"$error":"#REF!"},{"$f":"IF(C281=\"\",\"\",IF(LEN(Tabel2[[#This Row],[Entiteit of attribuut]])=2,\"\",Tabel2[[#This Row],[Entiteit]]&\"_\"&Tabel2[[#This Row],[Entiteit of attribuut]]))","v":"GP_VGBRA"},{"$f":"IF(Schema!I287=\"\",\"\",Schema!I287)","v":""},{"$f":"IF(Schema!J287=\"\",\"\",Schema!J287)","v":""},{"$f":"IF(Schema!K287=\"\",\"\",Schema!K287)","v":""},{"$f":"IF(Schema!L287=\"\",\"\",Schema!L287)","v":""},{"$f":"IF(Schema!N287=\"\",\"\",Schema!N287)","v":"O"}]
[{"$f":"Schema!A288&Schema!B288&Schema!C288&Schema!D288","v":"VOLGNUM"},"GP",{"$f":"IF(A282=\"\",\"\",IF(LEN(Schema!A288)=2,1,IF(LEN(Schema!B288)=2,10,IF(LEN(Schema!C288)=2,100,0))))","v":0},10,{"$f":"IF(A282=\"\",\"\",SUM(Tabel2[[#This Row],[I1]:[I2]]))","v":10},{"$error":"#REF!"},"GP","",{"$error":"#REF!"},{"$f":"IF(C282=\"\",\"\",IF(LEN(Tabel2[[#This Row],[Entiteit of attribuut]])=2,\"\",Tabel2[[#This Row],[Entiteit]]&\"_\"&Tabel2[[#This Row],[Entiteit of attribuut]]))","v":"GP_VOLGNUM"},{"$f":"IF(Schema!I288=\"\",\"\",Schema!I288)","v":""},{"$f":"IF(Schema!J288=\"\",\"\",Schema!J288)","v":""},{"$f":"IF(Schema!K288=\"\",\"\",Schema!K288)","v":""},{"$f":"IF(Schema!L288=\"\",\"\",Schema!L288)","v":""},{"$f":"IF(Schema!N288=\"\",\"\",Schema!N288)","v":"LEEG"}]
[{"$f":"Schema!A289&Schema!B289&Schema!C289&Schema!D289","v":"VRWRKCD"},"GP",{"$f":"IF(A283=\"\",\"\",IF(LEN(Schema!A289)=2,1,IF(LEN(Schema!B289)=2,10,IF(LEN(Schema!C289)=2,100,0))))","v":0},10,{"$f":"IF(A283=\"\",\"\",SUM(Tabel2[[#This Row],[I1]:[I2]]))","v":10},{"$error":"#REF!"},"GP","",{"$error":"#REF!"},{"$f":"IF(C283=\"\",\"\",IF(LEN(Tabel2[[#This Row],[Entiteit of attribuut]])=2,\"\",Tabel2[[#This Row],[Entiteit]]&\"_\"&Tabel2[[#This Row],[Entiteit of attribuut]]))","v":"GP_VRWRKCD"},{"$f":"IF(Schema!I289=\"\",\"\",Schema!I289)","v":""},{"$f":"IF(Schema!J289=\"\",\"\",Schema!J289)","v":""},{"$f":"IF(Schema!K289=\"\",\"\",Schema!K289)","v":""},{"$f":"IF(Schema!L289=\"\",\"\",Schema!L289)","v":""},{"$f":"IF(Schema!N289=\"\",\"\",Schema!N289)","v":"LEEG"}]
[{"$f":"Schema!A290&Schema!B290&Schema!C290&Schema!D290","v":"WPREMBP"},"GP",{"$f":"IF(A284=\"\",\"\",IF(LEN(Schema!A290)=2,1,IF(LEN(Schema!B290)=2,10,IF(LEN(Schema!C290)=2,100,0))))","v":0},10,{"$f":"IF(A284=\"\",\"\",SUM(Tabel2[[#This Row],[I1]:[I2]]))","v":10},{"$error":"#REF!"},"GP","",{"$error":"#REF!"},{"$f":"IF(C284=\"\",\"\",IF(LEN(Tabel2[[#This Row],[Entiteit of attribuut]])=2,\"\",Tabel2[[#This Row],[Entiteit]]&\"_\"&Tabel2[[#This Row],[Entiteit of attribuut]]))","v":"GP_WPREMBP"},{"$f":"IF(Schema!I290=\"\",\"\",Schema!I290)","v":""},{"$f":"IF(Schema!J290=\"\",\"\",Schema!J290)","v":""},{"$f":"IF(Schema!K290=\"\",\"\",Schema!K290)","v":""},{"$f":"IF(Schema!L290=\"\",\"\",Schema!L290)","v":""},{"$f":"IF(Schema!N290=\"\",\"\",Schema!N290)","v":"O"}]
[{"$f":"Schema!A291&Schema!B291&Schema!C291&Schema!D291","v":"MP"},"MP",{"$f":"IF(A285=\"\",\"\",IF(LEN(Schema!A291)=2,1,IF(LEN(Schema!B291)=2,10,IF(LEN(Schema!C291)=2,100,0))))","v":100},100,{"$f":"IF(A285=\"\",\"\",SUM(Tabel2[[#This Row],[I1]:[I2]]))","v":200},{"$error":"#REF!"},"GP","MP",{"$error":"#REF!"},{"$f":"IF(C285=\"\",\"\",IF(LEN(Tabel2[[#This Row],[Entiteit of attribuut]])=2,\"\",Tabel2[[#This Row],[Entiteit]]&\"_\"&Tabel2[[#This Row],[Entiteit of attribuut]]))","v":""},{"$f":"IF(Schema!I291=\"\",\"\",Schema!I291)","v":""},{"$f":"IF(Schema!J291=\"\",\"\",Schema!J291)","v":""},{"$f":"IF(Schema!K291=\"\",\"\",Schema!K291)","v":""},{"$f":"IF(Schema!L291=\"\",\"\",Schema!L291)","v":""},{"$f":"IF(Schema!N291=\"\",\"\",Schema!N291)","v":"O"}]
[{"$f":"Schema!A292&Schema!B292&Schema!C292&Schema!D292","v":"MYAAND"},"MP",{"$f":"IF(A286=\"\",\"\",IF(LEN(Schema!A292)=2,1,IF(LEN(Schema!B292)=2,10,IF(LEN(Schema!C292)=2,100,0))))","v":0},100,{"$f":"IF(A286=\"\",\"\",SUM(Tabel2[[#This Row],[I1]:[I2]]))","v":100},{"$error":"#REF!"},"GP","MP",{"$error":"#REF!"},{"$f":"IF(C286=\"\",\"\",IF(LEN(Tabel2[[#This Row],[Entiteit of attribuut]])=2,\"\",Tabel2[[#This Row],[Entiteit]]&\"_\"&Tabel2[[#This Row],[Entiteit of attribuut]]))","v":"MP_MYAAND"},{"$f":"IF(Schema!I292=\"\",\"\",Schema!I292)","v":""},{"$f":"IF(Schema!J292=\"\",\"\",Schema!J292)","v":""},{"$f":"IF(Schema!K292=\"\",\"\",Schema!K292)","v":""},{"$f":"IF(Schema!L292=\"\",\"\",Schema!L292)","v":""},{"$f":"IF(Schema!N292=\"\",\"\",Schema!N292)","v":"O"}]
[{"$f":"Schema!A293&Schema!B293&Schema!C293&Schema!D293","v":"PLLEAD"},"MP",{"$f":"IF(A287=\"\",\"\",IF(LEN(Schema!A293)=2,1,IF(LEN(Schema!B293)=2,10,IF(LEN(Schema!C293)=2,100,0))))","v":0},100,{"$f":"IF(A287=\"\",\"\",SUM(Tabel2[[#This Row],[I1]:[I2]]))","v":100},{"$error":"#REF!"},"GP","MP",{"$error":"#REF!"},{"$f":"IF(C287=\"\",\"\",IF(LEN(Tabel2[[#This Row],[Entiteit of attribuut]])=2,\"\",Tabel2[[#This Row],[Entiteit]]&\"_\"&Tabel2[[#This Row],[Entiteit of attribuut]]))","v":"MP_PLLEAD"},{"$f":"IF(Schema!I293=\"\",\"\",Schema!I293)","v":""},{"$f":"IF(Schema!J293=\"\",\"\",Schema!J293)","v":""},{"$f":"IF(Schema!K293=\"\",\"\",Schema!K293)","v":""},{"$f":"IF(Schema!L293=\"\",\"\",Schema!L293)","v":""},{"$f":"IF(Schema!N293=\"\",\"\",Schema!N293)","v":"O"}]
[{"$f":"Schema!A294&Schema!B294&Schema!C294&Schema!D294","v":"POOLNUM"},"MP",{"$f":"IF(A288=\"\",\"\",IF(LEN(Schema!A294)=2,1,IF(LEN(Schema!B294)=2,10,IF(LEN(Schema!C294)=2,100,0))))","v":0},100,{"$f":"IF(A288=\"\",\"\",SUM(Tabel2[[#This Row],[I1]:[I2]]))","v":100},{"$error":"#REF!"},"GP","MP",{"$error":"#REF!"},{"$f":"IF(C288=\"\",\"\",IF(LEN(Tabel2[[#This Row],[Entiteit of attribuut]])=2,\"\",Tabel2[[#This Row],[Entiteit]]&\"_\"&Tabel2[[#This Row],[Entiteit of attribuut]]))","v":"MP_POOLNUM"},{"$f":"IF(Schema!I294=\"\",\"\",Schema!I294)","v":""},{"$f":"IF(Schema!J294=\"\",\"\",Schema!J294)","v":""},{"$f":"IF(Schema!K294=\"\",\"\",Schema!K294)","v":""},{"$f":"IF(Schema!L294=\"\",\"\",Schema!L294)","v":""},{"$f":"IF(Schema!N294=\"\",\"\",Schema!N294)","v":"V"}]
[{"$f":"Schema!A295&Schema!B295&Schema!C295&Schema!D295","v":"POOLPRC"},"MP",{"$f":"IF(A289=\"\",\"\",IF(LEN(Schema!A295)=2,1,IF(LEN(Schema!B295)=2,10,IF(LEN(Schema!C295)=2,100,0))))","v":0},100,{"$f":"IF(A289=\"\",\"\",SUM(Tabel2[[#This Row],[I1]:[I2]]))","v":100},{"$error":"#REF!"},"GP","MP",{"$error":"#REF!"},{"$f":"IF(C289=\"\",\"\",IF(LEN(Tabel2[[#This Row],[Entiteit of attribuut]])=2,\"\",Tabel2[[#This Row],[Entiteit]]&\"_\"&Tabel2[[#This Row],[Entiteit of attribuut]]))","v":"MP_POOLPRC"},{"$f":"IF(Schema!I295=\"\",\"\",Schema!I295)","v":""},{"$f":"IF(Schema!J295=\"\",\"\",Schema!J295)","v":""},{"$f":"IF(Schema!K295=\"\",\"\",Schema!K295)","v":""},{"$f":"IF(Schema!L295=\"\",\"\",Schema!L295)","v":""},{"$f":"IF(Schema!N295=\"\",\"\",Schema!N295)","v":"V"}]
[{"$f":"Schema!A296&Schema!B296&Schema!C296&Schema!D296","v":"HU"},"HU",{"$f":"IF(A290=\"\",\"\",IF(LEN(Schema!A296)=2,1,IF(LEN(Schema!B296)=2,10,IF(LEN(Schema!C296)=2,100,0))))","v":10},10,{"$f":"IF(A290=\"\",\"\",SUM(Tabel2[[#This Row],[I1]:[I2]]))","v":20},{"$error":"#REF!"},"HU","",{"$error":"#REF!"},{"$f":"IF(C290=\"\",\"\",IF(LEN(Tabel2[[#This Row],[Entiteit of attribuut]])=2,\"\",Tabel2[[#This Row],[Entiteit]]&\"_\"&Tabel2[[#This Row],[Entiteit of attribuut]]))","v":""},{"$f":"IF(Schema!I296=\"\",\"\",Schema!I296)","v":""},{"$f":"IF(Schema!J296=\"\",\"\",Schema!J296)","v":""},{"$f":"IF(Schema!K296=\"\",\"\",Schema!K296)","v":""},{"$f":"IF(Schema!L296=\"\",\"\",Schema!L296)","v":""},{"$f":"IF(Schema!N296=\"\",\"\",Schema!N296)","v":"O"}]
[{"$f":"Schema!A297&Schema!B297&Schema!C297&Schema!D297","v":"BAFWST"},"HU",{"$f":"IF(A291=\"\",\"\",IF(LEN(Schema!A297)=2,1,IF(LEN(Schema!B297)=2,10,IF(LEN(Schema!C297)=2,100,0))))","v":0},10,{"$f":"IF(A291=\"\",\"\",SUM(Tabel2[[#This Row],[I1]:[I2]]))","v":10},{"$error":"#REF!"},"HU","",{"$error":"#REF!"},{"$f":"IF(C291=\"\",\"\",IF(LEN(Tabel2[[#This Row],[Entiteit of attribuut]])=2,\"\",Tabel2[[#This Row],[Entiteit]]&\"_\"&Tabel2[[#This Row],[Entiteit of attribuut]]))","v":"HU_BAFWST"},{"$f":"IF(Schema!I297=\"\",\"\",Schema!I297)","v":""},{"$f":"IF(Schema!J297=\"\",\"\",Schema!J297)","v":""},{"$f":"IF(Schema!K297=\"\",\"\",Schema!K297)","v":""},{"$f":"IF(Schema!L297=\"\",\"\",Schema!L297)","v":""},{"$f":"IF(Schema!N297=\"\",\"\",Schema!N297)","v":"O"}]
[{"$f":"Schema!A298&Schema!B298&Schema!C298&Schema!D298","v":"BTP"},"HU",{"$f":"IF(A292=\"\",\"\",IF(LEN(Schema!A298)=2,1,IF(LEN(Schema!B298)=2,10,IF(LEN(Schema!C298)=2,100,0))))","v":0},10,{"$f":"IF(A292=\"\",\"\",SUM(Tabel2[[#This Row],[I1]:[I2]]))","v":10},{"$error":"#REF!"},"HU","",{"$error":"#REF!"},{"$f":"IF(C292=\"\",\"\",IF(LEN(Tabel2[[#This Row],[Entiteit of attribuut]])=2,\"\",Tabel2[[#This Row],[Entiteit]]&\"_\"&Tabel2[[#This Row],[Entiteit of attribuut]]))","v":"HU_BTP"},{"$f":"IF(Schema!I298=\"\",\"\",Schema!I298)","v":""},{"$f":"IF(Schema!J298=\"\",\"\",Schema!J298)","v":""},{"$f":"IF(Schema!K298=\"\",\"\",Schema!K298)","v":""},{"$f":"IF(Schema!L298=\"\",\"\",Schema!L298)","v":""},{"$f":"IF(Schema!N298=\"\",\"\",Schema!N298)","v":"LEEG"}]
[{"$f":"Schema!A299&Schema!B299&Schema!C299&Schema!D299","v":"CODE"},"HU",{"$f":"IF(A293=\"\",\"\",IF(LEN(Schema!A299)=2,1,IF(LEN(Schema!B299)=2,10,IF(LEN(Schema!C299)=2,100,0))))","v":0},10,{"$f":"IF(A293=\"\",\"\",SUM(Tabel2[[#This Row],[I1]:[I2]]))","v":10},{"$error":"#REF!"},"HU","",{"$error":"#REF!"},{"$f":"IF(C293=\"\",\"\",IF(LEN(Tabel2[[#This Row],[Entiteit of attribuut]])=2,\"\",Tabel2[[#This Row],[Entiteit]]&\"_\"&Tabel2[[#This Row],[Entiteit of attribuut]]))","v":"HU_CODE"},{"$f":"IF(Schema!I299=\"\",\"\",Schema!I299)","v":""},{"$f":"IF(Schema!J299=\"\",\"\",Schema!J299)","v":""},{"$f":"IF(Schema!K299=\"\",\"\",Schema!K299)","v":""},{"$f":"IF(Schema!L299=\"\",\"\",Schema!L299)","v":""},{"$f":"IF(Schema!N299=\"\",\"\",Schema!N299)","v":"O"}]
[{"$f":"Schema!A300&Schema!B300&Schema!C300&Schema!D300","v":"COLFACT"},"HU",{"$f":"IF(A294=\"\",\"\",IF(LEN(Schema!A300)=2,1,IF(LEN(Schema!B300)=2,10,IF(LEN(Schema!C300)=2,100,0))))","v":0},10,{"$f":"IF(A294=\"\",\"\",SUM(Tabel2[[#This Row],[I1]:[I2]]))","v":10},{"$error":"#REF!"},"HU","",{"$error":"#REF!"},{"$f":"IF(C294=\"\",\"\",IF(LEN(Tabel2[[#This Row],[Entiteit of attribuut]])=2,\"\",Tabel2[[#This Row],[Entiteit]]&\"_\"&Tabel2[[#This Row],[Entiteit of attribuut]]))","v":"HU_COLFACT"},{"$f":"IF(Schema!I300=\"\",\"\",Schema!I300)","v":""},{"$f":"IF(Schema!J300=\"\",\"\",Schema!J300)","v":""},{"$f":"IF(Schema!K300=\"\",\"\",Schema!K300)","v":""},{"$f":"IF(Schema!L300=\"\",\"\",Schema!L300)","v":""},{"$f":"IF(Schema!N300=\"\",\"\",Schema!N300)","v":"O"}]
[{"$f":"Schema!A301&Schema!B301&Schema!C301&Schema!D301","v":"ERB"},"HU",{"$f":"IF(A295=\"\",\"\",IF(LEN(Schema!A301)=2,1,IF(LEN(Schema!B301)=2,10,IF(LEN(Schema!C301)=2,100,0))))","v":0},10,{"$f":"IF(A295=\"\",\"\",SUM(Tabel2[[#This Row],[I1]:[I2]]))","v":10},{"$error":"#REF!"},"HU","",{"$error":"#REF!"},{"$f":"IF(C295=\"\",\"\",IF(LEN(Tabel2[[#This Row],[Entiteit of attribuut]])=2,\"\",Tabel2[[#This Row],[Entiteit]]&\"_\"&Tabel2[[#This Row],[Entiteit of attribuut]]))","v":"HU_ERB"},{"$f":"IF(Schema!I301=\"\",\"\",Schema!I301)","v":""},{"$f":"IF(Schema!J301=\"\",\"\",Schema!J301)","v":""},{"$f":"IF(Schema!K301=\"\",\"\",Schema!K301)","v":""},{"$f":"IF(Schema!L301=\"\",\"\",Schema!L301)","v":""},{"$f":"IF(Schema!N301=\"\",\"\",Schema!N301)","v":"O"}]
[{"$f":"Schema!A302&Schema!B302&Schema!C302&Schema!D302","v":"GADEKCD"},"HU",{"$f":"IF(A296=\"\",\"\",IF(LEN(Schema!A302)=2,1,IF(LEN(Schema!B302)=2,10,IF(LEN(Schema!C302)=2,100,0))))","v":0},10,{"$f":"IF(A296=\"\",\"\",SUM(Tabel2[[#This Row],[I1]:[I2]]))","v":10},{"$error":"#REF!"},"HU","",{"$error":"#REF!"},{"$f":"IF(C296=\"\",\"\",IF(LEN(Tabel2[[#This Row],[Entiteit of attribuut]])=2,\"\",Tabel2[[#This Row],[Entiteit]]&\"_\"&Tabel2[[#This Row],[Entiteit of attribuut]]))","v":"HU_GADEKCD"},{"$f":"IF(Schema!I302=\"\",\"\",Schema!I302)","v":""},{"$f":"IF(Schema!J302=\"\",\"\",Schema!J302)","v":""},{"$f":"IF(Schema!K302=\"\",\"\",Schema!K302)","v":""},{"$f":"IF(Schema!L302=\"\",\"\",Schema!L302)","v":""},{"$f":"IF(Schema!N302=\"\",\"\",Schema!N302)","v":"V"}]
[{"$f":"Schema!A303&Schema!B303&Schema!C303&Schema!D303","v":"GADEKCO"},"HU",{"$f":"IF(A297=\"\",\"\",IF(LEN(Schema!A303)=2,1,IF(LEN(Schema!B303)=2,10,IF(LEN(Schema!C303)=2,100,0))))","v":0},10,{"$f":"IF(A297=\"\",\"\",SUM(Tabel2[[#This Row],[I1]:[I2]]))","v":10},{"$error":"#REF!"},"HU","",{"$error":"#REF!"},{"$f":"IF(C297=\"\",\"\",IF(LEN(Tabel2[[#This Row],[Entiteit of attribuut]])=2,\"\",Tabel2[[#This Row],[Entiteit]]&\"_\"&Tabel2[[#This Row],[Entiteit of attribuut]]))","v":"HU_GADEKCO"},{"$f":"IF(Schema!I303=\"\",\"\",Schema!I303)","v":""},{"$f":"IF(Schema!J303=\"\",\"\",Schema!J303)","v":""},{"$f":"IF(Schema!K303=\"\",\"\",Schema!K303)","v":""},{"$f":"IF(Schema!L303=\"\",\"\",Schema!L303)","v":""},{"$f":"IF(Schema!N303=\"\",\"\",Schema!N303)","v":"V"}]
[{"$f":"Schema!A304&Schema!B304&Schema!C304&Schema!D304","v":"MYCODE"},"HU",{"$f":"IF(A298=\"\",\"\",IF(LEN(Schema!A304)=2,1,IF(LEN(Schema!B304)=2,10,IF(LEN(Schema!C304)=2,100,0))))","v":0},10,{"$f":"IF(A298=\"\",\"\",SUM(Tabel2[[#This Row],[I1]:[I2]]))","v":10},{"$error":"#REF!"},"HU","",{"$error":"#REF!"},{"$f":"IF(C298=\"\",\"\",IF(LEN(Tabel2[[#This Row],[Entiteit of attribuut]])=2,\"\",Tabel2[[#This Row],[Entiteit]]&\"_\"&Tabel2[[#This Row],[Entiteit of attribuut]]))","v":"HU_MYCODE"},{"$f":"IF(Schema!I304=\"\",\"\",Schema!I304)","v":""},{"$f":"IF(Schema!J304=\"\",\"\",Schema!J304)","v":""},{"$f":"IF(Schema!K304=\"\",\"\",Schema!K304)","v":""},{"$f":"IF(Schema!L304=\"\",\"\",Schema!L304)","v":""},{"$f":"IF(Schema!N304=\"\",\"\",Schema!N304)","v":"O"}]
[{"$f":"Schema!A305&Schema!B305&Schema!C305&Schema!D305","v":"NJP"},"HU",{"$f":"IF(A299=\"\",\"\",IF(LEN(Schema!A305)=2,1,IF(LEN(Schema!B305)=2,10,IF(LEN(Schema!C305)=2,100,0))))","v":0},10,{"$f":"IF(A299=\"\",\"\",SUM(Tabel2[[#This Row],[I1]:[I2]]))","v":10},{"$error":"#REF!"},"HU","",{"$error":"#REF!"},{"$f":"IF(C299=\"\",\"\",IF(LEN(Tabel2[[#This Row],[Entiteit of attribuut]])=2,\"\",Tabel2[[#This Row],[Entiteit]]&\"_\"&Tabel2[[#This Row],[Entiteit of attribuut]]))","v":"HU_NJP"},{"$f":"IF(Schema!I305=\"\",\"\",Schema!I305)","v":""},{"$f":"IF(Schema!J305=\"\",\"\",Schema!J305)","v":""},{"$f":"IF(Schema!K305=\"\",\"\",Schema!K305)","v":""},{"$f":"IF(Schema!L305=\"\",\"\",Schema!L305)","v":""},{"$f":"IF(Schema!N305=\"\",\"\",Schema!N305)","v":"O"}]
[{"$f":"Schema!A306&Schema!B306&Schema!C306&Schema!D306","v":"PAFWST"},"HU",{"$f":"IF(A300=\"\",\"\",IF(LEN(Schema!A306)=2,1,IF(LEN(Schema!B306)=2,10,IF(LEN(Schema!C306)=2,100,0))))","v":0},10,{"$f":"IF(A300=\"\",\"\",SUM(Tabel2[[#This Row],[I1]:[I2]]))","v":10},{"$error":"#REF!"},"HU","",{"$error":"#REF!"},{"$f":"IF(C300=\"\",\"\",IF(LEN(Tabel2[[#This Row],[Entiteit of attribuut]])=2,\"\",Tabel2[[#This Row],[Entiteit]]&\"_\"&Tabel2[[#This Row],[Entiteit of attribuut]]))","v":"HU_PAFWST"},{"$f":"IF(Schema!I306=\"\",\"\",Schema!I306)","v":""},{"$f":"IF(Schema!J306=\"\",\"\",Schema!J306)","v":""},{"$f":"IF(Schema!K306=\"\",\"\",Schema!K306)","v":""},{"$f":"IF(Schema!L306=\"\",\"\",Schema!L306)","v":""},{"$f":"IF(Schema!N306=\"\",\"\",Schema!N306)","v":"O"}]
[{"$f":"Schema!A307&Schema!B307&Schema!C307&Schema!D307","v":"PPRC"},"HU",{"$f":"IF(A301=\"\",\"\",IF(LEN(Schema!A307)=2,1,IF(LEN(Schema!B307)=2,10,IF(LEN(Schema!C307)=2,100,0))))","v":0},10,{"$f":"IF(A301=\"\",\"\",SUM(Tabel2[[#This Row],[I1]:[I2]]))","v":10},{"$error":"#REF!"},"HU","",{"$error":"#REF!"},{"$f":"IF(C301=\"\",\"\",IF(LEN(Tabel2[[#This Row],[Entiteit of attribuut]])=2,\"\",Tabel2[[#This Row],[Entiteit]]&\"_\"&Tabel2[[#This Row],[Entiteit of attribuut]]))","v":"HU_PPRC"},{"$f":"IF(Schema!I307=\"\",\"\",Schema!I307)","v":""},{"$f":"IF(Schema!J307=\"\",\"\",Schema!J307)","v":""},{"$f":"IF(Schema!K307=\"\",\"\",Schema!K307)","v":""},{"$f":"IF(Schema!L307=\"\",\"\",Schema!L307)","v":""},{"$f":"IF(Schema!N307=\"\",\"\",Schema!N307)","v":"O"}]
[{"$f":"Schema!A308&Schema!B308&Schema!C308&Schema!D308","v":"PRCPKKT"},"HU",{"$f":"IF(A302=\"\",\"\",IF(LEN(Schema!A308)=2,1,IF(LEN(Schema!B308)=2,10,IF(LEN(Schema!C308)=2,100,0))))","v":0},10,{"$f":"IF(A302=\"\",\"\",SUM(Tabel2[[#This Row],[I1]:[I2]]))","v":10},{"$error":"#REF!"},"HU","",{"$error":"#REF!"},{"$f":"IF(C302=\"\",\"\",IF(LEN(Tabel2[[#This Row],[Entiteit of attribuut]])=2,\"\",Tabel2[[#This Row],[Entiteit]]&\"_\"&Tabel2[[#This Row],[Entiteit of attribuut]]))","v":"HU_PRCPKKT"},{"$f":"IF(Schema!I308=\"\",\"\",Schema!I308)","v":""},{"$f":"IF(Schema!J308=\"\",\"\",Schema!J308)","v":""},{"$f":"IF(Schema!K308=\"\",\"\",Schema!K308)","v":""},{"$f":"IF(Schema!L308=\"\",\"\",Schema!L308)","v":""},{"$f":"IF(Schema!N308=\"\",\"\",Schema!N308)","v":"O"}]
[{"$f":"Schema!A309&Schema!B309&Schema!C309&Schema!D309","v":"PRCTEKC"},"HU",{"$f":"IF(A303=\"\",\"\",IF(LEN(Schema!A309)=2,1,IF(LEN(Schema!B309)=2,10,IF(LEN(Schema!C309)=2,100,0))))","v":0},10,{"$f":"IF(A303=\"\",\"\",SUM(Tabel2[[#This Row],[I1]:[I2]]))","v":10},{"$error":"#REF!"},"HU","",{"$error":"#REF!"},{"$f":"IF(C303=\"\",\"\",IF(LEN(Tabel2[[#This Row],[Entiteit of attribuut]])=2,\"\",Tabel2[[#This Row],[Entiteit]]&\"_\"&Tabel2[[#This Row],[Entiteit of attribuut]]))","v":"HU_PRCTEKC"},{"$f":"IF(Schema!I309=\"\",\"\",Schema!I309)","v":""},{"$f":"IF(Schema!J309=\"\",\"\",Schema!J309)","v":""},{"$f":"IF(Schema!K309=\"\",\"\",Schema!K309)","v":""},{"$f":"IF(Schema!L309=\"\",\"\",Schema!L309)","v":""},{"$f":"IF(Schema!N309=\"\",\"\",Schema!N309)","v":"O"}]
[{"$f":"Schema!A310&Schema!B310&Schema!C310&Schema!D310","v":"PRMPROM"},"HU",{"$f":"IF(A304=\"\",\"\",IF(LEN(Schema!A310)=2,1,IF(LEN(Schema!B310)=2,10,IF(LEN(Schema!C310)=2,100,0))))","v":0},10,{"$f":"IF(A304=\"\",\"\",SUM(Tabel2[[#This Row],[I1]:[I2]]))","v":10},{"$error":"#REF!"},"HU","",{"$error":"#REF!"},{"$f":"IF(C304=\"\",\"\",IF(LEN(Tabel2[[#This Row],[Entiteit of attribuut]])=2,\"\",Tabel2[[#This Row],[Entiteit]]&\"_\"&Tabel2[[#This Row],[Entiteit of attribuut]]))","v":"HU_PRMPROM"},{"$f":"IF(Schema!I310=\"\",\"\",Schema!I310)","v":""},{"$f":"IF(Schema!J310=\"\",\"\",Schema!J310)","v":""},{"$f":"IF(Schema!K310=\"\",\"\",Schema!K310)","v":""},{"$f":"IF(Schema!L310=\"\",\"\",Schema!L310)","v":""},{"$f":"IF(Schema!N310=\"\",\"\",Schema!N310)","v":"O"}]
[{"$f":"Schema!A311&Schema!B311&Schema!C311&Schema!D311","v":"RELVRH"},"HU",{"$f":"IF(A305=\"\",\"\",IF(LEN(Schema!A311)=2,1,IF(LEN(Schema!B311)=2,10,IF(LEN(Schema!C311)=2,100,0))))","v":0},10,{"$f":"IF(A305=\"\",\"\",SUM(Tabel2[[#This Row],[I1]:[I2]]))","v":10},{"$error":"#REF!"},"HU","",{"$error":"#REF!"},{"$f":"IF(C305=\"\",\"\",IF(LEN(Tabel2[[#This Row],[Entiteit of attribuut]])=2,\"\",Tabel2[[#This Row],[Entiteit]]&\"_\"&Tabel2[[#This Row],[Entiteit of attribuut]]))","v":"HU_RELVRH"},{"$f":"IF(Schema!I311=\"\",\"\",Schema!I311)","v":""},{"$f":"IF(Schema!J311=\"\",\"\",Schema!J311)","v":""},{"$f":"IF(Schema!K311=\"\",\"\",Schema!K311)","v":""},{"$f":"IF(Schema!L311=\"\",\"\",Schema!L311)","v":""},{"$f":"IF(Schema!N311=\"\",\"\",Schema!N311)","v":"O"}]
[{"$f":"Schema!A312&Schema!B312&Schema!C312&Schema!D312","v":"RELVVNR"},"HU",{"$f":"IF(A306=\"\",\"\",IF(LEN(Schema!A312)=2,1,IF(LEN(Schema!B312)=2,10,IF(LEN(Schema!C312)=2,100,0))))","v":0},10,{"$f":"IF(A306=\"\",\"\",SUM(Tabel2[[#This Row],[I1]:[I2]]))","v":10},{"$error":"#REF!"},"HU","",{"$error":"#REF!"},{"$f":"IF(C306=\"\",\"\",IF(LEN(Tabel2[[#This Row],[Entiteit of attribuut]])=2,\"\",Tabel2[[#This Row],[Entiteit]]&\"_\"&Tabel2[[#This Row],[Entiteit of attribuut]]))","v":"HU_RELVVNR"},{"$f":"IF(Schema!I312=\"\",\"\",Schema!I312)","v":""},{"$f":"IF(Schema!J312=\"\",\"\",Schema!J312)","v":""},{"$f":"IF(Schema!K312=\"\",\"\",Schema!K312)","v":""},{"$f":"IF(Schema!L312=\"\",\"\",Schema!L312)","v":""},{"$f":"IF(Schema!N312=\"\",\"\",Schema!N312)","v":"O"}]
[{"$f":"Schema!A313&Schema!B313&Schema!C313&Schema!D313","v":"RJRCOR"},"HU",{"$f":"IF(A307=\"\",\"\",IF(LEN(Schema!A313)=2,1,IF(LEN(Schema!B313)=2,10,IF(LEN(Schema!C313)=2,100,0))))","v":0},10,{"$f":"IF(A307=\"\",\"\",SUM(Tabel2[[#This Row],[I1]:[I2]]))","v":10},{"$error":"#REF!"},"HU","",{"$error":"#REF!"},{"$f":"IF(C307=\"\",\"\",IF(LEN(Tabel2[[#This Row],[Entiteit of attribuut]])=2,\"\",Tabel2[[#This Row],[Entiteit]]&\"_\"&Tabel2[[#This Row],[Entiteit of attribuut]]))","v":"HU_RJRCOR"},{"$f":"IF(Schema!I313=\"\",\"\",Schema!I313)","v":""},{"$f":"IF(Schema!J313=\"\",\"\",Schema!J313)","v":""},{"$f":"IF(Schema!K313=\"\",\"\",Schema!K313)","v":""},{"$f":"IF(Schema!L313=\"\",\"\",Schema!L313)","v":""},{"$f":"IF(Schema!N313=\"\",\"\",Schema!N313)","v":"O"}]
[{"$f":"Schema!A314&Schema!B314&Schema!C314&Schema!D314","v":"TCORBDR"},"HU",{"$f":"IF(A308=\"\",\"\",IF(LEN(Schema!A314)=2,1,IF(LEN(Schema!B314)=2,10,IF(LEN(Schema!C314)=2,100,0))))","v":0},10,{"$f":"IF(A308=\"\",\"\",SUM(Tabel2[[#This Row],[I1]:[I2]]))","v":10},{"$error":"#REF!"},"HU","",{"$error":"#REF!"},{"$f":"IF(C308=\"\",\"\",IF(LEN(Tabel2[[#This Row],[Entiteit of attribuut]])=2,\"\",Tabel2[[#This Row],[Entiteit]]&\"_\"&Tabel2[[#This Row],[Entiteit of attribuut]]))","v":"HU_TCORBDR"},{"$f":"IF(Schema!I314=\"\",\"\",Schema!I314)","v":""},{"$f":"IF(Schema!J314=\"\",\"\",Schema!J314)","v":""},{"$f":"IF(Schema!K314=\"\",\"\",Schema!K314)","v":""},{"$f":"IF(Schema!L314=\"\",\"\",Schema!L314)","v":""},{"$f":"IF(Schema!N314=\"\",\"\",Schema!N314)","v":"O"}]
[{"$f":"Schema!A315&Schema!B315&Schema!C315&Schema!D315","v":"VERZSOM"},"HU",{"$f":"IF(A309=\"\",\"\",IF(LEN(Schema!A315)=2,1,IF(LEN(Schema!B315)=2,10,IF(LEN(Schema!C315)=2,100,0))))","v":0},10,{"$f":"IF(A309=\"\",\"\",SUM(Tabel2[[#This Row],[I1]:[I2]]))","v":10},{"$error":"#REF!"},"HU","",{"$error":"#REF!"},{"$f":"IF(C309=\"\",\"\",IF(LEN(Tabel2[[#This Row],[Entiteit of attribuut]])=2,\"\",Tabel2[[#This Row],[Entiteit]]&\"_\"&Tabel2[[#This Row],[Entiteit of attribuut]]))","v":"HU_VERZSOM"},{"$f":"IF(Schema!I315=\"\",\"\",Schema!I315)","v":""},{"$f":"IF(Schema!J315=\"\",\"\",Schema!J315)","v":""},{"$f":"IF(Schema!K315=\"\",\"\",Schema!K315)","v":""},{"$f":"IF(Schema!L315=\"\",\"\",Schema!L315)","v":""},{"$f":"IF(Schema!N315=\"\",\"\",Schema!N315)","v":"O"}]
[{"$f":"Schema!A316&Schema!B316&Schema!C316&Schema!D316","v":"VGBRA"},"HU",{"$f":"IF(A310=\"\",\"\",IF(LEN(Schema!A316)=2,1,IF(LEN(Schema!B316)=2,10,IF(LEN(Schema!C316)=2,100,0))))","v":0},10,{"$f":"IF(A310=\"\",\"\",SUM(Tabel2[[#This Row],[I1]:[I2]]))","v":10},{"$error":"#REF!"},"HU","",{"$error":"#REF!"},{"$f":"IF(C310=\"\",\"\",IF(LEN(Tabel2[[#This Row],[Entiteit of attribuut]])=2,\"\",Tabel2[[#This Row],[Entiteit]]&\"_\"&Tabel2[[#This Row],[Entiteit of attribuut]]))","v":"HU_VGBRA"},{"$f":"IF(Schema!I316=\"\",\"\",Schema!I316)","v":""},{"$f":"IF(Schema!J316=\"\",\"\",Schema!J316)","v":""},{"$f":"IF(Schema!K316=\"\",\"\",Schema!K316)","v":""},{"$f":"IF(Schema!L316=\"\",\"\",Schema!L316)","v":""},{"$f":"IF(Schema!N316=\"\",\"\",Schema!N316)","v":"O"}]
[{"$f":"Schema!A317&Schema!B317&Schema!C317&Schema!D317","v":"VOLGNUM"},"HU",{"$f":"IF(A311=\"\",\"\",IF(LEN(Schema!A317)=2,1,IF(LEN(Schema!B317)=2,10,IF(LEN(Schema!C317)=2,100,0))))","v":0},10,{"$f":"IF(A311=\"\",\"\",SUM(Tabel2[[#This Row],[I1]:[I2]]))","v":10},{"$error":"#REF!"},"HU","",{"$error":"#REF!"},{"$f":"IF(C311=\"\",\"\",IF(LEN(Tabel2[[#This Row],[Entiteit of attribuut]])=2,\"\",Tabel2[[#This Row],[Entiteit]]&\"_\"&Tabel2[[#This Row],[Entiteit of attribuut]]))","v":"HU_VOLGNUM"},{"$f":"IF(Schema!I317=\"\",\"\",Schema!I317)","v":""},{"$f":"IF(Schema!J317=\"\",\"\",Schema!J317)","v":""},{"$f":"IF(Schema!K317=\"\",\"\",Schema!K317)","v":""},{"$f":"IF(Schema!L317=\"\",\"\",Schema!L317)","v":""},{"$f":"IF(Schema!N317=\"\",\"\",Schema!N317)","v":"LEEG"}]
[{"$f":"Schema!A318&Schema!B318&Schema!C318&Schema!D318","v":"VRWRKCD"},"HU",{"$f":"IF(A312=\"\",\"\",IF(LEN(Schema!A318)=2,1,IF(LEN(Schema!B318)=2,10,IF(LEN(Schema!C318)=2,100,0))))","v":0},10,{"$f":"IF(A312=\"\",\"\",SUM(Tabel2[[#This Row],[I1]:[I2]]))","v":10},{"$error":"#REF!"},"HU","",{"$error":"#REF!"},{"$f":"IF(C312=\"\",\"\",IF(LEN(Tabel2[[#This Row],[Entiteit of attribuut]])=2,\"\",Tabel2[[#This Row],[Entiteit]]&\"_\"&Tabel2[[#This Row],[Entiteit of attribuut]]))","v":"HU_VRWRKCD"},{"$f":"IF(Schema!I318=\"\",\"\",Schema!I318)","v":""},{"$f":"IF(Schema!J318=\"\",\"\",Schema!J318)","v":""},{"$f":"IF(Schema!K318=\"\",\"\",Schema!K318)","v":""},{"$f":"IF(Schema!L318=\"\",\"\",Schema!L318)","v":""},{"$f":"IF(Schema!N318=\"\",\"\",Schema!N318)","v":"LEEG"}]
[{"$f":"Schema!A319&Schema!B319&Schema!C319&Schema!D319","v":"WPREMBP"},"HU",{"$f":"IF(A313=\"\",\"\",IF(LEN(Schema!A319)=2,1,IF(LEN(Schema!B319)=2,10,IF(LEN(Schema!C319)=2,100,0))))","v":0},10,{"$f":"IF(A313=\"\",\"\",SUM(Tabel2[[#This Row],[I1]:[I2]]))","v":10},{"$error":"#REF!"},"HU","",{"$error":"#REF!"},{"$f":"IF(C313=\"\",\"\",IF(LEN(Tabel2[[#This Row],[Entiteit of attribuut]])=2,\"\",Tabel2[[#This Row],[Entiteit]]&\"_\"&Tabel2[[#This Row],[Entiteit of attribuut]]))","v":"HU_WPREMBP"},{"$f":"IF(Schema!I319=\"\",\"\",Schema!I319)","v":""},{"$f":"IF(Schema!J319=\"\",\"\",Schema!J319)","v":""},{"$f":"IF(Schema!K319=\"\",\"\",Schema!K319)","v":""},{"$f":"IF(Schema!L319=\"\",\"\",Schema!L319)","v":""},{"$f":"IF(Schema!N319=\"\",\"\",Schema!N319)","v":"O"}]
[{"$f":"Schema!A320&Schema!B320&Schema!C320&Schema!D320","v":"MP"},"MP",{"$f":"IF(A314=\"\",\"\",IF(LEN(Schema!A320)=2,1,IF(LEN(Schema!B320)=2,10,IF(LEN(Schema!C320)=2,100,0))))","v":100},100,{"$f":"IF(A314=\"\",\"\",SUM(Tabel2[[#This Row],[I1]:[I2]]))","v":200},{"$error":"#REF!"},"HU","MP",{"$error":"#REF!"},{"$f":"IF(C314=\"\",\"\",IF(LEN(Tabel2[[#This Row],[Entiteit of attribuut]])=2,\"\",Tabel2[[#This Row],[Entiteit]]&\"_\"&Tabel2[[#This Row],[Entiteit of attribuut]]))","v":""},{"$f":"IF(Schema!I320=\"\",\"\",Schema!I320)","v":""},{"$f":"IF(Schema!J320=\"\",\"\",Schema!J320)","v":""},{"$f":"IF(Schema!K320=\"\",\"\",Schema!K320)","v":""},{"$f":"IF(Schema!L320=\"\",\"\",Schema!L320)","v":""},{"$f":"IF(Schema!N320=\"\",\"\",Schema!N320)","v":"O"}]
[{"$f":"Schema!A321&Schema!B321&Schema!C321&Schema!D321","v":"MYAAND"},"MP",{"$f":"IF(A315=\"\",\"\",IF(LEN(Schema!A321)=2,1,IF(LEN(Schema!B321)=2,10,IF(LEN(Schema!C321)=2,100,0))))","v":0},100,{"$f":"IF(A315=\"\",\"\",SUM(Tabel2[[#This Row],[I1]:[I2]]))","v":100},{"$error":"#REF!"},"HU","MP",{"$error":"#REF!"},{"$f":"IF(C315=\"\",\"\",IF(LEN(Tabel2[[#This Row],[Entiteit of attribuut]])=2,\"\",Tabel2[[#This Row],[Entiteit]]&\"_\"&Tabel2[[#This Row],[Entiteit of attribuut]]))","v":"MP_MYAAND"},{"$f":"IF(Schema!I321=\"\",\"\",Schema!I321)","v":""},{"$f":"IF(Schema!J321=\"\",\"\",Schema!J321)","v":""},{"$f":"IF(Schema!K321=\"\",\"\",Schema!K321)","v":""},{"$f":"IF(Schema!L321=\"\",\"\",Schema!L321)","v":""},{"$f":"IF(Schema!N321=\"\",\"\",Schema!N321)","v":"O"}]
[{"$f":"Schema!A322&Schema!B322&Schema!C322&Schema!D322","v":"PLLEAD"},"MP",{"$f":"IF(A316=\"\",\"\",IF(LEN(Schema!A322)=2,1,IF(LEN(Schema!B322)=2,10,IF(LEN(Schema!C322)=2,100,0))))","v":0},100,{"$f":"IF(A316=\"\",\"\",SUM(Tabel2[[#This Row],[I1]:[I2]]))","v":100},{"$error":"#REF!"},"HU","MP",{"$error":"#REF!"},{"$f":"IF(C316=\"\",\"\",IF(LEN(Tabel2[[#This Row],[Entiteit of attribuut]])=2,\"\",Tabel2[[#This Row],[Entiteit]]&\"_\"&Tabel2[[#This Row],[Entiteit of attribuut]]))","v":"MP_PLLEAD"},{"$f":"IF(Schema!I322=\"\",\"\",Schema!I322)","v":""},{"$f":"IF(Schema!J322=\"\",\"\",Schema!J322)","v":""},{"$f":"IF(Schema!K322=\"\",\"\",Schema!K322)","v":""},{"$f":"IF(Schema!L322=\"\",\"\",Schema!L322)","v":""},{"$f":"IF(Schema!N322=\"\",\"\",Schema!N322)","v":"O"}]
[{"$f":"Schema!A323&Schema!B323&Schema!C323&Schema!D323","v":"POOLNUM"},"MP",{"$f":"IF(A317=\"\",\"\",IF(LEN(Schema!A323)=2,1,IF(LEN(Schema!B323)=2,10,IF(LEN(Schema!C323)=2,100,0))))","v":0},100,{"$f":"IF(A317=\"\",\"\",SUM(Tabel2[[#This Row],[I1]:[I2]]))","v":100},{"$error":"#REF!"},"HU","MP",{"$error":"#REF!"},{"$f":"IF(C317=\"\",\"\",IF(LEN(Tabel2[[#This Row],[Entiteit of attribuut]])=2,\"\",Tabel2[[#This Row],[Entiteit]]&\"_\"&Tabel2[[#This Row],[Entiteit of attribuut]]))","v":"MP_POOLNUM"},{"$f":"IF(Schema!I323=\"\",\"\",Schema!I323)","v":""},{"$f":"IF(Schema!J323=\"\",\"\",Schema!J323)","v":""},{"$f":"IF(Schema!K323=\"\",\"\",Schema!K323)","v":""},{"$f":"IF(Schema!L323=\"\",\"\",Schema!L323)","v":""},{"$f":"IF(Schema!N323=\"\",\"\",Schema!N323)","v":"V"}]
[{"$f":"Schema!A324&Schema!B324&Schema!C324&Schema!D324","v":"POOLPRC"},"MP",{"$f":"IF(A318=\"\",\"\",IF(LEN(Schema!A324)=2,1,IF(LEN(Schema!B324)=2,10,IF(LEN(Schema!C324)=2,100,0))))","v":0},100,{"$f":"IF(A318=\"\",\"\",SUM(Tabel2[[#This Row],[I1]:[I2]]))","v":100},{"$error":"#REF!"},"HU","MP",{"$error":"#REF!"},{"$f":"IF(C318=\"\",\"\",IF(LEN(Tabel2[[#This Row],[Entiteit of attribuut]])=2,\"\",Tabel2[[#This Row],[Entiteit]]&\"_\"&Tabel2[[#This Row],[Entiteit of attribuut]]))","v":"MP_POOLPRC"},{"$f":"IF(Schema!I324=\"\",\"\",Schema!I324)","v":""},{"$f":"IF(Schema!J324=\"\",\"\",Schema!J324)","v":""},{"$f":"IF(Schema!K324=\"\",\"\",Schema!K324)","v":""},{"$f":"IF(Schema!L324=\"\",\"\",Schema!L324)","v":""},{"$f":"IF(Schema!N324=\"\",\"\",Schema!N324)","v":"V"}]
[{"$f":"Schema!A325&Schema!B325&Schema!C325&Schema!D325","v":"IP"},"IP",{"$f":"IF(A319=\"\",\"\",IF(LEN(Schema!A325)=2,1,IF(LEN(Schema!B325)=2,10,IF(LEN(Schema!C325)=2,100,0))))","v":10},10,{"$f":"IF(A319=\"\",\"\",SUM(Tabel2[[#This Row],[I1]:[I2]]))","v":20},{"$error":"#REF!"},"IP","",{"$error":"#REF!"},{"$f":"IF(C319=\"\",\"\",IF(LEN(Tabel2[[#This Row],[Entiteit of attribuut]])=2,\"\",Tabel2[[#This Row],[Entiteit]]&\"_\"&Tabel2[[#This Row],[Entiteit of attribuut]]))","v":""},{"$f":"IF(Schema!I325=\"\",\"\",Schema!I325)","v":""},{"$f":"IF(Schema!J325=\"\",\"\",Schema!J325)","v":""},{"$f":"IF(Schema!K325=\"\",\"\",Schema!K325)","v":""},{"$f":"IF(Schema!L325=\"\",\"\",Schema!L325)","v":""},{"$f":"IF(Schema!N325=\"\",\"\",Schema!N325)","v":"O"}]
[{"$f":"Schema!A326&Schema!B326&Schema!C326&Schema!D326","v":"BAFWST"},"IP",{"$f":"IF(A320=\"\",\"\",IF(LEN(Schema!A326)=2,1,IF(LEN(Schema!B326)=2,10,IF(LEN(Schema!C326)=2,100,0))))","v":0},10,{"$f":"IF(A320=\"\",\"\",SUM(Tabel2[[#This Row],[I1]:[I2]]))","v":10},{"$error":"#REF!"},"IP","",{"$error":"#REF!"},{"$f":"IF(C320=\"\",\"\",IF(LEN(Tabel2[[#This Row],[Entiteit of attribuut]])=2,\"\",Tabel2[[#This Row],[Entiteit]]&\"_\"&Tabel2[[#This Row],[Entiteit of attribuut]]))","v":"IP_BAFWST"},{"$f":"IF(Schema!I326=\"\",\"\",Schema!I326)","v":""},{"$f":"IF(Schema!J326=\"\",\"\",Schema!J326)","v":""},{"$f":"IF(Schema!K326=\"\",\"\",Schema!K326)","v":""},{"$f":"IF(Schema!L326=\"\",\"\",Schema!L326)","v":""},{"$f":"IF(Schema!N326=\"\",\"\",Schema!N326)","v":"O"}]
[{"$f":"Schema!A327&Schema!B327&Schema!C327&Schema!D327","v":"BTP"},"IP",{"$f":"IF(A321=\"\",\"\",IF(LEN(Schema!A327)=2,1,IF(LEN(Schema!B327)=2,10,IF(LEN(Schema!C327)=2,100,0))))","v":0},10,{"$f":"IF(A321=\"\",\"\",SUM(Tabel2[[#This Row],[I1]:[I2]]))","v":10},{"$error":"#REF!"},"IP","",{"$error":"#REF!"},{"$f":"IF(C321=\"\",\"\",IF(LEN(Tabel2[[#This Row],[Entiteit of attribuut]])=2,\"\",Tabel2[[#This Row],[Entiteit]]&\"_\"&Tabel2[[#This Row],[Entiteit of attribuut]]))","v":"IP_BTP"},{"$f":"IF(Schema!I327=\"\",\"\",Schema!I327)","v":""},{"$f":"IF(Schema!J327=\"\",\"\",Schema!J327)","v":""},{"$f":"IF(Schema!K327=\"\",\"\",Schema!K327)","v":""},{"$f":"IF(Schema!L327=\"\",\"\",Schema!L327)","v":""},{"$f":"IF(Schema!N327=\"\",\"\",Schema!N327)","v":"LEEG"}]
[{"$f":"Schema!A328&Schema!B328&Schema!C328&Schema!D328","v":"CODE"},"IP",{"$f":"IF(A322=\"\",\"\",IF(LEN(Schema!A328)=2,1,IF(LEN(Schema!B328)=2,10,IF(LEN(Schema!C328)=2,100,0))))","v":0},10,{"$f":"IF(A322=\"\",\"\",SUM(Tabel2[[#This Row],[I1]:[I2]]))","v":10},{"$error":"#REF!"},"IP","",{"$error":"#REF!"},{"$f":"IF(C322=\"\",\"\",IF(LEN(Tabel2[[#This Row],[Entiteit of attribuut]])=2,\"\",Tabel2[[#This Row],[Entiteit]]&\"_\"&Tabel2[[#This Row],[Entiteit of attribuut]]))","v":"IP_CODE"},{"$f":"IF(Schema!I328=\"\",\"\",Schema!I328)","v":""},{"$f":"IF(Schema!J328=\"\",\"\",Schema!J328)","v":""},{"$f":"IF(Schema!K328=\"\",\"\",Schema!K328)","v":""},{"$f":"IF(Schema!L328=\"\",\"\",Schema!L328)","v":""},{"$f":"IF(Schema!N328=\"\",\"\",Schema!N328)","v":"O"}]
[{"$f":"Schema!A329&Schema!B329&Schema!C329&Schema!D329","v":"COLFACT"},{"$f":"IF(LEN(A323)=2,A323,IF(A323=\"\",\"Leeg\",B322))","v":"IP"},{"$f":"IF(A323=\"\",\"\",IF(LEN(Schema!A329)=2,1,IF(LEN(Schema!B329)=2,10,IF(LEN(Schema!C329)=2,100,0))))","v":0},{"$f":"IF(C323=0,D322,C323)","v":10},{"$f":"IF(A323=\"\",\"\",SUM(Tabel2[[#This Row],[I1]:[I2]]))","v":10},{"$f":"IF(A323=\"\",\"\",IF(C323=1,B323,F322))","v":{"$error":"#REF!"}},{"$f":"IF(C323=10,A323,IF(OR(C323=0,C323=100),G322,\"\"))","v":"IP"},{"$f":"IF(E323=200,B323,IF(C323=0,H322,\"\"))","v":""},{"$f":"IF(C323=\"\",\"\",IF(OR(E323=1,E323=10,E323=100),I322,IF(E323=2,F323,IF(E323=20,F323&\"/\"&G323,IF(E323=200,F323&\"/\"&G323&\"/\"&H323)))))","v":{"$error":"#REF!"}},{"$f":"IF(C323=\"\",\"\",IF(LEN(Tabel2[[#This Row],[Entiteit of attribuut]])=2,\"\",Tabel2[[#This Row],[Entiteit]]&\"_\"&Tabel2[[#This Row],[Entiteit of attribuut]]))","v":"IP_COLFACT"},{"$f":"IF(Schema!I329=\"\",\"\",Schema!I329)","v":""},{"$f":"IF(Schema!J329=\"\",\"\",Schema!J329)","v":""},{"$f":"IF(Schema!K329=\"\",\"\",Schema!K329)","v":""},{"$f":"IF(Schema!L329=\"\",\"\",Schema!L329)","v":""},{"$f":"IF(Schema!N329=\"\",\"\",Schema!N329)","v":"O"}]
[{"$f":"Schema!A330&Schema!B330&Schema!C330&Schema!D330","v":"ERB"},"IP",{"$f":"IF(A324=\"\",\"\",IF(LEN(Schema!A330)=2,1,IF(LEN(Schema!B330)=2,10,IF(LEN(Schema!C330)=2,100,0))))","v":0},10,{"$f":"IF(A324=\"\",\"\",SUM(Tabel2[[#This Row],[I1]:[I2]]))","v":10},{"$error":"#REF!"},"IP","",{"$error":"#REF!"},{"$f":"IF(C324=\"\",\"\",IF(LEN(Tabel2[[#This Row],[Entiteit of attribuut]])=2,\"\",Tabel2[[#This Row],[Entiteit]]&\"_\"&Tabel2[[#This Row],[Entiteit of attribuut]]))","v":"IP_ERB"},{"$f":"IF(Schema!I330=\"\",\"\",Schema!I330)","v":""},{"$f":"IF(Schema!J330=\"\",\"\",Schema!J330)","v":""},{"$f":"IF(Schema!K330=\"\",\"\",Schema!K330)","v":""},{"$f":"IF(Schema!L330=\"\",\"\",Schema!L330)","v":""},{"$f":"IF(Schema!N330=\"\",\"\",Schema!N330)","v":"O"}]
[{"$f":"Schema!A331&Schema!B331&Schema!C331&Schema!D331","v":"GADEKCD"},"IP",{"$f":"IF(A325=\"\",\"\",IF(LEN(Schema!A331)=2,1,IF(LEN(Schema!B331)=2,10,IF(LEN(Schema!C331)=2,100,0))))","v":0},10,{"$f":"IF(A325=\"\",\"\",SUM(Tabel2[[#This Row],[I1]:[I2]]))","v":10},{"$error":"#REF!"},"IP","",{"$error":"#REF!"},{"$f":"IF(C325=\"\",\"\",IF(LEN(Tabel2[[#This Row],[Entiteit of attribuut]])=2,\"\",Tabel2[[#This Row],[Entiteit]]&\"_\"&Tabel2[[#This Row],[Entiteit of attribuut]]))","v":"IP_GADEKCD"},{"$f":"IF(Schema!I331=\"\",\"\",Schema!I331)","v":""},{"$f":"IF(Schema!J331=\"\",\"\",Schema!J331)","v":""},{"$f":"IF(Schema!K331=\"\",\"\",Schema!K331)","v":""},{"$f":"IF(Schema!L331=\"\",\"\",Schema!L331)","v":""},{"$f":"IF(Schema!N331=\"\",\"\",Schema!N331)","v":"V"}]
[{"$f":"Schema!A332&Schema!B332&Schema!C332&Schema!D332","v":"GADEKCO"},"IP",{"$f":"IF(A326=\"\",\"\",IF(LEN(Schema!A332)=2,1,IF(LEN(Schema!B332)=2,10,IF(LEN(Schema!C332)=2,100,0))))","v":0},10,{"$f":"IF(A326=\"\",\"\",SUM(Tabel2[[#This Row],[I1]:[I2]]))","v":10},{"$error":"#REF!"},"IP","",{"$error":"#REF!"},{"$f":"IF(C326=\"\",\"\",IF(LEN(Tabel2[[#This Row],[Entiteit of attribuut]])=2,\"\",Tabel2[[#This Row],[Entiteit]]&\"_\"&Tabel2[[#This Row],[Entiteit of attribuut]]))","v":"IP_GADEKCO"},{"$f":"IF(Schema!I332=\"\",\"\",Schema!I332)","v":""},{"$f":"IF(Schema!J332=\"\",\"\",Schema!J332)","v":""},{"$f":"IF(Schema!K332=\"\",\"\",Schema!K332)","v":""},{"$f":"IF(Schema!L332=\"\",\"\",Schema!L332)","v":""},{"$f":"IF(Schema!N332=\"\",\"\",Schema!N332)","v":"V"}]
[{"$f":"Schema!A333&Schema!B333&Schema!C333&Schema!D333","v":"GARINB"},"IP",{"$f":"IF(A327=\"\",\"\",IF(LEN(Schema!A333)=2,1,IF(LEN(Schema!B333)=2,10,IF(LEN(Schema!C333)=2,100,0))))","v":0},10,{"$f":"IF(A327=\"\",\"\",SUM(Tabel2[[#This Row],[I1]:[I2]]))","v":10},{"$error":"#REF!"},"IP","",{"$error":"#REF!"},{"$f":"IF(C327=\"\",\"\",IF(LEN(Tabel2[[#This Row],[Entiteit of attribuut]])=2,\"\",Tabel2[[#This Row],[Entiteit]]&\"_\"&Tabel2[[#This Row],[Entiteit of attribuut]]))","v":"IP_GARINB"},{"$f":"IF(Schema!I333=\"\",\"\",Schema!I333)","v":""},{"$f":"IF(Schema!J333=\"\",\"\",Schema!J333)","v":""},{"$f":"IF(Schema!K333=\"\",\"\",Schema!K333)","v":""},{"$f":"IF(Schema!L333=\"\",\"\",Schema!L333)","v":""},{"$f":"IF(Schema!N333=\"\",\"\",Schema!N333)","v":"LEEG"}]
[{"$f":"Schema!A334&Schema!B334&Schema!C334&Schema!D334","v":"GSS"},"IP",{"$f":"IF(A328=\"\",\"\",IF(LEN(Schema!A334)=2,1,IF(LEN(Schema!B334)=2,10,IF(LEN(Schema!C334)=2,100,0))))","v":0},10,{"$f":"IF(A328=\"\",\"\",SUM(Tabel2[[#This Row],[I1]:[I2]]))","v":10},{"$error":"#REF!"},"IP","",{"$error":"#REF!"},{"$f":"IF(C328=\"\",\"\",IF(LEN(Tabel2[[#This Row],[Entiteit of attribuut]])=2,\"\",Tabel2[[#This Row],[Entiteit]]&\"_\"&Tabel2[[#This Row],[Entiteit of attribuut]]))","v":"IP_GSS"},{"$f":"IF(Schema!I334=\"\",\"\",Schema!I334)","v":""},{"$f":"IF(Schema!J334=\"\",\"\",Schema!J334)","v":""},{"$f":"IF(Schema!K334=\"\",\"\",Schema!K334)","v":""},{"$f":"IF(Schema!L334=\"\",\"\",Schema!L334)","v":""},{"$f":"IF(Schema!N334=\"\",\"\",Schema!N334)","v":"LEEG"}]
[{"$f":"Schema!A335&Schema!B335&Schema!C335&Schema!D335","v":"INBOEDE"},"IP",{"$f":"IF(A329=\"\",\"\",IF(LEN(Schema!A335)=2,1,IF(LEN(Schema!B335)=2,10,IF(LEN(Schema!C335)=2,100,0))))","v":0},10,{"$f":"IF(A329=\"\",\"\",SUM(Tabel2[[#This Row],[I1]:[I2]]))","v":10},{"$error":"#REF!"},"IP","",{"$error":"#REF!"},{"$f":"IF(C329=\"\",\"\",IF(LEN(Tabel2[[#This Row],[Entiteit of attribuut]])=2,\"\",Tabel2[[#This Row],[Entiteit]]&\"_\"&Tabel2[[#This Row],[Entiteit of attribuut]]))","v":"IP_INBOEDE"},{"$f":"IF(Schema!I335=\"\",\"\",Schema!I335)","v":""},{"$f":"IF(Schema!J335=\"\",\"\",Schema!J335)","v":""},{"$f":"IF(Schema!K335=\"\",\"\",Schema!K335)","v":""},{"$f":"IF(Schema!L335=\"\",\"\",Schema!L335)","v":""},{"$f":"IF(Schema!N335=\"\",\"\",Schema!N335)","v":"LEEG"}]
[{"$f":"Schema!A336&Schema!B336&Schema!C336&Schema!D336","v":"MVZVRH"},"IP",{"$f":"IF(A330=\"\",\"\",IF(LEN(Schema!A336)=2,1,IF(LEN(Schema!B336)=2,10,IF(LEN(Schema!C336)=2,100,0))))","v":0},10,{"$f":"IF(A330=\"\",\"\",SUM(Tabel2[[#This Row],[I1]:[I2]]))","v":10},{"$error":"#REF!"},"IP","",{"$error":"#REF!"},{"$f":"IF(C330=\"\",\"\",IF(LEN(Tabel2[[#This Row],[Entiteit of attribuut]])=2,\"\",Tabel2[[#This Row],[Entiteit]]&\"_\"&Tabel2[[#This Row],[Entiteit of attribuut]]))","v":"IP_MVZVRH"},{"$f":"IF(Schema!I336=\"\",\"\",Schema!I336)","v":""},{"$f":"IF(Schema!J336=\"\",\"\",Schema!J336)","v":""},{"$f":"IF(Schema!K336=\"\",\"\",Schema!K336)","v":""},{"$f":"IF(Schema!L336=\"\",\"\",Schema!L336)","v":""},{"$f":"IF(Schema!N336=\"\",\"\",Schema!N336)","v":"LEEG"}]
[{"$f":"Schema!A337&Schema!B337&Schema!C337&Schema!D337","v":"MYCODE"},"IP",{"$f":"IF(A331=\"\",\"\",IF(LEN(Schema!A337)=2,1,IF(LEN(Schema!B337)=2,10,IF(LEN(Schema!C337)=2,100,0))))","v":0},10,{"$f":"IF(A331=\"\",\"\",SUM(Tabel2[[#This Row],[I1]:[I2]]))","v":10},{"$error":"#REF!"},"IP","",{"$error":"#REF!"},{"$f":"IF(C331=\"\",\"\",IF(LEN(Tabel2[[#This Row],[Entiteit of attribuut]])=2,\"\",Tabel2[[#This Row],[Entiteit]]&\"_\"&Tabel2[[#This Row],[Entiteit of attribuut]]))","v":"IP_MYCODE"},{"$f":"IF(Schema!I337=\"\",\"\",Schema!I337)","v":""},{"$f":"IF(Schema!J337=\"\",\"\",Schema!J337)","v":""},{"$f":"IF(Schema!K337=\"\",\"\",Schema!K337)","v":""},{"$f":"IF(Schema!L337=\"\",\"\",Schema!L337)","v":""},{"$f":"IF(Schema!N337=\"\",\"\",Schema!N337)","v":"O"}]
[{"$f":"Schema!A338&Schema!B338&Schema!C338&Schema!D338","v":"NJP"},"IP",{"$f":"IF(A332=\"\",\"\",IF(LEN(Schema!A338)=2,1,IF(LEN(Schema!B338)=2,10,IF(LEN(Schema!C338)=2,100,0))))","v":0},10,{"$f":"IF(A332=\"\",\"\",SUM(Tabel2[[#This Row],[I1]:[I2]]))","v":10},{"$error":"#REF!"},"IP","",{"$error":"#REF!"},{"$f":"IF(C332=\"\",\"\",IF(LEN(Tabel2[[#This Row],[Entiteit of attribuut]])=2,\"\",Tabel2[[#This Row],[Entiteit]]&\"_\"&Tabel2[[#This Row],[Entiteit of attribuut]]))","v":"IP_NJP"},{"$f":"IF(Schema!I338=\"\",\"\",Schema!I338)","v":""},{"$f":"IF(Schema!J338=\"\",\"\",Schema!J338)","v":""},{"$f":"IF(Schema!K338=\"\",\"\",Schema!K338)","v":""},{"$f":"IF(Schema!L338=\"\",\"\",Schema!L338)","v":""},{"$f":"IF(Schema!N338=\"\",\"\",Schema!N338)","v":"O"}]
[{"$f":"Schema!A339&Schema!B339&Schema!C339&Schema!D339","v":"PAFWST"},"IP",{"$f":"IF(A333=\"\",\"\",IF(LEN(Schema!A339)=2,1,IF(LEN(Schema!B339)=2,10,IF(LEN(Schema!C339)=2,100,0))))","v":0},10,{"$f":"IF(A333=\"\",\"\",SUM(Tabel2[[#This Row],[I1]:[I2]]))","v":10},{"$error":"#REF!"},"IP","",{"$error":"#REF!"},{"$f":"IF(C333=\"\",\"\",IF(LEN(Tabel2[[#This Row],[Entiteit of attribuut]])=2,\"\",Tabel2[[#This Row],[Entiteit]]&\"_\"&Tabel2[[#This Row],[Entiteit of attribuut]]))","v":"IP_PAFWST"},{"$f":"IF(Schema!I339=\"\",\"\",Schema!I339)","v":""},{"$f":"IF(Schema!J339=\"\",\"\",Schema!J339)","v":""},{"$f":"IF(Schema!K339=\"\",\"\",Schema!K339)","v":""},{"$f":"IF(Schema!L339=\"\",\"\",Schema!L339)","v":""},{"$f":"IF(Schema!N339=\"\",\"\",Schema!N339)","v":"O"}]
[{"$f":"Schema!A340&Schema!B340&Schema!C340&Schema!D340","v":"PPRC"},"IP",{"$f":"IF(A334=\"\",\"\",IF(LEN(Schema!A340)=2,1,IF(LEN(Schema!B340)=2,10,IF(LEN(Schema!C340)=2,100,0))))","v":0},10,{"$f":"IF(A334=\"\",\"\",SUM(Tabel2[[#This Row],[I1]:[I2]]))","v":10},{"$error":"#REF!"},"IP","",{"$error":"#REF!"},{"$f":"IF(C334=\"\",\"\",IF(LEN(Tabel2[[#This Row],[Entiteit of attribuut]])=2,\"\",Tabel2[[#This Row],[Entiteit]]&\"_\"&Tabel2[[#This Row],[Entiteit of attribuut]]))","v":"IP_PPRC"},{"$f":"IF(Schema!I340=\"\",\"\",Schema!I340)","v":""},{"$f":"IF(Schema!J340=\"\",\"\",Schema!J340)","v":""},{"$f":"IF(Schema!K340=\"\",\"\",Schema!K340)","v":""},{"$f":"IF(Schema!L340=\"\",\"\",Schema!L340)","v":""},{"$f":"IF(Schema!N340=\"\",\"\",Schema!N340)","v":"O"}]
[{"$f":"Schema!A341&Schema!B341&Schema!C341&Schema!D341","v":"PRCPKKT"},"IP",{"$f":"IF(A335=\"\",\"\",IF(LEN(Schema!A341)=2,1,IF(LEN(Schema!B341)=2,10,IF(LEN(Schema!C341)=2,100,0))))","v":0},10,{"$f":"IF(A335=\"\",\"\",SUM(Tabel2[[#This Row],[I1]:[I2]]))","v":10},{"$error":"#REF!"},"IP","",{"$error":"#REF!"},{"$f":"IF(C335=\"\",\"\",IF(LEN(Tabel2[[#This Row],[Entiteit of attribuut]])=2,\"\",Tabel2[[#This Row],[Entiteit]]&\"_\"&Tabel2[[#This Row],[Entiteit of attribuut]]))","v":"IP_PRCPKKT"},{"$f":"IF(Schema!I341=\"\",\"\",Schema!I341)","v":""},{"$f":"IF(Schema!J341=\"\",\"\",Schema!J341)","v":""},{"$f":"IF(Schema!K341=\"\",\"\",Schema!K341)","v":""},{"$f":"IF(Schema!L341=\"\",\"\",Schema!L341)","v":""},{"$f":"IF(Schema!N341=\"\",\"\",Schema!N341)","v":"O"}]
[{"$f":"Schema!A342&Schema!B342&Schema!C342&Schema!D342","v":"PRCTEKC"},"IP",{"$f":"IF(A336=\"\",\"\",IF(LEN(Schema!A342)=2,1,IF(LEN(Schema!B342)=2,10,IF(LEN(Schema!C342)=2,100,0))))","v":0},10,{"$f":"IF(A336=\"\",\"\",SUM(Tabel2[[#This Row],[I1]:[I2]]))","v":10},{"$error":"#REF!"},"IP","",{"$error":"#REF!"},{"$f":"IF(C336=\"\",\"\",IF(LEN(Tabel2[[#This Row],[Entiteit of attribuut]])=2,\"\",Tabel2[[#This Row],[Entiteit]]&\"_\"&Tabel2[[#This Row],[Entiteit of attribuut]]))","v":"IP_PRCTEKC"},{"$f":"IF(Schema!I342=\"\",\"\",Schema!I342)","v":""},{"$f":"IF(Schema!J342=\"\",\"\",Schema!J342)","v":""},{"$f":"IF(Schema!K342=\"\",\"\",Schema!K342)","v":""},{"$f":"IF(Schema!L342=\"\",\"\",Schema!L342)","v":""},{"$f":"IF(Schema!N342=\"\",\"\",Schema!N342)","v":"O"}]
[{"$f":"Schema!A343&Schema!B343&Schema!C343&Schema!D343","v":"PRMPROM"},"IP",{"$f":"IF(A337=\"\",\"\",IF(LEN(Schema!A343)=2,1,IF(LEN(Schema!B343)=2,10,IF(LEN(Schema!C343)=2,100,0))))","v":0},10,{"$f":"IF(A337=\"\",\"\",SUM(Tabel2[[#This Row],[I1]:[I2]]))","v":10},{"$error":"#REF!"},"IP","",{"$error":"#REF!"},{"$f":"IF(C337=\"\",\"\",IF(LEN(Tabel2[[#This Row],[Entiteit of attribuut]])=2,\"\",Tabel2[[#This Row],[Entiteit]]&\"_\"&Tabel2[[#This Row],[Entiteit of attribuut]]))","v":"IP_PRMPROM"},{"$f":"IF(Schema!I343=\"\",\"\",Schema!I343)","v":""},{"$f":"IF(Schema!J343=\"\",\"\",Schema!J343)","v":""},{"$f":"IF(Schema!K343=\"\",\"\",Schema!K343)","v":""},{"$f":"IF(Schema!L343=\"\",\"\",Schema!L343)","v":""},{"$f":"IF(Schema!N343=\"\",\"\",Schema!N343)","v":"O"}]
[{"$f":"Schema!A344&Schema!B344&Schema!C344&Schema!D344","v":"RELVRH"},"IP",{"$f":"IF(A338=\"\",\"\",IF(LEN(Schema!A344)=2,1,IF(LEN(Schema!B344)=2,10,IF(LEN(Schema!C344)=2,100,0))))","v":0},10,{"$f":"IF(A338=\"\",\"\",SUM(Tabel2[[#This Row],[I1]:[I2]]))","v":10},{"$error":"#REF!"},"IP","",{"$error":"#REF!"},{"$f":"IF(C338=\"\",\"\",IF(LEN(Tabel2[[#This Row],[Entiteit of attribuut]])=2,\"\",Tabel2[[#This Row],[Entiteit]]&\"_\"&Tabel2[[#This Row],[Entiteit of attribuut]]))","v":"IP_RELVRH"},{"$f":"IF(Schema!I344=\"\",\"\",Schema!I344)","v":""},{"$f":"IF(Schema!J344=\"\",\"\",Schema!J344)","v":""},{"$f":"IF(Schema!K344=\"\",\"\",Schema!K344)","v":""},{"$f":"IF(Schema!L344=\"\",\"\",Schema!L344)","v":""},{"$f":"IF(Schema!N344=\"\",\"\",Schema!N344)","v":"O"}]
[{"$f":"Schema!A345&Schema!B345&Schema!C345&Schema!D345","v":"RELVVNR"},"IP",{"$f":"IF(A339=\"\",\"\",IF(LEN(Schema!A345)=2,1,IF(LEN(Schema!B345)=2,10,IF(LEN(Schema!C345)=2,100,0))))","v":0},10,{"$f":"IF(A339=\"\",\"\",SUM(Tabel2[[#This Row],[I1]:[I2]]))","v":10},{"$error":"#REF!"},"IP","",{"$error":"#REF!"},{"$f":"IF(C339=\"\",\"\",IF(LEN(Tabel2[[#This Row],[Entiteit of attribuut]])=2,\"\",Tabel2[[#This Row],[Entiteit]]&\"_\"&Tabel2[[#This Row],[Entiteit of attribuut]]))","v":"IP_RELVVNR"},{"$f":"IF(Schema!I345=\"\",\"\",Schema!I345)","v":""},{"$f":"IF(Schema!J345=\"\",\"\",Schema!J345)","v":""},{"$f":"IF(Schema!K345=\"\",\"\",Schema!K345)","v":""},{"$f":"IF(Schema!L345=\"\",\"\",Schema!L345)","v":""},{"$f":"IF(Schema!N345=\"\",\"\",Schema!N345)","v":"O"}]
[{"$f":"Schema!A346&Schema!B346&Schema!C346&Schema!D346","v":"RJRCOR"},"IP",{"$f":"IF(A340=\"\",\"\",IF(LEN(Schema!A346)=2,1,IF(LEN(Schema!B346)=2,10,IF(LEN(Schema!C346)=2,100,0))))","v":0},10,{"$f":"IF(A340=\"\",\"\",SUM(Tabel2[[#This Row],[I1]:[I2]]))","v":10},{"$error":"#REF!"},"IP","",{"$error":"#REF!"},{"$f":"IF(C340=\"\",\"\",IF(LEN(Tabel2[[#This Row],[Entiteit of attribuut]])=2,\"\",Tabel2[[#This Row],[Entiteit]]&\"_\"&Tabel2[[#This Row],[Entiteit of attribuut]]))","v":"IP_RJRCOR"},{"$f":"IF(Schema!I346=\"\",\"\",Schema!I346)","v":""},{"$f":"IF(Schema!J346=\"\",\"\",Schema!J346)","v":""},{"$f":"IF(Schema!K346=\"\",\"\",Schema!K346)","v":""},{"$f":"IF(Schema!L346=\"\",\"\",Schema!L346)","v":""},{"$f":"IF(Schema!N346=\"\",\"\",Schema!N346)","v":"O"}]
[{"$f":"Schema!A347&Schema!B347&Schema!C347&Schema!D347","v":"TCORBDR"},"IP",{"$f":"IF(A341=\"\",\"\",IF(LEN(Schema!A347)=2,1,IF(LEN(Schema!B347)=2,10,IF(LEN(Schema!C347)=2,100,0))))","v":0},10,{"$f":"IF(A341=\"\",\"\",SUM(Tabel2[[#This Row],[I1]:[I2]]))","v":10},{"$error":"#REF!"},"IP","",{"$error":"#REF!"},{"$f":"IF(C341=\"\",\"\",IF(LEN(Tabel2[[#This Row],[Entiteit of attribuut]])=2,\"\",Tabel2[[#This Row],[Entiteit]]&\"_\"&Tabel2[[#This Row],[Entiteit of attribuut]]))","v":"IP_TCORBDR"},{"$f":"IF(Schema!I347=\"\",\"\",Schema!I347)","v":""},{"$f":"IF(Schema!J347=\"\",\"\",Schema!J347)","v":""},{"$f":"IF(Schema!K347=\"\",\"\",Schema!K347)","v":""},{"$f":"IF(Schema!L347=\"\",\"\",Schema!L347)","v":""},{"$f":"IF(Schema!N347=\"\",\"\",Schema!N347)","v":"O"}]
[{"$f":"Schema!A348&Schema!B348&Schema!C348&Schema!D348","v":"VERZSOM"},"IP",{"$f":"IF(A342=\"\",\"\",IF(LEN(Schema!A348)=2,1,IF(LEN(Schema!B348)=2,10,IF(LEN(Schema!C348)=2,100,0))))","v":0},10,{"$f":"IF(A342=\"\",\"\",SUM(Tabel2[[#This Row],[I1]:[I2]]))","v":10},{"$error":"#REF!"},"IP","",{"$error":"#REF!"},{"$f":"IF(C342=\"\",\"\",IF(LEN(Tabel2[[#This Row],[Entiteit of attribuut]])=2,\"\",Tabel2[[#This Row],[Entiteit]]&\"_\"&Tabel2[[#This Row],[Entiteit of attribuut]]))","v":"IP_VERZSOM"},{"$f":"IF(Schema!I348=\"\",\"\",Schema!I348)","v":""},{"$f":"IF(Schema!J348=\"\",\"\",Schema!J348)","v":""},{"$f":"IF(Schema!K348=\"\",\"\",Schema!K348)","v":""},{"$f":"IF(Schema!L348=\"\",\"\",Schema!L348)","v":""},{"$f":"IF(Schema!N348=\"\",\"\",Schema!N348)","v":"O"}]
[{"$f":"Schema!A349&Schema!B349&Schema!C349&Schema!D349","v":"VGBRA"},"IP",{"$f":"IF(A343=\"\",\"\",IF(LEN(Schema!A349)=2,1,IF(LEN(Schema!B349)=2,10,IF(LEN(Schema!C349)=2,100,0))))","v":0},10,{"$f":"IF(A343=\"\",\"\",SUM(Tabel2[[#This Row],[I1]:[I2]]))","v":10},{"$error":"#REF!"},"IP","",{"$error":"#REF!"},{"$f":"IF(C343=\"\",\"\",IF(LEN(Tabel2[[#This Row],[Entiteit of attribuut]])=2,\"\",Tabel2[[#This Row],[Entiteit]]&\"_\"&Tabel2[[#This Row],[Entiteit of attribuut]]))","v":"IP_VGBRA"},{"$f":"IF(Schema!I349=\"\",\"\",Schema!I349)","v":""},{"$f":"IF(Schema!J349=\"\",\"\",Schema!J349)","v":""},{"$f":"IF(Schema!K349=\"\",\"\",Schema!K349)","v":""},{"$f":"IF(Schema!L349=\"\",\"\",Schema!L349)","v":""},{"$f":"IF(Schema!N349=\"\",\"\",Schema!N349)","v":"O"}]
[{"$f":"Schema!A350&Schema!B350&Schema!C350&Schema!D350","v":"VOLGNUM"},"IP",{"$f":"IF(A344=\"\",\"\",IF(LEN(Schema!A350)=2,1,IF(LEN(Schema!B350)=2,10,IF(LEN(Schema!C350)=2,100,0))))","v":0},10,{"$f":"IF(A344=\"\",\"\",SUM(Tabel2[[#This Row],[I1]:[I2]]))","v":10},{"$error":"#REF!"},"IP","",{"$error":"#REF!"},{"$f":"IF(C344=\"\",\"\",IF(LEN(Tabel2[[#This Row],[Entiteit of attribuut]])=2,\"\",Tabel2[[#This Row],[Entiteit]]&\"_\"&Tabel2[[#This Row],[Entiteit of attribuut]]))","v":"IP_VOLGNUM"},{"$f":"IF(Schema!I350=\"\",\"\",Schema!I350)","v":""},{"$f":"IF(Schema!J350=\"\",\"\",Schema!J350)","v":""},{"$f":"IF(Schema!K350=\"\",\"\",Schema!K350)","v":""},{"$f":"IF(Schema!L350=\"\",\"\",Schema!L350)","v":""},{"$f":"IF(Schema!N350=\"\",\"\",Schema!N350)","v":"LEEG"}]
[{"$f":"Schema!A351&Schema!B351&Schema!C351&Schema!D351","v":"VRWRKCD"},"IP",{"$f":"IF(A345=\"\",\"\",IF(LEN(Schema!A351)=2,1,IF(LEN(Schema!B351)=2,10,IF(LEN(Schema!C351)=2,100,0))))","v":0},10,{"$f":"IF(A345=\"\",\"\",SUM(Tabel2[[#This Row],[I1]:[I2]]))","v":10},{"$error":"#REF!"},"IP","",{"$error":"#REF!"},{"$f":"IF(C345=\"\",\"\",IF(LEN(Tabel2[[#This Row],[Entiteit of attribuut]])=2,\"\",Tabel2[[#This Row],[Entiteit]]&\"_\"&Tabel2[[#This Row],[Entiteit of attribuut]]))","v":"IP_VRWRKCD"},{"$f":"IF(Schema!I351=\"\",\"\",Schema!I351)","v":""},{"$f":"IF(Schema!J351=\"\",\"\",Schema!J351)","v":""},{"$f":"IF(Schema!K351=\"\",\"\",Schema!K351)","v":""},{"$f":"IF(Schema!L351=\"\",\"\",Schema!L351)","v":""},{"$f":"IF(Schema!N351=\"\",\"\",Schema!N351)","v":"LEEG"}]
[{"$f":"Schema!A352&Schema!B352&Schema!C352&Schema!D352","v":"WPREMBP"},"IP",{"$f":"IF(A346=\"\",\"\",IF(LEN(Schema!A352)=2,1,IF(LEN(Schema!B352)=2,10,IF(LEN(Schema!C352)=2,100,0))))","v":0},10,{"$f":"IF(A346=\"\",\"\",SUM(Tabel2[[#This Row],[I1]:[I2]]))","v":10},{"$error":"#REF!"},"IP","",{"$error":"#REF!"},{"$f":"IF(C346=\"\",\"\",IF(LEN(Tabel2[[#This Row],[Entiteit of attribuut]])=2,\"\",Tabel2[[#This Row],[Entiteit]]&\"_\"&Tabel2[[#This Row],[Entiteit of attribuut]]))","v":"IP_WPREMBP"},{"$f":"IF(Schema!I352=\"\",\"\",Schema!I352)","v":""},{"$f":"IF(Schema!J352=\"\",\"\",Schema!J352)","v":""},{"$f":"IF(Schema!K352=\"\",\"\",Schema!K352)","v":""},{"$f":"IF(Schema!L352=\"\",\"\",Schema!L352)","v":""},{"$f":"IF(Schema!N352=\"\",\"\",Schema!N352)","v":"O"}]
[{"$f":"Schema!A353&Schema!B353&Schema!C353&Schema!D353","v":"MP"},"MP",{"$f":"IF(A347=\"\",\"\",IF(LEN(Schema!A353)=2,1,IF(LEN(Schema!B353)=2,10,IF(LEN(Schema!C353)=2,100,0))))","v":100},100,{"$f":"IF(A347=\"\",\"\",SUM(Tabel2[[#This Row],[I1]:[I2]]))","v":200},{"$error":"#REF!"},"IP","MP",{"$error":"#REF!"},{"$f":"IF(C347=\"\",\"\",IF(LEN(Tabel2[[#This Row],[Entiteit of attribuut]])=2,\"\",Tabel2[[#This Row],[Entiteit]]&\"_\"&Tabel2[[#This Row],[Entiteit of attribuut]]))","v":""},{"$f":"IF(Schema!I353=\"\",\"\",Schema!I353)","v":""},{"$f":"IF(Schema!J353=\"\",\"\",Schema!J353)","v":""},{"$f":"IF(Schema!K353=\"\",\"\",Schema!K353)","v":""},{"$f":"IF(Schema!L353=\"\",\"\",Schema!L353)","v":""},{"$f":"IF(Schema!N353=\"\",\"\",Schema!N353)","v":"O"}]
[{"$f":"Schema!A354&Schema!B354&Schema!C354&Schema!D354","v":"MYAAND"},"MP",{"$f":"IF(A348=\"\",\"\",IF(LEN(Schema!A354)=2,1,IF(LEN(Schema!B354)=2,10,IF(LEN(Schema!C354)=2,100,0))))","v":0},100,{"$f":"IF(A348=\"\",\"\",SUM(Tabel2[[#This Row],[I1]:[I2]]))","v":100},{"$error":"#REF!"},"IP","MP",{"$error":"#REF!"},{"$f":"IF(C348=\"\",\"\",IF(LEN(Tabel2[[#This Row],[Entiteit of attribuut]])=2,\"\",Tabel2[[#This Row],[Entiteit]]&\"_\"&Tabel2[[#This Row],[Entiteit of attribuut]]))","v":"MP_MYAAND"},{"$f":"IF(Schema!I354=\"\",\"\",Schema!I354)","v":""},{"$f":"IF(Schema!J354=\"\",\"\",Schema!J354)","v":""},{"$f":"IF(Schema!K354=\"\",\"\",Schema!K354)","v":""},{"$f":"IF(Schema!L354=\"\",\"\",Schema!L354)","v":""},{"$f":"IF(Schema!N354=\"\",\"\",Schema!N354)","v":"O"}]
[{"$f":"Schema!A355&Schema!B355&Schema!C355&Schema!D355","v":"PLLEAD"},"MP",{"$f":"IF(A349=\"\",\"\",IF(LEN(Schema!A355)=2,1,IF(LEN(Schema!B355)=2,10,IF(LEN(Schema!C355)=2,100,0))))","v":0},100,{"$f":"IF(A349=\"\",\"\",SUM(Tabel2[[#This Row],[I1]:[I2]]))","v":100},{"$error":"#REF!"},"IP","MP",{"$error":"#REF!"},{"$f":"IF(C349=\"\",\"\",IF(LEN(Tabel2[[#This Row],[Entiteit of attribuut]])=2,\"\",Tabel2[[#This Row],[Entiteit]]&\"_\"&Tabel2[[#This Row],[Entiteit of attribuut]]))","v":"MP_PLLEAD"},{"$f":"IF(Schema!I355=\"\",\"\",Schema!I355)","v":""},{"$f":"IF(Schema!J355=\"\",\"\",Schema!J355)","v":""},{"$f":"IF(Schema!K355=\"\",\"\",Schema!K355)","v":""},{"$f":"IF(Schema!L355=\"\",\"\",Schema!L355)","v":""},{"$f":"IF(Schema!N355=\"\",\"\",Schema!N355)","v":"O"}]
[{"$f":"Schema!A356&Schema!B356&Schema!C356&Schema!D356","v":"POOLNUM"},"MP",{"$f":"IF(A350=\"\",\"\",IF(LEN(Schema!A356)=2,1,IF(LEN(Schema!B356)=2,10,IF(LEN(Schema!C356)=2,100,0))))","v":0},100,{"$f":"IF(A350=\"\",\"\",SUM(Tabel2[[#This Row],[I1]:[I2]]))","v":100},{"$error":"#REF!"},"IP","MP",{"$error":"#REF!"},{"$f":"IF(C350=\"\",\"\",IF(LEN(Tabel2[[#This Row],[Entiteit of attribuut]])=2,\"\",Tabel2[[#This Row],[Entiteit]]&\"_\"&Tabel2[[#This Row],[Entiteit of attribuut]]))","v":"MP_POOLNUM"},{"$f":"IF(Schema!I356=\"\",\"\",Schema!I356)","v":""},{"$f":"IF(Schema!J356=\"\",\"\",Schema!J356)","v":""},{"$f":"IF(Schema!K356=\"\",\"\",Schema!K356)","v":""},{"$f":"IF(Schema!L356=\"\",\"\",Schema!L356)","v":""},{"$f":"IF(Schema!N356=\"\",\"\",Schema!N356)","v":"V"}]
[{"$f":"Schema!A357&Schema!B357&Schema!C357&Schema!D357","v":"POOLPRC"},"MP",{"$f":"IF(A351=\"\",\"\",IF(LEN(Schema!A357)=2,1,IF(LEN(Schema!B357)=2,10,IF(LEN(Schema!C357)=2,100,0))))","v":0},100,{"$f":"IF(A351=\"\",\"\",SUM(Tabel2[[#This Row],[I1]:[I2]]))","v":100},{"$error":"#REF!"},"IP","MP",{"$error":"#REF!"},{"$f":"IF(C351=\"\",\"\",IF(LEN(Tabel2[[#This Row],[Entiteit of attribuut]])=2,\"\",Tabel2[[#This Row],[Entiteit]]&\"_\"&Tabel2[[#This Row],[Entiteit of attribuut]]))","v":"MP_POOLPRC"},{"$f":"IF(Schema!I357=\"\",\"\",Schema!I357)","v":""},{"$f":"IF(Schema!J357=\"\",\"\",Schema!J357)","v":""},{"$f":"IF(Schema!K357=\"\",\"\",Schema!K357)","v":""},{"$f":"IF(Schema!L357=\"\",\"\",Schema!L357)","v":""},{"$f":"IF(Schema!N357=\"\",\"\",Schema!N357)","v":"V"}]
[{"$f":"Schema!A358&Schema!B358&Schema!C358&Schema!D358","v":"IV"},"IV",{"$f":"IF(A352=\"\",\"\",IF(LEN(Schema!A358)=2,1,IF(LEN(Schema!B358)=2,10,IF(LEN(Schema!C358)=2,100,0))))","v":10},10,{"$f":"IF(A352=\"\",\"\",SUM(Tabel2[[#This Row],[I1]:[I2]]))","v":20},{"$error":"#REF!"},"IV","",{"$error":"#REF!"},{"$f":"IF(C352=\"\",\"\",IF(LEN(Tabel2[[#This Row],[Entiteit of attribuut]])=2,\"\",Tabel2[[#This Row],[Entiteit]]&\"_\"&Tabel2[[#This Row],[Entiteit of attribuut]]))","v":""},{"$f":"IF(Schema!I358=\"\",\"\",Schema!I358)","v":""},{"$f":"IF(Schema!J358=\"\",\"\",Schema!J358)","v":""},{"$f":"IF(Schema!K358=\"\",\"\",Schema!K358)","v":""},{"$f":"IF(Schema!L358=\"\",\"\",Schema!L358)","v":""},{"$f":"IF(Schema!N358=\"\",\"\",Schema!N358)","v":"O"}]
[{"$f":"Schema!A359&Schema!B359&Schema!C359&Schema!D359","v":"BAFWST"},"IV",{"$f":"IF(A353=\"\",\"\",IF(LEN(Schema!A359)=2,1,IF(LEN(Schema!B359)=2,10,IF(LEN(Schema!C359)=2,100,0))))","v":0},10,{"$f":"IF(A353=\"\",\"\",SUM(Tabel2[[#This Row],[I1]:[I2]]))","v":10},{"$error":"#REF!"},"IV","",{"$error":"#REF!"},{"$f":"IF(C353=\"\",\"\",IF(LEN(Tabel2[[#This Row],[Entiteit of attribuut]])=2,\"\",Tabel2[[#This Row],[Entiteit]]&\"_\"&Tabel2[[#This Row],[Entiteit of attribuut]]))","v":"IV_BAFWST"},{"$f":"IF(Schema!I359=\"\",\"\",Schema!I359)","v":""},{"$f":"IF(Schema!J359=\"\",\"\",Schema!J359)","v":""},{"$f":"IF(Schema!K359=\"\",\"\",Schema!K359)","v":""},{"$f":"IF(Schema!L359=\"\",\"\",Schema!L359)","v":""},{"$f":"IF(Schema!N359=\"\",\"\",Schema!N359)","v":"O"}]
[{"$f":"Schema!A360&Schema!B360&Schema!C360&Schema!D360","v":"BTP"},"IV",{"$f":"IF(A354=\"\",\"\",IF(LEN(Schema!A360)=2,1,IF(LEN(Schema!B360)=2,10,IF(LEN(Schema!C360)=2,100,0))))","v":0},10,{"$f":"IF(A354=\"\",\"\",SUM(Tabel2[[#This Row],[I1]:[I2]]))","v":10},{"$error":"#REF!"},"IV","",{"$error":"#REF!"},{"$f":"IF(C354=\"\",\"\",IF(LEN(Tabel2[[#This Row],[Entiteit of attribuut]])=2,\"\",Tabel2[[#This Row],[Entiteit]]&\"_\"&Tabel2[[#This Row],[Entiteit of attribuut]]))","v":"IV_BTP"},{"$f":"IF(Schema!I360=\"\",\"\",Schema!I360)","v":""},{"$f":"IF(Schema!J360=\"\",\"\",Schema!J360)","v":""},{"$f":"IF(Schema!K360=\"\",\"\",Schema!K360)","v":""},{"$f":"IF(Schema!L360=\"\",\"\",Schema!L360)","v":""},{"$f":"IF(Schema!N360=\"\",\"\",Schema!N360)","v":"LEEG"}]
[{"$f":"Schema!A361&Schema!B361&Schema!C361&Schema!D361","v":"CODE"},"IV",{"$f":"IF(A355=\"\",\"\",IF(LEN(Schema!A361)=2,1,IF(LEN(Schema!B361)=2,10,IF(LEN(Schema!C361)=2,100,0))))","v":0},10,{"$f":"IF(A355=\"\",\"\",SUM(Tabel2[[#This Row],[I1]:[I2]]))","v":10},{"$error":"#REF!"},"IV","",{"$error":"#REF!"},{"$f":"IF(C355=\"\",\"\",IF(LEN(Tabel2[[#This Row],[Entiteit of attribuut]])=2,\"\",Tabel2[[#This Row],[Entiteit]]&\"_\"&Tabel2[[#This Row],[Entiteit of attribuut]]))","v":"IV_CODE"},{"$f":"IF(Schema!I361=\"\",\"\",Schema!I361)","v":""},{"$f":"IF(Schema!J361=\"\",\"\",Schema!J361)","v":""},{"$f":"IF(Schema!K361=\"\",\"\",Schema!K361)","v":""},{"$f":"IF(Schema!L361=\"\",\"\",Schema!L361)","v":""},{"$f":"IF(Schema!N361=\"\",\"\",Schema!N361)","v":"O"}]
[{"$f":"Schema!A362&Schema!B362&Schema!C362&Schema!D362","v":"COLFACT"},"IV",{"$f":"IF(A356=\"\",\"\",IF(LEN(Schema!A362)=2,1,IF(LEN(Schema!B362)=2,10,IF(LEN(Schema!C362)=2,100,0))))","v":0},10,{"$f":"IF(A356=\"\",\"\",SUM(Tabel2[[#This Row],[I1]:[I2]]))","v":10},{"$error":"#REF!"},"IV","",{"$error":"#REF!"},{"$f":"IF(C356=\"\",\"\",IF(LEN(Tabel2[[#This Row],[Entiteit of attribuut]])=2,\"\",Tabel2[[#This Row],[Entiteit]]&\"_\"&Tabel2[[#This Row],[Entiteit of attribuut]]))","v":"IV_COLFACT"},{"$f":"IF(Schema!I362=\"\",\"\",Schema!I362)","v":""},{"$f":"IF(Schema!J362=\"\",\"\",Schema!J362)","v":""},{"$f":"IF(Schema!K362=\"\",\"\",Schema!K362)","v":""},{"$f":"IF(Schema!L362=\"\",\"\",Schema!L362)","v":""},{"$f":"IF(Schema!N362=\"\",\"\",Schema!N362)","v":"O"}]
[{"$f":"Schema!A363&Schema!B363&Schema!C363&Schema!D363","v":"ERB"},"IV",{"$f":"IF(A357=\"\",\"\",IF(LEN(Schema!A363)=2,1,IF(LEN(Schema!B363)=2,10,IF(LEN(Schema!C363)=2,100,0))))","v":0},10,{"$f":"IF(A357=\"\",\"\",SUM(Tabel2[[#This Row],[I1]:[I2]]))","v":10},{"$error":"#REF!"},"IV","",{"$error":"#REF!"},{"$f":"IF(C357=\"\",\"\",IF(LEN(Tabel2[[#This Row],[Entiteit of attribuut]])=2,\"\",Tabel2[[#This Row],[Entiteit]]&\"_\"&Tabel2[[#This Row],[Entiteit of attribuut]]))","v":"IV_ERB"},{"$f":"IF(Schema!I363=\"\",\"\",Schema!I363)","v":""},{"$f":"IF(Schema!J363=\"\",\"\",Schema!J363)","v":""},{"$f":"IF(Schema!K363=\"\",\"\",Schema!K363)","v":""},{"$f":"IF(Schema!L363=\"\",\"\",Schema!L363)","v":""},{"$f":"IF(Schema!N363=\"\",\"\",Schema!N363)","v":"O"}]
[{"$f":"Schema!A364&Schema!B364&Schema!C364&Schema!D364","v":"GADEKCD"},"IV",{"$f":"IF(A358=\"\",\"\",IF(LEN(Schema!A364)=2,1,IF(LEN(Schema!B364)=2,10,IF(LEN(Schema!C364)=2,100,0))))","v":0},10,{"$f":"IF(A358=\"\",\"\",SUM(Tabel2[[#This Row],[I1]:[I2]]))","v":10},{"$error":"#REF!"},"IV","",{"$error":"#REF!"},{"$f":"IF(C358=\"\",\"\",IF(LEN(Tabel2[[#This Row],[Entiteit of attribuut]])=2,\"\",Tabel2[[#This Row],[Entiteit]]&\"_\"&Tabel2[[#This Row],[Entiteit of attribuut]]))","v":"IV_GADEKCD"},{"$f":"IF(Schema!I364=\"\",\"\",Schema!I364)","v":""},{"$f":"IF(Schema!J364=\"\",\"\",Schema!J364)","v":""},{"$f":"IF(Schema!K364=\"\",\"\",Schema!K364)","v":""},{"$f":"IF(Schema!L364=\"\",\"\",Schema!L364)","v":""},{"$f":"IF(Schema!N364=\"\",\"\",Schema!N364)","v":"V"}]
[{"$f":"Schema!A365&Schema!B365&Schema!C365&Schema!D365","v":"GADEKCO"},"IV",{"$f":"IF(A359=\"\",\"\",IF(LEN(Schema!A365)=2,1,IF(LEN(Schema!B365)=2,10,IF(LEN(Schema!C365)=2,100,0))))","v":0},10,{"$f":"IF(A359=\"\",\"\",SUM(Tabel2[[#This Row],[I1]:[I2]]))","v":10},{"$error":"#REF!"},"IV","",{"$error":"#REF!"},{"$f":"IF(C359=\"\",\"\",IF(LEN(Tabel2[[#This Row],[Entiteit of attribuut]])=2,\"\",Tabel2[[#This Row],[Entiteit]]&\"_\"&Tabel2[[#This Row],[Entiteit of attribuut]]))","v":"IV_GADEKCO"},{"$f":"IF(Schema!I365=\"\",\"\",Schema!I365)","v":""},{"$f":"IF(Schema!J365=\"\",\"\",Schema!J365)","v":""},{"$f":"IF(Schema!K365=\"\",\"\",Schema!K365)","v":""},{"$f":"IF(Schema!L365=\"\",\"\",Schema!L365)","v":""},{"$f":"IF(Schema!N365=\"\",\"\",Schema!N365)","v":"V"}]
[{"$f":"Schema!A366&Schema!B366&Schema!C366&Schema!D366","v":"MYCODE"},"IV",{"$f":"IF(A360=\"\",\"\",IF(LEN(Schema!A366)=2,1,IF(LEN(Schema!B366)=2,10,IF(LEN(Schema!C366)=2,100,0))))","v":0},10,{"$f":"IF(A360=\"\",\"\",SUM(Tabel2[[#This Row],[I1]:[I2]]))","v":10},{"$error":"#REF!"},"IV","",{"$error":"#REF!"},{"$f":"IF(C360=\"\",\"\",IF(LEN(Tabel2[[#This Row],[Entiteit of attribuut]])=2,\"\",Tabel2[[#This Row],[Entiteit]]&\"_\"&Tabel2[[#This Row],[Entiteit of attribuut]]))","v":"IV_MYCODE"},{"$f":"IF(Schema!I366=\"\",\"\",Schema!I366)","v":""},{"$f":"IF(Schema!J366=\"\",\"\",Schema!J366)","v":""},{"$f":"IF(Schema!K366=\"\",\"\",Schema!K366)","v":""},{"$f":"IF(Schema!L366=\"\",\"\",Schema!L366)","v":""},{"$f":"IF(Schema!N366=\"\",\"\",Schema!N366)","v":"O"}]
[{"$f":"Schema!A367&Schema!B367&Schema!C367&Schema!D367","v":"NJP"},"IV",{"$f":"IF(A361=\"\",\"\",IF(LEN(Schema!A367)=2,1,IF(LEN(Schema!B367)=2,10,IF(LEN(Schema!C367)=2,100,0))))","v":0},10,{"$f":"IF(A361=\"\",\"\",SUM(Tabel2[[#This Row],[I1]:[I2]]))","v":10},{"$error":"#REF!"},"IV","",{"$error":"#REF!"},{"$f":"IF(C361=\"\",\"\",IF(LEN(Tabel2[[#This Row],[Entiteit of attribuut]])=2,\"\",Tabel2[[#This Row],[Entiteit]]&\"_\"&Tabel2[[#This Row],[Entiteit of attribuut]]))","v":"IV_NJP"},{"$f":"IF(Schema!I367=\"\",\"\",Schema!I367)","v":""},{"$f":"IF(Schema!J367=\"\",\"\",Schema!J367)","v":""},{"$f":"IF(Schema!K367=\"\",\"\",Schema!K367)","v":""},{"$f":"IF(Schema!L367=\"\",\"\",Schema!L367)","v":""},{"$f":"IF(Schema!N367=\"\",\"\",Schema!N367)","v":"O"}]
[{"$f":"Schema!A368&Schema!B368&Schema!C368&Schema!D368","v":"PAFWST"},"IV",{"$f":"IF(A362=\"\",\"\",IF(LEN(Schema!A368)=2,1,IF(LEN(Schema!B368)=2,10,IF(LEN(Schema!C368)=2,100,0))))","v":0},10,{"$f":"IF(A362=\"\",\"\",SUM(Tabel2[[#This Row],[I1]:[I2]]))","v":10},{"$error":"#REF!"},"IV","",{"$error":"#REF!"},{"$f":"IF(C362=\"\",\"\",IF(LEN(Tabel2[[#This Row],[Entiteit of attribuut]])=2,\"\",Tabel2[[#This Row],[Entiteit]]&\"_\"&Tabel2[[#This Row],[Entiteit of attribuut]]))","v":"IV_PAFWST"},{"$f":"IF(Schema!I368=\"\",\"\",Schema!I368)","v":""},{"$f":"IF(Schema!J368=\"\",\"\",Schema!J368)","v":""},{"$f":"IF(Schema!K368=\"\",\"\",Schema!K368)","v":""},{"$f":"IF(Schema!L368=\"\",\"\",Schema!L368)","v":""},{"$f":"IF(Schema!N368=\"\",\"\",Schema!N368)","v":"O"}]
[{"$f":"Schema!A369&Schema!B369&Schema!C369&Schema!D369","v":"PPRC"},"IV",{"$f":"IF(A363=\"\",\"\",IF(LEN(Schema!A369)=2,1,IF(LEN(Schema!B369)=2,10,IF(LEN(Schema!C369)=2,100,0))))","v":0},10,{"$f":"IF(A363=\"\",\"\",SUM(Tabel2[[#This Row],[I1]:[I2]]))","v":10},{"$error":"#REF!"},"IV","",{"$error":"#REF!"},{"$f":"IF(C363=\"\",\"\",IF(LEN(Tabel2[[#This Row],[Entiteit of attribuut]])=2,\"\",Tabel2[[#This Row],[Entiteit]]&\"_\"&Tabel2[[#This Row],[Entiteit of attribuut]]))","v":"IV_PPRC"},{"$f":"IF(Schema!I369=\"\",\"\",Schema!I369)","v":""},{"$f":"IF(Schema!J369=\"\",\"\",Schema!J369)","v":""},{"$f":"IF(Schema!K369=\"\",\"\",Schema!K369)","v":""},{"$f":"IF(Schema!L369=\"\",\"\",Schema!L369)","v":""},{"$f":"IF(Schema!N369=\"\",\"\",Schema!N369)","v":"O"}]
[{"$f":"Schema!A370&Schema!B370&Schema!C370&Schema!D370","v":"PRCPKKT"},"IV",{"$f":"IF(A364=\"\",\"\",IF(LEN(Schema!A370)=2,1,IF(LEN(Schema!B370)=2,10,IF(LEN(Schema!C370)=2,100,0))))","v":0},10,{"$f":"IF(A364=\"\",\"\",SUM(Tabel2[[#This Row],[I1]:[I2]]))","v":10},{"$error":"#REF!"},"IV","",{"$error":"#REF!"},{"$f":"IF(C364=\"\",\"\",IF(LEN(Tabel2[[#This Row],[Entiteit of attribuut]])=2,\"\",Tabel2[[#This Row],[Entiteit]]&\"_\"&Tabel2[[#This Row],[Entiteit of attribuut]]))","v":"IV_PRCPKKT"},{"$f":"IF(Schema!I370=\"\",\"\",Schema!I370)","v":""},{"$f":"IF(Schema!J370=\"\",\"\",Schema!J370)","v":""},{"$f":"IF(Schema!K370=\"\",\"\",Schema!K370)","v":""},{"$f":"IF(Schema!L370=\"\",\"\",Schema!L370)","v":""},{"$f":"IF(Schema!N370=\"\",\"\",Schema!N370)","v":"O"}]
[{"$f":"Schema!A371&Schema!B371&Schema!C371&Schema!D371","v":"PRCTEKC"},"IV",{"$f":"IF(A365=\"\",\"\",IF(LEN(Schema!A371)=2,1,IF(LEN(Schema!B371)=2,10,IF(LEN(Schema!C371)=2,100,0))))","v":0},10,{"$f":"IF(A365=\"\",\"\",SUM(Tabel2[[#This Row],[I1]:[I2]]))","v":10},{"$error":"#REF!"},"IV","",{"$error":"#REF!"},{"$f":"IF(C365=\"\",\"\",IF(LEN(Tabel2[[#This Row],[Entiteit of attribuut]])=2,\"\",Tabel2[[#This Row],[Entiteit]]&\"_\"&Tabel2[[#This Row],[Entiteit of attribuut]]))","v":"IV_PRCTEKC"},{"$f":"IF(Schema!I371=\"\",\"\",Schema!I371)","v":""},{"$f":"IF(Schema!J371=\"\",\"\",Schema!J371)","v":""},{"$f":"IF(Schema!K371=\"\",\"\",Schema!K371)","v":""},{"$f":"IF(Schema!L371=\"\",\"\",Schema!L371)","v":""},{"$f":"IF(Schema!N371=\"\",\"\",Schema!N371)","v":"O"}]
[{"$f":"Schema!A372&Schema!B372&Schema!C372&Schema!D372","v":"PRMPROM"},"IV",{"$f":"IF(A366=\"\",\"\",IF(LEN(Schema!A372)=2,1,IF(LEN(Schema!B372)=2,10,IF(LEN(Schema!C372)=2,100,0))))","v":0},10,{"$f":"IF(A366=\"\",\"\",SUM(Tabel2[[#This Row],[I1]:[I2]]))","v":10},{"$error":"#REF!"},"IV","",{"$error":"#REF!"},{"$f":"IF(C366=\"\",\"\",IF(LEN(Tabel2[[#This Row],[Entiteit of attribuut]])=2,\"\",Tabel2[[#This Row],[Entiteit]]&\"_\"&Tabel2[[#This Row],[Entiteit of attribuut]]))","v":"IV_PRMPROM"},{"$f":"IF(Schema!I372=\"\",\"\",Schema!I372)","v":""},{"$f":"IF(Schema!J372=\"\",\"\",Schema!J372)","v":""},{"$f":"IF(Schema!K372=\"\",\"\",Schema!K372)","v":""},{"$f":"IF(Schema!L372=\"\",\"\",Schema!L372)","v":""},{"$f":"IF(Schema!N372=\"\",\"\",Schema!N372)","v":"O"}]
[{"$f":"Schema!A373&Schema!B373&Schema!C373&Schema!D373","v":"RELVRH"},"IV",{"$f":"IF(A367=\"\",\"\",IF(LEN(Schema!A373)=2,1,IF(LEN(Schema!B373)=2,10,IF(LEN(Schema!C373)=2,100,0))))","v":0},10,{"$f":"IF(A367=\"\",\"\",SUM(Tabel2[[#This Row],[I1]:[I2]]))","v":10},{"$error":"#REF!"},"IV","",{"$error":"#REF!"},{"$f":"IF(C367=\"\",\"\",IF(LEN(Tabel2[[#This Row],[Entiteit of attribuut]])=2,\"\",Tabel2[[#This Row],[Entiteit]]&\"_\"&Tabel2[[#This Row],[Entiteit of attribuut]]))","v":"IV_RELVRH"},{"$f":"IF(Schema!I373=\"\",\"\",Schema!I373)","v":""},{"$f":"IF(Schema!J373=\"\",\"\",Schema!J373)","v":""},{"$f":"IF(Schema!K373=\"\",\"\",Schema!K373)","v":""},{"$f":"IF(Schema!L373=\"\",\"\",Schema!L373)","v":""},{"$f":"IF(Schema!N373=\"\",\"\",Schema!N373)","v":"O"}]
[{"$f":"Schema!A374&Schema!B374&Schema!C374&Schema!D374","v":"RELVVNR"},"IV",{"$f":"IF(A368=\"\",\"\",IF(LEN(Schema!A374)=2,1,IF(LEN(Schema!B374)=2,10,IF(LEN(Schema!C374)=2,100,0))))","v":0},10,{"$f":"IF(A368=\"\",\"\",SUM(Tabel2[[#This Row],[I1]:[I2]]))","v":10},{"$error":"#REF!"},"IV","",{"$error":"#REF!"},{"$f":"IF(C368=\"\",\"\",IF(LEN(Tabel2[[#This Row],[Entiteit of attribuut]])=2,\"\",Tabel2[[#This Row],[Entiteit]]&\"_\"&Tabel2[[#This Row],[Entiteit of attribuut]]))","v":"IV_RELVVNR"},{"$f":"IF(Schema!I374=\"\",\"\",Schema!I374)","v":""},{"$f":"IF(Schema!J374=\"\",\"\",Schema!J374)","v":""},{"$f":"IF(Schema!K374=\"\",\"\",Schema!K374)","v":""},{"$f":"IF(Schema!L374=\"\",\"\",Schema!L374)","v":""},{"$f":"IF(Schema!N374=\"\",\"\",Schema!N374)","v":"O"}]
[{"$f":"Schema!A375&Schema!B375&Schema!C375&Schema!D375","v":"RJRCOR"},"IV",{"$f":"IF(A369=\"\",\"\",IF(LEN(Schema!A375)=2,1,IF(LEN(Schema!B375)=2,10,IF(LEN(Schema!C375)=2,100,0))))","v":0},10,{"$f":"IF(A369=\"\",\"\",SUM(Tabel2[[#This Row],[I1]:[I2]]))","v":10},{"$error":"#REF!"},"IV","",{"$error":"#REF!"},{"$f":"IF(C369=\"\",\"\",IF(LEN(Tabel2[[#This Row],[Entiteit of attribuut]])=2,\"\",Tabel2[[#This Row],[Entiteit]]&\"_\"&Tabel2[[#This Row],[Entiteit of attribuut]]))","v":"IV_RJRCOR"},{"$f":"IF(Schema!I375=\"\",\"\",Schema!I375)","v":""},{"$f":"IF(Schema!J375=\"\",\"\",Schema!J375)","v":""},{"$f":"IF(Schema!K375=\"\",\"\",Schema!K375)","v":""},{"$f":"IF(Schema!L375=\"\",\"\",Schema!L375)","v":""},{"$f":"IF(Schema!N375=\"\",\"\",Schema!N375)","v":"O"}]
[{"$f":"Schema!A376&Schema!B376&Schema!C376&Schema!D376","v":"TCORBDR"},"IV",{"$f":"IF(A370=\"\",\"\",IF(LEN(Schema!A376)=2,1,IF(LEN(Schema!B376)=2,10,IF(LEN(Schema!C376)=2,100,0))))","v":0},10,{"$f":"IF(A370=\"\",\"\",SUM(Tabel2[[#This Row],[I1]:[I2]]))","v":10},{"$error":"#REF!"},"IV","",{"$error":"#REF!"},{"$f":"IF(C370=\"\",\"\",IF(LEN(Tabel2[[#This Row],[Entiteit of attribuut]])=2,\"\",Tabel2[[#This Row],[Entiteit]]&\"_\"&Tabel2[[#This Row],[Entiteit of attribuut]]))","v":"IV_TCORBDR"},{"$f":"IF(Schema!I376=\"\",\"\",Schema!I376)","v":""},{"$f":"IF(Schema!J376=\"\",\"\",Schema!J376)","v":""},{"$f":"IF(Schema!K376=\"\",\"\",Schema!K376)","v":""},{"$f":"IF(Schema!L376=\"\",\"\",Schema!L376)","v":""},{"$f":"IF(Schema!N376=\"\",\"\",Schema!N376)","v":"O"}]
[{"$f":"Schema!A377&Schema!B377&Schema!C377&Schema!D377","v":"VERZSOM"},"IV",{"$f":"IF(A371=\"\",\"\",IF(LEN(Schema!A377)=2,1,IF(LEN(Schema!B377)=2,10,IF(LEN(Schema!C377)=2,100,0))))","v":0},10,{"$f":"IF(A371=\"\",\"\",SUM(Tabel2[[#This Row],[I1]:[I2]]))","v":10},{"$error":"#REF!"},"IV","",{"$error":"#REF!"},{"$f":"IF(C371=\"\",\"\",IF(LEN(Tabel2[[#This Row],[Entiteit of attribuut]])=2,\"\",Tabel2[[#This Row],[Entiteit]]&\"_\"&Tabel2[[#This Row],[Entiteit of attribuut]]))","v":"IV_VERZSOM"},{"$f":"IF(Schema!I377=\"\",\"\",Schema!I377)","v":""},{"$f":"IF(Schema!J377=\"\",\"\",Schema!J377)","v":""},{"$f":"IF(Schema!K377=\"\",\"\",Schema!K377)","v":""},{"$f":"IF(Schema!L377=\"\",\"\",Schema!L377)","v":""},{"$f":"IF(Schema!N377=\"\",\"\",Schema!N377)","v":"O"}]
[{"$f":"Schema!A378&Schema!B378&Schema!C378&Schema!D378","v":"VGBRA"},"IV",{"$f":"IF(A372=\"\",\"\",IF(LEN(Schema!A378)=2,1,IF(LEN(Schema!B378)=2,10,IF(LEN(Schema!C378)=2,100,0))))","v":0},10,{"$f":"IF(A372=\"\",\"\",SUM(Tabel2[[#This Row],[I1]:[I2]]))","v":10},{"$error":"#REF!"},"IV","",{"$error":"#REF!"},{"$f":"IF(C372=\"\",\"\",IF(LEN(Tabel2[[#This Row],[Entiteit of attribuut]])=2,\"\",Tabel2[[#This Row],[Entiteit]]&\"_\"&Tabel2[[#This Row],[Entiteit of attribuut]]))","v":"IV_VGBRA"},{"$f":"IF(Schema!I378=\"\",\"\",Schema!I378)","v":""},{"$f":"IF(Schema!J378=\"\",\"\",Schema!J378)","v":""},{"$f":"IF(Schema!K378=\"\",\"\",Schema!K378)","v":""},{"$f":"IF(Schema!L378=\"\",\"\",Schema!L378)","v":""},{"$f":"IF(Schema!N378=\"\",\"\",Schema!N378)","v":"O"}]
[{"$f":"Schema!A379&Schema!B379&Schema!C379&Schema!D379","v":"VOLGNUM"},"IV",{"$f":"IF(A373=\"\",\"\",IF(LEN(Schema!A379)=2,1,IF(LEN(Schema!B379)=2,10,IF(LEN(Schema!C379)=2,100,0))))","v":0},10,{"$f":"IF(A373=\"\",\"\",SUM(Tabel2[[#This Row],[I1]:[I2]]))","v":10},{"$error":"#REF!"},"IV","",{"$error":"#REF!"},{"$f":"IF(C373=\"\",\"\",IF(LEN(Tabel2[[#This Row],[Entiteit of attribuut]])=2,\"\",Tabel2[[#This Row],[Entiteit]]&\"_\"&Tabel2[[#This Row],[Entiteit of attribuut]]))","v":"IV_VOLGNUM"},{"$f":"IF(Schema!I379=\"\",\"\",Schema!I379)","v":""},{"$f":"IF(Schema!J379=\"\",\"\",Schema!J379)","v":""},{"$f":"IF(Schema!K379=\"\",\"\",Schema!K379)","v":""},{"$f":"IF(Schema!L379=\"\",\"\",Schema!L379)","v":""},{"$f":"IF(Schema!N379=\"\",\"\",Schema!N379)","v":"LEEG"}]
[{"$f":"Schema!A380&Schema!B380&Schema!C380&Schema!D380","v":"VRWRKCD"},"IV",{"$f":"IF(A374=\"\",\"\",IF(LEN(Schema!A380)=2,1,IF(LEN(Schema!B380)=2,10,IF(LEN(Schema!C380)=2,100,0))))","v":0},10,{"$f":"IF(A374=\"\",\"\",SUM(Tabel2[[#This Row],[I1]:[I2]]))","v":10},{"$error":"#REF!"},"IV","",{"$error":"#REF!"},{"$f":"IF(C374=\"\",\"\",IF(LEN(Tabel2[[#This Row],[Entiteit of attribuut]])=2,\"\",Tabel2[[#This Row],[Entiteit]]&\"_\"&Tabel2[[#This Row],[Entiteit of attribuut]]))","v":"IV_VRWRKCD"},{"$f":"IF(Schema!I380=\"\",\"\",Schema!I380)","v":""},{"$f":"IF(Schema!J380=\"\",\"\",Schema!J380)","v":""},{"$f":"IF(Schema!K380=\"\",\"\",Schema!K380)","v":""},{"$f":"IF(Schema!L380=\"\",\"\",Schema!L380)","v":""},{"$f":"IF(Schema!N380=\"\",\"\",Schema!N380)","v":"LEEG"}]
[{"$f":"Schema!A381&Schema!B381&Schema!C381&Schema!D381","v":"WPREMBP"},"IV",{"$f":"IF(A375=\"\",\"\",IF(LEN(Schema!A381)=2,1,IF(LEN(Schema!B381)=2,10,IF(LEN(Schema!C381)=2,100,0))))","v":0},10,{"$f":"IF(A375=\"\",\"\",SUM(Tabel2[[#This Row],[I1]:[I2]]))","v":10},{"$error":"#REF!"},"IV","",{"$error":"#REF!"},{"$f":"IF(C375=\"\",\"\",IF(LEN(Tabel2[[#This Row],[Entiteit of attribuut]])=2,\"\",Tabel2[[#This Row],[Entiteit]]&\"_\"&Tabel2[[#This Row],[Entiteit of attribuut]]))","v":"IV_WPREMBP"},{"$f":"IF(Schema!I381=\"\",\"\",Schema!I381)","v":""},{"$f":"IF(Schema!J381=\"\",\"\",Schema!J381)","v":""},{"$f":"IF(Schema!K381=\"\",\"\",Schema!K381)","v":""},{"$f":"IF(Schema!L381=\"\",\"\",Schema!L381)","v":""},{"$f":"IF(Schema!N381=\"\",\"\",Schema!N381)","v":"O"}]
[{"$f":"Schema!A382&Schema!B382&Schema!C382&Schema!D382","v":"MP"},"MP",{"$f":"IF(A376=\"\",\"\",IF(LEN(Schema!A382)=2,1,IF(LEN(Schema!B382)=2,10,IF(LEN(Schema!C382)=2,100,0))))","v":100},100,{"$f":"IF(A376=\"\",\"\",SUM(Tabel2[[#This Row],[I1]:[I2]]))","v":200},{"$error":"#REF!"},"IV","MP",{"$error":"#REF!"},{"$f":"IF(C376=\"\",\"\",IF(LEN(Tabel2[[#This Row],[Entiteit of attribuut]])=2,\"\",Tabel2[[#This Row],[Entiteit]]&\"_\"&Tabel2[[#This Row],[Entiteit of attribuut]]))","v":""},{"$f":"IF(Schema!I382=\"\",\"\",Schema!I382)","v":""},{"$f":"IF(Schema!J382=\"\",\"\",Schema!J382)","v":""},{"$f":"IF(Schema!K382=\"\",\"\",Schema!K382)","v":""},{"$f":"IF(Schema!L382=\"\",\"\",Schema!L382)","v":""},{"$f":"IF(Schema!N382=\"\",\"\",Schema!N382)","v":"O"}]
[{"$f":"Schema!A383&Schema!B383&Schema!C383&Schema!D383","v":"MYAAND"},"MP",{"$f":"IF(A377=\"\",\"\",IF(LEN(Schema!A383)=2,1,IF(LEN(Schema!B383)=2,10,IF(LEN(Schema!C383)=2,100,0))))","v":0},100,{"$f":"IF(A377=\"\",\"\",SUM(Tabel2[[#This Row],[I1]:[I2]]))","v":100},{"$error":"#REF!"},"IV","MP",{"$error":"#REF!"},{"$f":"IF(C377=\"\",\"\",IF(LEN(Tabel2[[#This Row],[Entiteit of attribuut]])=2,\"\",Tabel2[[#This Row],[Entiteit]]&\"_\"&Tabel2[[#This Row],[Entiteit of attribuut]]))","v":"MP_MYAAND"},{"$f":"IF(Schema!I383=\"\",\"\",Schema!I383)","v":""},{"$f":"IF(Schema!J383=\"\",\"\",Schema!J383)","v":""},{"$f":"IF(Schema!K383=\"\",\"\",Schema!K383)","v":""},{"$f":"IF(Schema!L383=\"\",\"\",Schema!L383)","v":""},{"$f":"IF(Schema!N383=\"\",\"\",Schema!N383)","v":"O"}]
[{"$f":"Schema!A384&Schema!B384&Schema!C384&Schema!D384","v":"PLLEAD"},"MP",{"$f":"IF(A378=\"\",\"\",IF(LEN(Schema!A384)=2,1,IF(LEN(Schema!B384)=2,10,IF(LEN(Schema!C384)=2,100,0))))","v":0},100,{"$f":"IF(A378=\"\",\"\",SUM(Tabel2[[#This Row],[I1]:[I2]]))","v":100},{"$error":"#REF!"},"IV","MP",{"$error":"#REF!"},{"$f":"IF(C378=\"\",\"\",IF(LEN(Tabel2[[#This Row],[Entiteit of attribuut]])=2,\"\",Tabel2[[#This Row],[Entiteit]]&\"_\"&Tabel2[[#This Row],[Entiteit of attribuut]]))","v":"MP_PLLEAD"},{"$f":"IF(Schema!I384=\"\",\"\",Schema!I384)","v":""},{"$f":"IF(Schema!J384=\"\",\"\",Schema!J384)","v":""},{"$f":"IF(Schema!K384=\"\",\"\",Schema!K384)","v":""},{"$f":"IF(Schema!L384=\"\",\"\",Schema!L384)","v":""},{"$f":"IF(Schema!N384=\"\",\"\",Schema!N384)","v":"O"}]
[{"$f":"Schema!A385&Schema!B385&Schema!C385&Schema!D385","v":"POOLNUM"},"MP",{"$f":"IF(A379=\"\",\"\",IF(LEN(Schema!A385)=2,1,IF(LEN(Schema!B385)=2,10,IF(LEN(Schema!C385)=2,100,0))))","v":0},100,{"$f":"IF(A379=\"\",\"\",SUM(Tabel2[[#This Row],[I1]:[I2]]))","v":100},{"$error":"#REF!"},"IV","MP",{"$error":"#REF!"},{"$f":"IF(C379=\"\",\"\",IF(LEN(Tabel2[[#This Row],[Entiteit of attribuut]])=2,\"\",Tabel2[[#This Row],[Entiteit]]&\"_\"&Tabel2[[#This Row],[Entiteit of attribuut]]))","v":"MP_POOLNUM"},{"$f":"IF(Schema!I385=\"\",\"\",Schema!I385)","v":""},{"$f":"IF(Schema!J385=\"\",\"\",Schema!J385)","v":""},{"$f":"IF(Schema!K385=\"\",\"\",Schema!K385)","v":""},{"$f":"IF(Schema!L385=\"\",\"\",Schema!L385)","v":""},{"$f":"IF(Schema!N385=\"\",\"\",Schema!N385)","v":"V"}]
[{"$f":"Schema!A386&Schema!B386&Schema!C386&Schema!D386","v":"POOLPRC"},"MP",{"$f":"IF(A380=\"\",\"\",IF(LEN(Schema!A386)=2,1,IF(LEN(Schema!B386)=2,10,IF(LEN(Schema!C386)=2,100,0))))","v":0},100,{"$f":"IF(A380=\"\",\"\",SUM(Tabel2[[#This Row],[I1]:[I2]]))","v":100},{"$error":"#REF!"},"IV","MP",{"$error":"#REF!"},{"$f":"IF(C380=\"\",\"\",IF(LEN(Tabel2[[#This Row],[Entiteit of attribuut]])=2,\"\",Tabel2[[#This Row],[Entiteit]]&\"_\"&Tabel2[[#This Row],[Entiteit of attribuut]]))","v":"MP_POOLPRC"},{"$f":"IF(Schema!I386=\"\",\"\",Schema!I386)","v":""},{"$f":"IF(Schema!J386=\"\",\"\",Schema!J386)","v":""},{"$f":"IF(Schema!K386=\"\",\"\",Schema!K386)","v":""},{"$f":"IF(Schema!L386=\"\",\"\",Schema!L386)","v":""},{"$f":"IF(Schema!N386=\"\",\"\",Schema!N386)","v":"V"}]
[{"$f":"Schema!A387&Schema!B387&Schema!C387&Schema!D387","v":"KA"},"KA",{"$f":"IF(A381=\"\",\"\",IF(LEN(Schema!A387)=2,1,IF(LEN(Schema!B387)=2,10,IF(LEN(Schema!C387)=2,100,0))))","v":10},10,{"$f":"IF(A381=\"\",\"\",SUM(Tabel2[[#This Row],[I1]:[I2]]))","v":20},{"$error":"#REF!"},"KA","",{"$error":"#REF!"},{"$f":"IF(C381=\"\",\"\",IF(LEN(Tabel2[[#This Row],[Entiteit of attribuut]])=2,\"\",Tabel2[[#This Row],[Entiteit]]&\"_\"&Tabel2[[#This Row],[Entiteit of attribuut]]))","v":""},{"$f":"IF(Schema!I387=\"\",\"\",Schema!I387)","v":""},{"$f":"IF(Schema!J387=\"\",\"\",Schema!J387)","v":""},{"$f":"IF(Schema!K387=\"\",\"\",Schema!K387)","v":""},{"$f":"IF(Schema!L387=\"\",\"\",Schema!L387)","v":""},{"$f":"IF(Schema!N387=\"\",\"\",Schema!N387)","v":"O"}]
[{"$f":"Schema!A388&Schema!B388&Schema!C388&Schema!D388","v":"BAFWST"},"KA",{"$f":"IF(A382=\"\",\"\",IF(LEN(Schema!A388)=2,1,IF(LEN(Schema!B388)=2,10,IF(LEN(Schema!C388)=2,100,0))))","v":0},10,{"$f":"IF(A382=\"\",\"\",SUM(Tabel2[[#This Row],[I1]:[I2]]))","v":10},{"$error":"#REF!"},"KA","",{"$error":"#REF!"},{"$f":"IF(C382=\"\",\"\",IF(LEN(Tabel2[[#This Row],[Entiteit of attribuut]])=2,\"\",Tabel2[[#This Row],[Entiteit]]&\"_\"&Tabel2[[#This Row],[Entiteit of attribuut]]))","v":"KA_BAFWST"},{"$f":"IF(Schema!I388=\"\",\"\",Schema!I388)","v":""},{"$f":"IF(Schema!J388=\"\",\"\",Schema!J388)","v":""},{"$f":"IF(Schema!K388=\"\",\"\",Schema!K388)","v":""},{"$f":"IF(Schema!L388=\"\",\"\",Schema!L388)","v":""},{"$f":"IF(Schema!N388=\"\",\"\",Schema!N388)","v":"O"}]
[{"$f":"Schema!A389&Schema!B389&Schema!C389&Schema!D389","v":"BTP"},"KA",{"$f":"IF(A383=\"\",\"\",IF(LEN(Schema!A389)=2,1,IF(LEN(Schema!B389)=2,10,IF(LEN(Schema!C389)=2,100,0))))","v":0},10,{"$f":"IF(A383=\"\",\"\",SUM(Tabel2[[#This Row],[I1]:[I2]]))","v":10},{"$error":"#REF!"},"KA","",{"$error":"#REF!"},{"$f":"IF(C383=\"\",\"\",IF(LEN(Tabel2[[#This Row],[Entiteit of attribuut]])=2,\"\",Tabel2[[#This Row],[Entiteit]]&\"_\"&Tabel2[[#This Row],[Entiteit of attribuut]]))","v":"KA_BTP"},{"$f":"IF(Schema!I389=\"\",\"\",Schema!I389)","v":""},{"$f":"IF(Schema!J389=\"\",\"\",Schema!J389)","v":""},{"$f":"IF(Schema!K389=\"\",\"\",Schema!K389)","v":""},{"$f":"IF(Schema!L389=\"\",\"\",Schema!L389)","v":""},{"$f":"IF(Schema!N389=\"\",\"\",Schema!N389)","v":"LEEG"}]
[{"$f":"Schema!A390&Schema!B390&Schema!C390&Schema!D390","v":"CODE"},"KA",{"$f":"IF(A384=\"\",\"\",IF(LEN(Schema!A390)=2,1,IF(LEN(Schema!B390)=2,10,IF(LEN(Schema!C390)=2,100,0))))","v":0},10,{"$f":"IF(A384=\"\",\"\",SUM(Tabel2[[#This Row],[I1]:[I2]]))","v":10},{"$error":"#REF!"},"KA","",{"$error":"#REF!"},{"$f":"IF(C384=\"\",\"\",IF(LEN(Tabel2[[#This Row],[Entiteit of attribuut]])=2,\"\",Tabel2[[#This Row],[Entiteit]]&\"_\"&Tabel2[[#This Row],[Entiteit of attribuut]]))","v":"KA_CODE"},{"$f":"IF(Schema!I390=\"\",\"\",Schema!I390)","v":""},{"$f":"IF(Schema!J390=\"\",\"\",Schema!J390)","v":""},{"$f":"IF(Schema!K390=\"\",\"\",Schema!K390)","v":""},{"$f":"IF(Schema!L390=\"\",\"\",Schema!L390)","v":""},{"$f":"IF(Schema!N390=\"\",\"\",Schema!N390)","v":"O"}]
[{"$f":"Schema!A391&Schema!B391&Schema!C391&Schema!D391","v":"COLFACT"},"KA",{"$f":"IF(A385=\"\",\"\",IF(LEN(Schema!A391)=2,1,IF(LEN(Schema!B391)=2,10,IF(LEN(Schema!C391)=2,100,0))))","v":0},10,{"$f":"IF(A385=\"\",\"\",SUM(Tabel2[[#This Row],[I1]:[I2]]))","v":10},{"$error":"#REF!"},"KA","",{"$error":"#REF!"},{"$f":"IF(C385=\"\",\"\",IF(LEN(Tabel2[[#This Row],[Entiteit of attribuut]])=2,\"\",Tabel2[[#This Row],[Entiteit]]&\"_\"&Tabel2[[#This Row],[Entiteit of attribuut]]))","v":"KA_COLFACT"},{"$f":"IF(Schema!I391=\"\",\"\",Schema!I391)","v":""},{"$f":"IF(Schema!J391=\"\",\"\",Schema!J391)","v":""},{"$f":"IF(Schema!K391=\"\",\"\",Schema!K391)","v":""},{"$f":"IF(Schema!L391=\"\",\"\",Schema!L391)","v":""},{"$f":"IF(Schema!N391=\"\",\"\",Schema!N391)","v":"O"}]
[{"$f":"Schema!A392&Schema!B392&Schema!C392&Schema!D392","v":"ERB"},"KA",{"$f":"IF(A386=\"\",\"\",IF(LEN(Schema!A392)=2,1,IF(LEN(Schema!B392)=2,10,IF(LEN(Schema!C392)=2,100,0))))","v":0},10,{"$f":"IF(A386=\"\",\"\",SUM(Tabel2[[#This Row],[I1]:[I2]]))","v":10},{"$error":"#REF!"},"KA","",{"$error":"#REF!"},{"$f":"IF(C386=\"\",\"\",IF(LEN(Tabel2[[#This Row],[Entiteit of attribuut]])=2,\"\",Tabel2[[#This Row],[Entiteit]]&\"_\"&Tabel2[[#This Row],[Entiteit of attribuut]]))","v":"KA_ERB"},{"$f":"IF(Schema!I392=\"\",\"\",Schema!I392)","v":""},{"$f":"IF(Schema!J392=\"\",\"\",Schema!J392)","v":""},{"$f":"IF(Schema!K392=\"\",\"\",Schema!K392)","v":""},{"$f":"IF(Schema!L392=\"\",\"\",Schema!L392)","v":""},{"$f":"IF(Schema!N392=\"\",\"\",Schema!N392)","v":"O"}]
[{"$f":"Schema!A393&Schema!B393&Schema!C393&Schema!D393","v":"GADEKCD"},{"$f":"IF(LEN(A387)=2,A387,IF(A387=\"\",\"Leeg\",B386))","v":"KA"},{"$f":"IF(A387=\"\",\"\",IF(LEN(Schema!A393)=2,1,IF(LEN(Schema!B393)=2,10,IF(LEN(Schema!C393)=2,100,0))))","v":0},{"$f":"IF(C387=0,D386,C387)","v":10},{"$f":"IF(A387=\"\",\"\",SUM(Tabel2[[#This Row],[I1]:[I2]]))","v":10},{"$f":"IF(A387=\"\",\"\",IF(C387=1,B387,F386))","v":{"$error":"#REF!"}},{"$f":"IF(C387=10,A387,IF(OR(C387=0,C387=100),G386,\"\"))","v":"KA"},{"$f":"IF(E387=200,B387,IF(C387=0,H386,\"\"))","v":""},{"$f":"IF(C387=\"\",\"\",IF(OR(E387=1,E387=10,E387=100),I386,IF(E387=2,F387,IF(E387=20,F387&\"/\"&G387,IF(E387=200,F387&\"/\"&G387&\"/\"&H387)))))","v":{"$error":"#REF!"}},{"$f":"IF(C387=\"\",\"\",IF(LEN(Tabel2[[#This Row],[Entiteit of attribuut]])=2,\"\",Tabel2[[#This Row],[Entiteit]]&\"_\"&Tabel2[[#This Row],[Entiteit of attribuut]]))","v":"KA_GADEKCD"},{"$f":"IF(Schema!I393=\"\",\"\",Schema!I393)","v":""},{"$f":"IF(Schema!J393=\"\",\"\",Schema!J393)","v":""},{"$f":"IF(Schema!K393=\"\",\"\",Schema!K393)","v":""},{"$f":"IF(Schema!L393=\"\",\"\",Schema!L393)","v":""},{"$f":"IF(Schema!N393=\"\",\"\",Schema!N393)","v":"V"}]
[{"$f":"Schema!A394&Schema!B394&Schema!C394&Schema!D394","v":"GADEKCO"},"KA",{"$f":"IF(A388=\"\",\"\",IF(LEN(Schema!A394)=2,1,IF(LEN(Schema!B394)=2,10,IF(LEN(Schema!C394)=2,100,0))))","v":0},10,{"$f":"IF(A388=\"\",\"\",SUM(Tabel2[[#This Row],[I1]:[I2]]))","v":10},{"$error":"#REF!"},"KA","",{"$error":"#REF!"},{"$f":"IF(C388=\"\",\"\",IF(LEN(Tabel2[[#This Row],[Entiteit of attribuut]])=2,\"\",Tabel2[[#This Row],[Entiteit]]&\"_\"&Tabel2[[#This Row],[Entiteit of attribuut]]))","v":"KA_GADEKCO"},{"$f":"IF(Schema!I394=\"\",\"\",Schema!I394)","v":""},{"$f":"IF(Schema!J394=\"\",\"\",Schema!J394)","v":""},{"$f":"IF(Schema!K394=\"\",\"\",Schema!K394)","v":""},{"$f":"IF(Schema!L394=\"\",\"\",Schema!L394)","v":""},{"$f":"IF(Schema!N394=\"\",\"\",Schema!N394)","v":"V"}]
[{"$f":"Schema!A395&Schema!B395&Schema!C395&Schema!D395","v":"MYCODE"},"KA",{"$f":"IF(A389=\"\",\"\",IF(LEN(Schema!A395)=2,1,IF(LEN(Schema!B395)=2,10,IF(LEN(Schema!C395)=2,100,0))))","v":0},10,{"$f":"IF(A389=\"\",\"\",SUM(Tabel2[[#This Row],[I1]:[I2]]))","v":10},{"$error":"#REF!"},"KA","",{"$error":"#REF!"},{"$f":"IF(C389=\"\",\"\",IF(LEN(Tabel2[[#This Row],[Entiteit of attribuut]])=2,\"\",Tabel2[[#This Row],[Entiteit]]&\"_\"&Tabel2[[#This Row],[Entiteit of attribuut]]))","v":"KA_MYCODE"},{"$f":"IF(Schema!I395=\"\",\"\",Schema!I395)","v":""},{"$f":"IF(Schema!J395=\"\",\"\",Schema!J395)","v":""},{"$f":"IF(Schema!K395=\"\",\"\",Schema!K395)","v":""},{"$f":"IF(Schema!L395=\"\",\"\",Schema!L395)","v":""},{"$f":"IF(Schema!N395=\"\",\"\",Schema!N395)","v":"O"}]
[{"$f":"Schema!A396&Schema!B396&Schema!C396&Schema!D396","v":"NJP"},"KA",{"$f":"IF(A390=\"\",\"\",IF(LEN(Schema!A396)=2,1,IF(LEN(Schema!B396)=2,10,IF(LEN(Schema!C396)=2,100,0))))","v":0},10,{"$f":"IF(A390=\"\",\"\",SUM(Tabel2[[#This Row],[I1]:[I2]]))","v":10},{"$error":"#REF!"},"KA","",{"$error":"#REF!"},{"$f":"IF(C390=\"\",\"\",IF(LEN(Tabel2[[#This Row],[Entiteit of attribuut]])=2,\"\",Tabel2[[#This Row],[Entiteit]]&\"_\"&Tabel2[[#This Row],[Entiteit of attribuut]]))","v":"KA_NJP"},{"$f":"IF(Schema!I396=\"\",\"\",Schema!I396)","v":""},{"$f":"IF(Schema!J396=\"\",\"\",Schema!J396)","v":""},{"$f":"IF(Schema!K396=\"\",\"\",Schema!K396)","v":""},{"$f":"IF(Schema!L396=\"\",\"\",Schema!L396)","v":""},{"$f":"IF(Schema!N396=\"\",\"\",Schema!N396)","v":"O"}]
[{"$f":"Schema!A397&Schema!B397&Schema!C397&Schema!D397","v":"PAFWST"},"KA",{"$f":"IF(A391=\"\",\"\",IF(LEN(Schema!A397)=2,1,IF(LEN(Schema!B397)=2,10,IF(LEN(Schema!C397)=2,100,0))))","v":0},10,{"$f":"IF(A391=\"\",\"\",SUM(Tabel2[[#This Row],[I1]:[I2]]))","v":10},{"$error":"#REF!"},"KA","",{"$error":"#REF!"},{"$f":"IF(C391=\"\",\"\",IF(LEN(Tabel2[[#This Row],[Entiteit of attribuut]])=2,\"\",Tabel2[[#This Row],[Entiteit]]&\"_\"&Tabel2[[#This Row],[Entiteit of attribuut]]))","v":"KA_PAFWST"},{"$f":"IF(Schema!I397=\"\",\"\",Schema!I397)","v":""},{"$f":"IF(Schema!J397=\"\",\"\",Schema!J397)","v":""},{"$f":"IF(Schema!K397=\"\",\"\",Schema!K397)","v":""},{"$f":"IF(Schema!L397=\"\",\"\",Schema!L397)","v":""},{"$f":"IF(Schema!N397=\"\",\"\",Schema!N397)","v":"O"}]
[{"$f":"Schema!A398&Schema!B398&Schema!C398&Schema!D398","v":"PPRC"},"KA",{"$f":"IF(A392=\"\",\"\",IF(LEN(Schema!A398)=2,1,IF(LEN(Schema!B398)=2,10,IF(LEN(Schema!C398)=2,100,0))))","v":0},10,{"$f":"IF(A392=\"\",\"\",SUM(Tabel2[[#This Row],[I1]:[I2]]))","v":10},{"$error":"#REF!"},"KA","",{"$error":"#REF!"},{"$f":"IF(C392=\"\",\"\",IF(LEN(Tabel2[[#This Row],[Entiteit of attribuut]])=2,\"\",Tabel2[[#This Row],[Entiteit]]&\"_\"&Tabel2[[#This Row],[Entiteit of attribuut]]))","v":"KA_PPRC"},{"$f":"IF(Schema!I398=\"\",\"\",Schema!I398)","v":""},{"$f":"IF(Schema!J398=\"\",\"\",Schema!J398)","v":""},{"$f":"IF(Schema!K398=\"\",\"\",Schema!K398)","v":""},{"$f":"IF(Schema!L398=\"\",\"\",Schema!L398)","v":""},{"$f":"IF(Schema!N398=\"\",\"\",Schema!N398)","v":"O"}]
[{"$f":"Schema!A399&Schema!B399&Schema!C399&Schema!D399","v":"PRCPKKT"},"KA",{"$f":"IF(A393=\"\",\"\",IF(LEN(Schema!A399)=2,1,IF(LEN(Schema!B399)=2,10,IF(LEN(Schema!C399)=2,100,0))))","v":0},10,{"$f":"IF(A393=\"\",\"\",SUM(Tabel2[[#This Row],[I1]:[I2]]))","v":10},{"$error":"#REF!"},"KA","",{"$error":"#REF!"},{"$f":"IF(C393=\"\",\"\",IF(LEN(Tabel2[[#This Row],[Entiteit of attribuut]])=2,\"\",Tabel2[[#This Row],[Entiteit]]&\"_\"&Tabel2[[#This Row],[Entiteit of attribuut]]))","v":"KA_PRCPKKT"},{"$f":"IF(Schema!I399=\"\",\"\",Schema!I399)","v":""},{"$f":"IF(Schema!J399=\"\",\"\",Schema!J399)","v":""},{"$f":"IF(Schema!K399=\"\",\"\",Schema!K399)","v":""},{"$f":"IF(Schema!L399=\"\",\"\",Schema!L399)","v":""},{"$f":"IF(Schema!N399=\"\",\"\",Schema!N399)","v":"O"}]
[{"$f":"Schema!A400&Schema!B400&Schema!C400&Schema!D400","v":"PRCTEKC"},"KA",{"$f":"IF(A394=\"\",\"\",IF(LEN(Schema!A400)=2,1,IF(LEN(Schema!B400)=2,10,IF(LEN(Schema!C400)=2,100,0))))","v":0},10,{"$f":"IF(A394=\"\",\"\",SUM(Tabel2[[#This Row],[I1]:[I2]]))","v":10},{"$error":"#REF!"},"KA","",{"$error":"#REF!"},{"$f":"IF(C394=\"\",\"\",IF(LEN(Tabel2[[#This Row],[Entiteit of attribuut]])=2,\"\",Tabel2[[#This Row],[Entiteit]]&\"_\"&Tabel2[[#This Row],[Entiteit of attribuut]]))","v":"KA_PRCTEKC"},{"$f":"IF(Schema!I400=\"\",\"\",Schema!I400)","v":""},{"$f":"IF(Schema!J400=\"\",\"\",Schema!J400)","v":""},{"$f":"IF(Schema!K400=\"\",\"\",Schema!K400)","v":""},{"$f":"IF(Schema!L400=\"\",\"\",Schema!L400)","v":""},{"$f":"IF(Schema!N400=\"\",\"\",Schema!N400)","v":"O"}]
[{"$f":"Schema!A401&Schema!B401&Schema!C401&Schema!D401","v":"RELVRH"},"KA",{"$f":"IF(A395=\"\",\"\",IF(LEN(Schema!A401)=2,1,IF(LEN(Schema!B401)=2,10,IF(LEN(Schema!C401)=2,100,0))))","v":0},10,{"$f":"IF(A395=\"\",\"\",SUM(Tabel2[[#This Row],[I1]:[I2]]))","v":10},{"$error":"#REF!"},"KA","",{"$error":"#REF!"},{"$f":"IF(C395=\"\",\"\",IF(LEN(Tabel2[[#This Row],[Entiteit of attribuut]])=2,\"\",Tabel2[[#This Row],[Entiteit]]&\"_\"&Tabel2[[#This Row],[Entiteit of attribuut]]))","v":"KA_RELVRH"},{"$f":"IF(Schema!I401=\"\",\"\",Schema!I401)","v":""},{"$f":"IF(Schema!J401=\"\",\"\",Schema!J401)","v":""},{"$f":"IF(Schema!K401=\"\",\"\",Schema!K401)","v":""},{"$f":"IF(Schema!L401=\"\",\"\",Schema!L401)","v":""},{"$f":"IF(Schema!N401=\"\",\"\",Schema!N401)","v":"O"}]
[{"$f":"Schema!A402&Schema!B402&Schema!C402&Schema!D402","v":"RELVVNR"},"KA",{"$f":"IF(A396=\"\",\"\",IF(LEN(Schema!A402)=2,1,IF(LEN(Schema!B402)=2,10,IF(LEN(Schema!C402)=2,100,0))))","v":0},10,{"$f":"IF(A396=\"\",\"\",SUM(Tabel2[[#This Row],[I1]:[I2]]))","v":10},{"$error":"#REF!"},"KA","",{"$error":"#REF!"},{"$f":"IF(C396=\"\",\"\",IF(LEN(Tabel2[[#This Row],[Entiteit of attribuut]])=2,\"\",Tabel2[[#This Row],[Entiteit]]&\"_\"&Tabel2[[#This Row],[Entiteit of attribuut]]))","v":"KA_RELVVNR"},{"$f":"IF(Schema!I402=\"\",\"\",Schema!I402)","v":""},{"$f":"IF(Schema!J402=\"\",\"\",Schema!J402)","v":""},{"$f":"IF(Schema!K402=\"\",\"\",Schema!K402)","v":""},{"$f":"IF(Schema!L402=\"\",\"\",Schema!L402)","v":""},{"$f":"IF(Schema!N402=\"\",\"\",Schema!N402)","v":"O"}]
[{"$f":"Schema!A403&Schema!B403&Schema!C403&Schema!D403","v":"RJRCOR"},"KA",{"$f":"IF(A397=\"\",\"\",IF(LEN(Schema!A403)=2,1,IF(LEN(Schema!B403)=2,10,IF(LEN(Schema!C403)=2,100,0))))","v":0},10,{"$f":"IF(A397=\"\",\"\",SUM(Tabel2[[#This Row],[I1]:[I2]]))","v":10},{"$error":"#REF!"},"KA","",{"$error":"#REF!"},{"$f":"IF(C397=\"\",\"\",IF(LEN(Tabel2[[#This Row],[Entiteit of attribuut]])=2,\"\",Tabel2[[#This Row],[Entiteit]]&\"_\"&Tabel2[[#This Row],[Entiteit of attribuut]]))","v":"KA_RJRCOR"},{"$f":"IF(Schema!I403=\"\",\"\",Schema!I403)","v":""},{"$f":"IF(Schema!J403=\"\",\"\",Schema!J403)","v":""},{"$f":"IF(Schema!K403=\"\",\"\",Schema!K403)","v":""},{"$f":"IF(Schema!L403=\"\",\"\",Schema!L403)","v":""},{"$f":"IF(Schema!N403=\"\",\"\",Schema!N403)","v":"O"}]
[{"$f":"Schema!A404&Schema!B404&Schema!C404&Schema!D404","v":"TCORBDR"},"KA",{"$f":"IF(A398=\"\",\"\",IF(LEN(Schema!A404)=2,1,IF(LEN(Schema!B404)=2,10,IF(LEN(Schema!C404)=2,100,0))))","v":0},10,{"$f":"IF(A398=\"\",\"\",SUM(Tabel2[[#This Row],[I1]:[I2]]))","v":10},{"$error":"#REF!"},"KA","",{"$error":"#REF!"},{"$f":"IF(C398=\"\",\"\",IF(LEN(Tabel2[[#This Row],[Entiteit of attribuut]])=2,\"\",Tabel2[[#This Row],[Entiteit]]&\"_\"&Tabel2[[#This Row],[Entiteit of attribuut]]))","v":"KA_TCORBDR"},{"$f":"IF(Schema!I404=\"\",\"\",Schema!I404)","v":""},{"$f":"IF(Schema!J404=\"\",\"\",Schema!J404)","v":""},{"$f":"IF(Schema!K404=\"\",\"\",Schema!K404)","v":""},{"$f":"IF(Schema!L404=\"\",\"\",Schema!L404)","v":""},{"$f":"IF(Schema!N404=\"\",\"\",Schema!N404)","v":"O"}]
[{"$f":"Schema!A405&Schema!B405&Schema!C405&Schema!D405","v":"VERZSOM"},"KA",{"$f":"IF(A399=\"\",\"\",IF(LEN(Schema!A405)=2,1,IF(LEN(Schema!B405)=2,10,IF(LEN(Schema!C405)=2,100,0))))","v":0},10,{"$f":"IF(A399=\"\",\"\",SUM(Tabel2[[#This Row],[I1]:[I2]]))","v":10},{"$error":"#REF!"},"KA","",{"$error":"#REF!"},{"$f":"IF(C399=\"\",\"\",IF(LEN(Tabel2[[#This Row],[Entiteit of attribuut]])=2,\"\",Tabel2[[#This Row],[Entiteit]]&\"_\"&Tabel2[[#This Row],[Entiteit of attribuut]]))","v":"KA_VERZSOM"},{"$f":"IF(Schema!I405=\"\",\"\",Schema!I405)","v":""},{"$f":"IF(Schema!J405=\"\",\"\",Schema!J405)","v":""},{"$f":"IF(Schema!K405=\"\",\"\",Schema!K405)","v":""},{"$f":"IF(Schema!L405=\"\",\"\",Schema!L405)","v":""},{"$f":"IF(Schema!N405=\"\",\"\",Schema!N405)","v":"O"}]
[{"$f":"Schema!A406&Schema!B406&Schema!C406&Schema!D406","v":"VGBRA"},"KA",{"$f":"IF(A400=\"\",\"\",IF(LEN(Schema!A406)=2,1,IF(LEN(Schema!B406)=2,10,IF(LEN(Schema!C406)=2,100,0))))","v":0},10,{"$f":"IF(A400=\"\",\"\",SUM(Tabel2[[#This Row],[I1]:[I2]]))","v":10},{"$error":"#REF!"},"KA","",{"$error":"#REF!"},{"$f":"IF(C400=\"\",\"\",IF(LEN(Tabel2[[#This Row],[Entiteit of attribuut]])=2,\"\",Tabel2[[#This Row],[Entiteit]]&\"_\"&Tabel2[[#This Row],[Entiteit of attribuut]]))","v":"KA_VGBRA"},{"$f":"IF(Schema!I406=\"\",\"\",Schema!I406)","v":""},{"$f":"IF(Schema!J406=\"\",\"\",Schema!J406)","v":""},{"$f":"IF(Schema!K406=\"\",\"\",Schema!K406)","v":""},{"$f":"IF(Schema!L406=\"\",\"\",Schema!L406)","v":""},{"$f":"IF(Schema!N406=\"\",\"\",Schema!N406)","v":"O"}]
[{"$f":"Schema!A407&Schema!B407&Schema!C407&Schema!D407","v":"VOLGNUM"},"KA",{"$f":"IF(A401=\"\",\"\",IF(LEN(Schema!A407)=2,1,IF(LEN(Schema!B407)=2,10,IF(LEN(Schema!C407)=2,100,0))))","v":0},10,{"$f":"IF(A401=\"\",\"\",SUM(Tabel2[[#This Row],[I1]:[I2]]))","v":10},{"$error":"#REF!"},"KA","",{"$error":"#REF!"},{"$f":"IF(C401=\"\",\"\",IF(LEN(Tabel2[[#This Row],[Entiteit of attribuut]])=2,\"\",Tabel2[[#This Row],[Entiteit]]&\"_\"&Tabel2[[#This Row],[Entiteit of attribuut]]))","v":"KA_VOLGNUM"},{"$f":"IF(Schema!I407=\"\",\"\",Schema!I407)","v":""},{"$f":"IF(Schema!J407=\"\",\"\",Schema!J407)","v":""},{"$f":"IF(Schema!K407=\"\",\"\",Schema!K407)","v":""},{"$f":"IF(Schema!L407=\"\",\"\",Schema!L407)","v":""},{"$f":"IF(Schema!N407=\"\",\"\",Schema!N407)","v":"LEEG"}]
[{"$f":"Schema!A408&Schema!B408&Schema!C408&Schema!D408","v":"VRWRKCD"},"KA",{"$f":"IF(A402=\"\",\"\",IF(LEN(Schema!A408)=2,1,IF(LEN(Schema!B408)=2,10,IF(LEN(Schema!C408)=2,100,0))))","v":0},10,{"$f":"IF(A402=\"\",\"\",SUM(Tabel2[[#This Row],[I1]:[I2]]))","v":10},{"$error":"#REF!"},"KA","",{"$error":"#REF!"},{"$f":"IF(C402=\"\",\"\",IF(LEN(Tabel2[[#This Row],[Entiteit of attribuut]])=2,\"\",Tabel2[[#This Row],[Entiteit]]&\"_\"&Tabel2[[#This Row],[Entiteit of attribuut]]))","v":"KA_VRWRKCD"},{"$f":"IF(Schema!I408=\"\",\"\",Schema!I408)","v":""},{"$f":"IF(Schema!J408=\"\",\"\",Schema!J408)","v":""},{"$f":"IF(Schema!K408=\"\",\"\",Schema!K408)","v":""},{"$f":"IF(Schema!L408=\"\",\"\",Schema!L408)","v":""},{"$f":"IF(Schema!N408=\"\",\"\",Schema!N408)","v":"LEEG"}]
[{"$f":"Schema!A409&Schema!B409&Schema!C409&Schema!D409","v":"WPREMBP"},"KA",{"$f":"IF(A403=\"\",\"\",IF(LEN(Schema!A409)=2,1,IF(LEN(Schema!B409)=2,10,IF(LEN(Schema!C409)=2,100,0))))","v":0},10,{"$f":"IF(A403=\"\",\"\",SUM(Tabel2[[#This Row],[I1]:[I2]]))","v":10},{"$error":"#REF!"},"KA","",{"$error":"#REF!"},{"$f":"IF(C403=\"\",\"\",IF(LEN(Tabel2[[#This Row],[Entiteit of attribuut]])=2,\"\",Tabel2[[#This Row],[Entiteit]]&\"_\"&Tabel2[[#This Row],[Entiteit of attribuut]]))","v":"KA_WPREMBP"},{"$f":"IF(Schema!I409=\"\",\"\",Schema!I409)","v":""},{"$f":"IF(Schema!J409=\"\",\"\",Schema!J409)","v":""},{"$f":"IF(Schema!K409=\"\",\"\",Schema!K409)","v":""},{"$f":"IF(Schema!L409=\"\",\"\",Schema!L409)","v":""},{"$f":"IF(Schema!N409=\"\",\"\",Schema!N409)","v":"O"}]
[{"$f":"Schema!A410&Schema!B410&Schema!C410&Schema!D410","v":"MP"},"MP",{"$f":"IF(A404=\"\",\"\",IF(LEN(Schema!A410)=2,1,IF(LEN(Schema!B410)=2,10,IF(LEN(Schema!C410)=2,100,0))))","v":100},100,{"$f":"IF(A404=\"\",\"\",SUM(Tabel2[[#This Row],[I1]:[I2]]))","v":200},{"$error":"#REF!"},"KA","MP",{"$error":"#REF!"},{"$f":"IF(C404=\"\",\"\",IF(LEN(Tabel2[[#This Row],[Entiteit of attribuut]])=2,\"\",Tabel2[[#This Row],[Entiteit]]&\"_\"&Tabel2[[#This Row],[Entiteit of attribuut]]))","v":""},{"$f":"IF(Schema!I410=\"\",\"\",Schema!I410)","v":""},{"$f":"IF(Schema!J410=\"\",\"\",Schema!J410)","v":""},{"$f":"IF(Schema!K410=\"\",\"\",Schema!K410)","v":""},{"$f":"IF(Schema!L410=\"\",\"\",Schema!L410)","v":""},{"$f":"IF(Schema!N410=\"\",\"\",Schema!N410)","v":"O"}]
[{"$f":"Schema!A411&Schema!B411&Schema!C411&Schema!D411","v":"MYAAND"},"MP",{"$f":"IF(A405=\"\",\"\",IF(LEN(Schema!A411)=2,1,IF(LEN(Schema!B411)=2,10,IF(LEN(Schema!C411)=2,100,0))))","v":0},100,{"$f":"IF(A405=\"\",\"\",SUM(Tabel2[[#This Row],[I1]:[I2]]))","v":100},{"$error":"#REF!"},"KA","MP",{"$error":"#REF!"},{"$f":"IF(C405=\"\",\"\",IF(LEN(Tabel2[[#This Row],[Entiteit of attribuut]])=2,\"\",Tabel2[[#This Row],[Entiteit]]&\"_\"&Tabel2[[#This Row],[Entiteit of attribuut]]))","v":"MP_MYAAND"},{"$f":"IF(Schema!I411=\"\",\"\",Schema!I411)","v":""},{"$f":"IF(Schema!J411=\"\",\"\",Schema!J411)","v":""},{"$f":"IF(Schema!K411=\"\",\"\",Schema!K411)","v":""},{"$f":"IF(Schema!L411=\"\",\"\",Schema!L411)","v":""},{"$f":"IF(Schema!N411=\"\",\"\",Schema!N411)","v":"O"}]
[{"$f":"Schema!A412&Schema!B412&Schema!C412&Schema!D412","v":"PLLEAD"},"MP",{"$f":"IF(A406=\"\",\"\",IF(LEN(Schema!A412)=2,1,IF(LEN(Schema!B412)=2,10,IF(LEN(Schema!C412)=2,100,0))))","v":0},100,{"$f":"IF(A406=\"\",\"\",SUM(Tabel2[[#This Row],[I1]:[I2]]))","v":100},{"$error":"#REF!"},"KA","MP",{"$error":"#REF!"},{"$f":"IF(C406=\"\",\"\",IF(LEN(Tabel2[[#This Row],[Entiteit of attribuut]])=2,\"\",Tabel2[[#This Row],[Entiteit]]&\"_\"&Tabel2[[#This Row],[Entiteit of attribuut]]))","v":"MP_PLLEAD"},{"$f":"IF(Schema!I412=\"\",\"\",Schema!I412)","v":""},{"$f":"IF(Schema!J412=\"\",\"\",Schema!J412)","v":""},{"$f":"IF(Schema!K412=\"\",\"\",Schema!K412)","v":""},{"$f":"IF(Schema!L412=\"\",\"\",Schema!L412)","v":""},{"$f":"IF(Schema!N412=\"\",\"\",Schema!N412)","v":"O"}]
[{"$f":"Schema!A413&Schema!B413&Schema!C413&Schema!D413","v":"POOLNUM"},"MP",{"$f":"IF(A407=\"\",\"\",IF(LEN(Schema!A413)=2,1,IF(LEN(Schema!B413)=2,10,IF(LEN(Schema!C413)=2,100,0))))","v":0},100,{"$f":"IF(A407=\"\",\"\",SUM(Tabel2[[#This Row],[I1]:[I2]]))","v":100},{"$error":"#REF!"},"KA","MP",{"$error":"#REF!"},{"$f":"IF(C407=\"\",\"\",IF(LEN(Tabel2[[#This Row],[Entiteit of attribuut]])=2,\"\",Tabel2[[#This Row],[Entiteit]]&\"_\"&Tabel2[[#This Row],[Entiteit of attribuut]]))","v":"MP_POOLNUM"},{"$f":"IF(Schema!I413=\"\",\"\",Schema!I413)","v":""},{"$f":"IF(Schema!J413=\"\",\"\",Schema!J413)","v":""},{"$f":"IF(Schema!K413=\"\",\"\",Schema!K413)","v":""},{"$f":"IF(Schema!L413=\"\",\"\",Schema!L413)","v":""},{"$f":"IF(Schema!N413=\"\",\"\",Schema!N413)","v":"V"}]
[{"$f":"Schema!A414&Schema!B414&Schema!C414&Schema!D414","v":"POOLPRC"},"MP",{"$f":"IF(A408=\"\",\"\",IF(LEN(Schema!A414)=2,1,IF(LEN(Schema!B414)=2,10,IF(LEN(Schema!C414)=2,100,0))))","v":0},100,{"$f":"IF(A408=\"\",\"\",SUM(Tabel2[[#This Row],[I1]:[I2]]))","v":100},{"$error":"#REF!"},"KA","MP",{"$error":"#REF!"},{"$f":"IF(C408=\"\",\"\",IF(LEN(Tabel2[[#This Row],[Entiteit of attribuut]])=2,\"\",Tabel2[[#This Row],[Entiteit]]&\"_\"&Tabel2[[#This Row],[Entiteit of attribuut]]))","v":"MP_POOLPRC"},{"$f":"IF(Schema!I414=\"\",\"\",Schema!I414)","v":""},{"$f":"IF(Schema!J414=\"\",\"\",Schema!J414)","v":""},{"$f":"IF(Schema!K414=\"\",\"\",Schema!K414)","v":""},{"$f":"IF(Schema!L414=\"\",\"\",Schema!L414)","v":""},{"$f":"IF(Schema!N414=\"\",\"\",Schema!N414)","v":"V"}]
[{"$f":"Schema!A415&Schema!B415&Schema!C415&Schema!D415","v":"LS"},"LS",{"$f":"IF(A409=\"\",\"\",IF(LEN(Schema!A415)=2,1,IF(LEN(Schema!B415)=2,10,IF(LEN(Schema!C415)=2,100,0))))","v":10},10,{"$f":"IF(A409=\"\",\"\",SUM(Tabel2[[#This Row],[I1]:[I2]]))","v":20},{"$error":"#REF!"},"LS","",{"$error":"#REF!"},{"$f":"IF(C409=\"\",\"\",IF(LEN(Tabel2[[#This Row],[Entiteit of attribuut]])=2,\"\",Tabel2[[#This Row],[Entiteit]]&\"_\"&Tabel2[[#This Row],[Entiteit of attribuut]]))","v":""},{"$f":"IF(Schema!I415=\"\",\"\",Schema!I415)","v":""},{"$f":"IF(Schema!J415=\"\",\"\",Schema!J415)","v":""},{"$f":"IF(Schema!K415=\"\",\"\",Schema!K415)","v":""},{"$f":"IF(Schema!L415=\"\",\"\",Schema!L415)","v":""},{"$f":"IF(Schema!N415=\"\",\"\",Schema!N415)","v":"O"}]
[{"$f":"Schema!A416&Schema!B416&Schema!C416&Schema!D416","v":"BAFWST"},"LS",{"$f":"IF(A410=\"\",\"\",IF(LEN(Schema!A416)=2,1,IF(LEN(Schema!B416)=2,10,IF(LEN(Schema!C416)=2,100,0))))","v":0},10,{"$f":"IF(A410=\"\",\"\",SUM(Tabel2[[#This Row],[I1]:[I2]]))","v":10},{"$error":"#REF!"},"LS","",{"$error":"#REF!"},{"$f":"IF(C410=\"\",\"\",IF(LEN(Tabel2[[#This Row],[Entiteit of attribuut]])=2,\"\",Tabel2[[#This Row],[Entiteit]]&\"_\"&Tabel2[[#This Row],[Entiteit of attribuut]]))","v":"LS_BAFWST"},{"$f":"IF(Schema!I416=\"\",\"\",Schema!I416)","v":""},{"$f":"IF(Schema!J416=\"\",\"\",Schema!J416)","v":""},{"$f":"IF(Schema!K416=\"\",\"\",Schema!K416)","v":""},{"$f":"IF(Schema!L416=\"\",\"\",Schema!L416)","v":""},{"$f":"IF(Schema!N416=\"\",\"\",Schema!N416)","v":"O"}]
[{"$f":"Schema!A417&Schema!B417&Schema!C417&Schema!D417","v":"BTP"},"LS",{"$f":"IF(A411=\"\",\"\",IF(LEN(Schema!A417)=2,1,IF(LEN(Schema!B417)=2,10,IF(LEN(Schema!C417)=2,100,0))))","v":0},10,{"$f":"IF(A411=\"\",\"\",SUM(Tabel2[[#This Row],[I1]:[I2]]))","v":10},{"$error":"#REF!"},"LS","",{"$error":"#REF!"},{"$f":"IF(C411=\"\",\"\",IF(LEN(Tabel2[[#This Row],[Entiteit of attribuut]])=2,\"\",Tabel2[[#This Row],[Entiteit]]&\"_\"&Tabel2[[#This Row],[Entiteit of attribuut]]))","v":"LS_BTP"},{"$f":"IF(Schema!I417=\"\",\"\",Schema!I417)","v":""},{"$f":"IF(Schema!J417=\"\",\"\",Schema!J417)","v":""},{"$f":"IF(Schema!K417=\"\",\"\",Schema!K417)","v":""},{"$f":"IF(Schema!L417=\"\",\"\",Schema!L417)","v":""},{"$f":"IF(Schema!N417=\"\",\"\",Schema!N417)","v":"LEEG"}]
[{"$f":"Schema!A418&Schema!B418&Schema!C418&Schema!D418","v":"CODE"},"LS",{"$f":"IF(A412=\"\",\"\",IF(LEN(Schema!A418)=2,1,IF(LEN(Schema!B418)=2,10,IF(LEN(Schema!C418)=2,100,0))))","v":0},10,{"$f":"IF(A412=\"\",\"\",SUM(Tabel2[[#This Row],[I1]:[I2]]))","v":10},{"$error":"#REF!"},"LS","",{"$error":"#REF!"},{"$f":"IF(C412=\"\",\"\",IF(LEN(Tabel2[[#This Row],[Entiteit of attribuut]])=2,\"\",Tabel2[[#This Row],[Entiteit]]&\"_\"&Tabel2[[#This Row],[Entiteit of attribuut]]))","v":"LS_CODE"},{"$f":"IF(Schema!I418=\"\",\"\",Schema!I418)","v":""},{"$f":"IF(Schema!J418=\"\",\"\",Schema!J418)","v":""},{"$f":"IF(Schema!K418=\"\",\"\",Schema!K418)","v":""},{"$f":"IF(Schema!L418=\"\",\"\",Schema!L418)","v":""},{"$f":"IF(Schema!N418=\"\",\"\",Schema!N418)","v":"O"}]
[{"$f":"Schema!A419&Schema!B419&Schema!C419&Schema!D419","v":"COLFACT"},"LS",{"$f":"IF(A413=\"\",\"\",IF(LEN(Schema!A419)=2,1,IF(LEN(Schema!B419)=2,10,IF(LEN(Schema!C419)=2,100,0))))","v":0},10,{"$f":"IF(A413=\"\",\"\",SUM(Tabel2[[#This Row],[I1]:[I2]]))","v":10},{"$error":"#REF!"},"LS","",{"$error":"#REF!"},{"$f":"IF(C413=\"\",\"\",IF(LEN(Tabel2[[#This Row],[Entiteit of attribuut]])=2,\"\",Tabel2[[#This Row],[Entiteit]]&\"_\"&Tabel2[[#This Row],[Entiteit of attribuut]]))","v":"LS_COLFACT"},{"$f":"IF(Schema!I419=\"\",\"\",Schema!I419)","v":""},{"$f":"IF(Schema!J419=\"\",\"\",Schema!J419)","v":""},{"$f":"IF(Schema!K419=\"\",\"\",Schema!K419)","v":""},{"$f":"IF(Schema!L419=\"\",\"\",Schema!L419)","v":""},{"$f":"IF(Schema!N419=\"\",\"\",Schema!N419)","v":"O"}]
[{"$f":"Schema!A420&Schema!B420&Schema!C420&Schema!D420","v":"ERB"},"LS",{"$f":"IF(A414=\"\",\"\",IF(LEN(Schema!A420)=2,1,IF(LEN(Schema!B420)=2,10,IF(LEN(Schema!C420)=2,100,0))))","v":0},10,{"$f":"IF(A414=\"\",\"\",SUM(Tabel2[[#This Row],[I1]:[I2]]))","v":10},{"$error":"#REF!"},"LS","",{"$error":"#REF!"},{"$f":"IF(C414=\"\",\"\",IF(LEN(Tabel2[[#This Row],[Entiteit of attribuut]])=2,\"\",Tabel2[[#This Row],[Entiteit]]&\"_\"&Tabel2[[#This Row],[Entiteit of attribuut]]))","v":"LS_ERB"},{"$f":"IF(Schema!I420=\"\",\"\",Schema!I420)","v":""},{"$f":"IF(Schema!J420=\"\",\"\",Schema!J420)","v":""},{"$f":"IF(Schema!K420=\"\",\"\",Schema!K420)","v":""},{"$f":"IF(Schema!L420=\"\",\"\",Schema!L420)","v":""},{"$f":"IF(Schema!N420=\"\",\"\",Schema!N420)","v":"O"}]
[{"$f":"Schema!A421&Schema!B421&Schema!C421&Schema!D421","v":"GADEKCD"},"LS",{"$f":"IF(A415=\"\",\"\",IF(LEN(Schema!A421)=2,1,IF(LEN(Schema!B421)=2,10,IF(LEN(Schema!C421)=2,100,0))))","v":0},10,{"$f":"IF(A415=\"\",\"\",SUM(Tabel2[[#This Row],[I1]:[I2]]))","v":10},{"$error":"#REF!"},"LS","",{"$error":"#REF!"},{"$f":"IF(C415=\"\",\"\",IF(LEN(Tabel2[[#This Row],[Entiteit of attribuut]])=2,\"\",Tabel2[[#This Row],[Entiteit]]&\"_\"&Tabel2[[#This Row],[Entiteit of attribuut]]))","v":"LS_GADEKCD"},{"$f":"IF(Schema!I421=\"\",\"\",Schema!I421)","v":""},{"$f":"IF(Schema!J421=\"\",\"\",Schema!J421)","v":""},{"$f":"IF(Schema!K421=\"\",\"\",Schema!K421)","v":""},{"$f":"IF(Schema!L421=\"\",\"\",Schema!L421)","v":""},{"$f":"IF(Schema!N421=\"\",\"\",Schema!N421)","v":"V"}]
[{"$f":"Schema!A422&Schema!B422&Schema!C422&Schema!D422","v":"GADEKCO"},"LS",{"$f":"IF(A416=\"\",\"\",IF(LEN(Schema!A422)=2,1,IF(LEN(Schema!B422)=2,10,IF(LEN(Schema!C422)=2,100,0))))","v":0},10,{"$f":"IF(A416=\"\",\"\",SUM(Tabel2[[#This Row],[I1]:[I2]]))","v":10},{"$error":"#REF!"},"LS","",{"$error":"#REF!"},{"$f":"IF(C416=\"\",\"\",IF(LEN(Tabel2[[#This Row],[Entiteit of attribuut]])=2,\"\",Tabel2[[#This Row],[Entiteit]]&\"_\"&Tabel2[[#This Row],[Entiteit of attribuut]]))","v":"LS_GADEKCO"},{"$f":"IF(Schema!I422=\"\",\"\",Schema!I422)","v":""},{"$f":"IF(Schema!J422=\"\",\"\",Schema!J422)","v":""},{"$f":"IF(Schema!K422=\"\",\"\",Schema!K422)","v":""},{"$f":"IF(Schema!L422=\"\",\"\",Schema!L422)","v":""},{"$f":"IF(Schema!N422=\"\",\"\",Schema!N422)","v":"V"}]
[{"$f":"Schema!A423&Schema!B423&Schema!C423&Schema!D423","v":"MYCODE"},"LS",{"$f":"IF(A417=\"\",\"\",IF(LEN(Schema!A423)=2,1,IF(LEN(Schema!B423)=2,10,IF(LEN(Schema!C423)=2,100,0))))","v":0},10,{"$f":"IF(A417=\"\",\"\",SUM(Tabel2[[#This Row],[I1]:[I2]]))","v":10},{"$error":"#REF!"},"LS","",{"$error":"#REF!"},{"$f":"IF(C417=\"\",\"\",IF(LEN(Tabel2[[#This Row],[Entiteit of attribuut]])=2,\"\",Tabel2[[#This Row],[Entiteit]]&\"_\"&Tabel2[[#This Row],[Entiteit of attribuut]]))","v":"LS_MYCODE"},{"$f":"IF(Schema!I423=\"\",\"\",Schema!I423)","v":""},{"$f":"IF(Schema!J423=\"\",\"\",Schema!J423)","v":""},{"$f":"IF(Schema!K423=\"\",\"\",Schema!K423)","v":""},{"$f":"IF(Schema!L423=\"\",\"\",Schema!L423)","v":""},{"$f":"IF(Schema!N423=\"\",\"\",Schema!N423)","v":"O"}]
[{"$f":"Schema!A424&Schema!B424&Schema!C424&Schema!D424","v":"NJP"},"LS",{"$f":"IF(A418=\"\",\"\",IF(LEN(Schema!A424)=2,1,IF(LEN(Schema!B424)=2,10,IF(LEN(Schema!C424)=2,100,0))))","v":0},10,{"$f":"IF(A418=\"\",\"\",SUM(Tabel2[[#This Row],[I1]:[I2]]))","v":10},{"$error":"#REF!"},"LS","",{"$error":"#REF!"},{"$f":"IF(C418=\"\",\"\",IF(LEN(Tabel2[[#This Row],[Entiteit of attribuut]])=2,\"\",Tabel2[[#This Row],[Entiteit]]&\"_\"&Tabel2[[#This Row],[Entiteit of attribuut]]))","v":"LS_NJP"},{"$f":"IF(Schema!I424=\"\",\"\",Schema!I424)","v":""},{"$f":"IF(Schema!J424=\"\",\"\",Schema!J424)","v":""},{"$f":"IF(Schema!K424=\"\",\"\",Schema!K424)","v":""},{"$f":"IF(Schema!L424=\"\",\"\",Schema!L424)","v":""},{"$f":"IF(Schema!N424=\"\",\"\",Schema!N424)","v":"O"}]
[{"$f":"Schema!A425&Schema!B425&Schema!C425&Schema!D425","v":"PAFWST"},"LS",{"$f":"IF(A419=\"\",\"\",IF(LEN(Schema!A425)=2,1,IF(LEN(Schema!B425)=2,10,IF(LEN(Schema!C425)=2,100,0))))","v":0},10,{"$f":"IF(A419=\"\",\"\",SUM(Tabel2[[#This Row],[I1]:[I2]]))","v":10},{"$error":"#REF!"},"LS","",{"$error":"#REF!"},{"$f":"IF(C419=\"\",\"\",IF(LEN(Tabel2[[#This Row],[Entiteit of attribuut]])=2,\"\",Tabel2[[#This Row],[Entiteit]]&\"_\"&Tabel2[[#This Row],[Entiteit of attribuut]]))","v":"LS_PAFWST"},{"$f":"IF(Schema!I425=\"\",\"\",Schema!I425)","v":""},{"$f":"IF(Schema!J425=\"\",\"\",Schema!J425)","v":""},{"$f":"IF(Schema!K425=\"\",\"\",Schema!K425)","v":""},{"$f":"IF(Schema!L425=\"\",\"\",Schema!L425)","v":""},{"$f":"IF(Schema!N425=\"\",\"\",Schema!N425)","v":"O"}]
[{"$f":"Schema!A426&Schema!B426&Schema!C426&Schema!D426","v":"PPRC"},"LS",{"$f":"IF(A420=\"\",\"\",IF(LEN(Schema!A426)=2,1,IF(LEN(Schema!B426)=2,10,IF(LEN(Schema!C426)=2,100,0))))","v":0},10,{"$f":"IF(A420=\"\",\"\",SUM(Tabel2[[#This Row],[I1]:[I2]]))","v":10},{"$error":"#REF!"},"LS","",{"$error":"#REF!"},{"$f":"IF(C420=\"\",\"\",IF(LEN(Tabel2[[#This Row],[Entiteit of attribuut]])=2,\"\",Tabel2[[#This Row],[Entiteit]]&\"_\"&Tabel2[[#This Row],[Entiteit of attribuut]]))","v":"LS_PPRC"},{"$f":"IF(Schema!I426=\"\",\"\",Schema!I426)","v":""},{"$f":"IF(Schema!J426=\"\",\"\",Schema!J426)","v":""},{"$f":"IF(Schema!K426=\"\",\"\",Schema!K426)","v":""},{"$f":"IF(Schema!L426=\"\",\"\",Schema!L426)","v":""},{"$f":"IF(Schema!N426=\"\",\"\",Schema!N426)","v":"O"}]
[{"$f":"Schema!A427&Schema!B427&Schema!C427&Schema!D427","v":"PRCPKKT"},"LS",{"$f":"IF(A421=\"\",\"\",IF(LEN(Schema!A427)=2,1,IF(LEN(Schema!B427)=2,10,IF(LEN(Schema!C427)=2,100,0))))","v":0},10,{"$f":"IF(A421=\"\",\"\",SUM(Tabel2[[#This Row],[I1]:[I2]]))","v":10},{"$error":"#REF!"},"LS","",{"$error":"#REF!"},{"$f":"IF(C421=\"\",\"\",IF(LEN(Tabel2[[#This Row],[Entiteit of attribuut]])=2,\"\",Tabel2[[#This Row],[Entiteit]]&\"_\"&Tabel2[[#This Row],[Entiteit of attribuut]]))","v":"LS_PRCPKKT"},{"$f":"IF(Schema!I427=\"\",\"\",Schema!I427)","v":""},{"$f":"IF(Schema!J427=\"\",\"\",Schema!J427)","v":""},{"$f":"IF(Schema!K427=\"\",\"\",Schema!K427)","v":""},{"$f":"IF(Schema!L427=\"\",\"\",Schema!L427)","v":""},{"$f":"IF(Schema!N427=\"\",\"\",Schema!N427)","v":"O"}]
[{"$f":"Schema!A428&Schema!B428&Schema!C428&Schema!D428","v":"PRCTEKC"},"LS",{"$f":"IF(A422=\"\",\"\",IF(LEN(Schema!A428)=2,1,IF(LEN(Schema!B428)=2,10,IF(LEN(Schema!C428)=2,100,0))))","v":0},10,{"$f":"IF(A422=\"\",\"\",SUM(Tabel2[[#This Row],[I1]:[I2]]))","v":10},{"$error":"#REF!"},"LS","",{"$error":"#REF!"},{"$f":"IF(C422=\"\",\"\",IF(LEN(Tabel2[[#This Row],[Entiteit of attribuut]])=2,\"\",Tabel2[[#This Row],[Entiteit]]&\"_\"&Tabel2[[#This Row],[Entiteit of attribuut]]))","v":"LS_PRCTEKC"},{"$f":"IF(Schema!I428=\"\",\"\",Schema!I428)","v":""},{"$f":"IF(Schema!J428=\"\",\"\",Schema!J428)","v":""},{"$f":"IF(Schema!K428=\"\",\"\",Schema!K428)","v":""},{"$f":"IF(Schema!L428=\"\",\"\",Schema!L428)","v":""},{"$f":"IF(Schema!N428=\"\",\"\",Schema!N428)","v":"O"}]
[{"$f":"Schema!A429&Schema!B429&Schema!C429&Schema!D429","v":"RELVRH"},"LS",{"$f":"IF(A423=\"\",\"\",IF(LEN(Schema!A429)=2,1,IF(LEN(Schema!B429)=2,10,IF(LEN(Schema!C429)=2,100,0))))","v":0},10,{"$f":"IF(A423=\"\",\"\",SUM(Tabel2[[#This Row],[I1]:[I2]]))","v":10},{"$error":"#REF!"},"LS","",{"$error":"#REF!"},{"$f":"IF(C423=\"\",\"\",IF(LEN(Tabel2[[#This Row],[Entiteit of attribuut]])=2,\"\",Tabel2[[#This Row],[Entiteit]]&\"_\"&Tabel2[[#This Row],[Entiteit of attribuut]]))","v":"LS_RELVRH"},{"$f":"IF(Schema!I429=\"\",\"\",Schema!I429)","v":""},{"$f":"IF(Schema!J429=\"\",\"\",Schema!J429)","v":""},{"$f":"IF(Schema!K429=\"\",\"\",Schema!K429)","v":""},{"$f":"IF(Schema!L429=\"\",\"\",Schema!L429)","v":""},{"$f":"IF(Schema!N429=\"\",\"\",Schema!N429)","v":"O"}]
[{"$f":"Schema!A430&Schema!B430&Schema!C430&Schema!D430","v":"RELVVNR"},"LS",{"$f":"IF(A424=\"\",\"\",IF(LEN(Schema!A430)=2,1,IF(LEN(Schema!B430)=2,10,IF(LEN(Schema!C430)=2,100,0))))","v":0},10,{"$f":"IF(A424=\"\",\"\",SUM(Tabel2[[#This Row],[I1]:[I2]]))","v":10},{"$error":"#REF!"},"LS","",{"$error":"#REF!"},{"$f":"IF(C424=\"\",\"\",IF(LEN(Tabel2[[#This Row],[Entiteit of attribuut]])=2,\"\",Tabel2[[#This Row],[Entiteit]]&\"_\"&Tabel2[[#This Row],[Entiteit of attribuut]]))","v":"LS_RELVVNR"},{"$f":"IF(Schema!I430=\"\",\"\",Schema!I430)","v":""},{"$f":"IF(Schema!J430=\"\",\"\",Schema!J430)","v":""},{"$f":"IF(Schema!K430=\"\",\"\",Schema!K430)","v":""},{"$f":"IF(Schema!L430=\"\",\"\",Schema!L430)","v":""},{"$f":"IF(Schema!N430=\"\",\"\",Schema!N430)","v":"O"}]
[{"$f":"Schema!A431&Schema!B431&Schema!C431&Schema!D431","v":"RJRCOR"},"LS",{"$f":"IF(A425=\"\",\"\",IF(LEN(Schema!A431)=2,1,IF(LEN(Schema!B431)=2,10,IF(LEN(Schema!C431)=2,100,0))))","v":0},10,{"$f":"IF(A425=\"\",\"\",SUM(Tabel2[[#This Row],[I1]:[I2]]))","v":10},{"$error":"#REF!"},"LS","",{"$error":"#REF!"},{"$f":"IF(C425=\"\",\"\",IF(LEN(Tabel2[[#This Row],[Entiteit of attribuut]])=2,\"\",Tabel2[[#This Row],[Entiteit]]&\"_\"&Tabel2[[#This Row],[Entiteit of attribuut]]))","v":"LS_RJRCOR"},{"$f":"IF(Schema!I431=\"\",\"\",Schema!I431)","v":""},{"$f":"IF(Schema!J431=\"\",\"\",Schema!J431)","v":""},{"$f":"IF(Schema!K431=\"\",\"\",Schema!K431)","v":""},{"$f":"IF(Schema!L431=\"\",\"\",Schema!L431)","v":""},{"$f":"IF(Schema!N431=\"\",\"\",Schema!N431)","v":"O"}]
[{"$f":"Schema!A432&Schema!B432&Schema!C432&Schema!D432","v":"TCORBDR"},"LS",{"$f":"IF(A426=\"\",\"\",IF(LEN(Schema!A432)=2,1,IF(LEN(Schema!B432)=2,10,IF(LEN(Schema!C432)=2,100,0))))","v":0},10,{"$f":"IF(A426=\"\",\"\",SUM(Tabel2[[#This Row],[I1]:[I2]]))","v":10},{"$error":"#REF!"},"LS","",{"$error":"#REF!"},{"$f":"IF(C426=\"\",\"\",IF(LEN(Tabel2[[#This Row],[Entiteit of attribuut]])=2,\"\",Tabel2[[#This Row],[Entiteit]]&\"_\"&Tabel2[[#This Row],[Entiteit of attribuut]]))","v":"LS_TCORBDR"},{"$f":"IF(Schema!I432=\"\",\"\",Schema!I432)","v":""},{"$f":"IF(Schema!J432=\"\",\"\",Schema!J432)","v":""},{"$f":"IF(Schema!K432=\"\",\"\",Schema!K432)","v":""},{"$f":"IF(Schema!L432=\"\",\"\",Schema!L432)","v":""},{"$f":"IF(Schema!N432=\"\",\"\",Schema!N432)","v":"O"}]
[{"$f":"Schema!A433&Schema!B433&Schema!C433&Schema!D433","v":"VEERB"},"LS",{"$f":"IF(A427=\"\",\"\",IF(LEN(Schema!A433)=2,1,IF(LEN(Schema!B433)=2,10,IF(LEN(Schema!C433)=2,100,0))))","v":0},10,{"$f":"IF(A427=\"\",\"\",SUM(Tabel2[[#This Row],[I1]:[I2]]))","v":10},{"$error":"#REF!"},"LS","",{"$error":"#REF!"},{"$f":"IF(C427=\"\",\"\",IF(LEN(Tabel2[[#This Row],[Entiteit of attribuut]])=2,\"\",Tabel2[[#This Row],[Entiteit]]&\"_\"&Tabel2[[#This Row],[Entiteit of attribuut]]))","v":"LS_VEERB"},{"$f":"IF(Schema!I433=\"\",\"\",Schema!I433)","v":""},{"$f":"IF(Schema!J433=\"\",\"\",Schema!J433)","v":""},{"$f":"IF(Schema!K433=\"\",\"\",Schema!K433)","v":""},{"$f":"IF(Schema!L433=\"\",\"\",Schema!L433)","v":""},{"$f":"IF(Schema!N433=\"\",\"\",Schema!N433)","v":"LEEG"}]
[{"$f":"Schema!A434&Schema!B434&Schema!C434&Schema!D434","v":"VERZSOM"},"LS",{"$f":"IF(A428=\"\",\"\",IF(LEN(Schema!A434)=2,1,IF(LEN(Schema!B434)=2,10,IF(LEN(Schema!C434)=2,100,0))))","v":0},10,{"$f":"IF(A428=\"\",\"\",SUM(Tabel2[[#This Row],[I1]:[I2]]))","v":10},{"$error":"#REF!"},"LS","",{"$error":"#REF!"},{"$f":"IF(C428=\"\",\"\",IF(LEN(Tabel2[[#This Row],[Entiteit of attribuut]])=2,\"\",Tabel2[[#This Row],[Entiteit]]&\"_\"&Tabel2[[#This Row],[Entiteit of attribuut]]))","v":"LS_VERZSOM"},{"$f":"IF(Schema!I434=\"\",\"\",Schema!I434)","v":""},{"$f":"IF(Schema!J434=\"\",\"\",Schema!J434)","v":""},{"$f":"IF(Schema!K434=\"\",\"\",Schema!K434)","v":""},{"$f":"IF(Schema!L434=\"\",\"\",Schema!L434)","v":""},{"$f":"IF(Schema!N434=\"\",\"\",Schema!N434)","v":"O"}]
[{"$f":"Schema!A435&Schema!B435&Schema!C435&Schema!D435","v":"VGBRA"},"LS",{"$f":"IF(A429=\"\",\"\",IF(LEN(Schema!A435)=2,1,IF(LEN(Schema!B435)=2,10,IF(LEN(Schema!C435)=2,100,0))))","v":0},10,{"$f":"IF(A429=\"\",\"\",SUM(Tabel2[[#This Row],[I1]:[I2]]))","v":10},{"$error":"#REF!"},"LS","",{"$error":"#REF!"},{"$f":"IF(C429=\"\",\"\",IF(LEN(Tabel2[[#This Row],[Entiteit of attribuut]])=2,\"\",Tabel2[[#This Row],[Entiteit]]&\"_\"&Tabel2[[#This Row],[Entiteit of attribuut]]))","v":"LS_VGBRA"},{"$f":"IF(Schema!I435=\"\",\"\",Schema!I435)","v":""},{"$f":"IF(Schema!J435=\"\",\"\",Schema!J435)","v":""},{"$f":"IF(Schema!K435=\"\",\"\",Schema!K435)","v":""},{"$f":"IF(Schema!L435=\"\",\"\",Schema!L435)","v":""},{"$f":"IF(Schema!N435=\"\",\"\",Schema!N435)","v":"O"}]
[{"$f":"Schema!A436&Schema!B436&Schema!C436&Schema!D436","v":"VOLGNUM"},"LS",{"$f":"IF(A430=\"\",\"\",IF(LEN(Schema!A436)=2,1,IF(LEN(Schema!B436)=2,10,IF(LEN(Schema!C436)=2,100,0))))","v":0},10,{"$f":"IF(A430=\"\",\"\",SUM(Tabel2[[#This Row],[I1]:[I2]]))","v":10},{"$error":"#REF!"},"LS","",{"$error":"#REF!"},{"$f":"IF(C430=\"\",\"\",IF(LEN(Tabel2[[#This Row],[Entiteit of attribuut]])=2,\"\",Tabel2[[#This Row],[Entiteit]]&\"_\"&Tabel2[[#This Row],[Entiteit of attribuut]]))","v":"LS_VOLGNUM"},{"$f":"IF(Schema!I436=\"\",\"\",Schema!I436)","v":""},{"$f":"IF(Schema!J436=\"\",\"\",Schema!J436)","v":""},{"$f":"IF(Schema!K436=\"\",\"\",Schema!K436)","v":""},{"$f":"IF(Schema!L436=\"\",\"\",Schema!L436)","v":""},{"$f":"IF(Schema!N436=\"\",\"\",Schema!N436)","v":"LEEG"}]
[{"$f":"Schema!A437&Schema!B437&Schema!C437&Schema!D437","v":"VRWRKCD"},"LS",{"$f":"IF(A431=\"\",\"\",IF(LEN(Schema!A437)=2,1,IF(LEN(Schema!B437)=2,10,IF(LEN(Schema!C437)=2,100,0))))","v":0},10,{"$f":"IF(A431=\"\",\"\",SUM(Tabel2[[#This Row],[I1]:[I2]]))","v":10},{"$error":"#REF!"},"LS","",{"$error":"#REF!"},{"$f":"IF(C431=\"\",\"\",IF(LEN(Tabel2[[#This Row],[Entiteit of attribuut]])=2,\"\",Tabel2[[#This Row],[Entiteit]]&\"_\"&Tabel2[[#This Row],[Entiteit of attribuut]]))","v":"LS_VRWRKCD"},{"$f":"IF(Schema!I437=\"\",\"\",Schema!I437)","v":""},{"$f":"IF(Schema!J437=\"\",\"\",Schema!J437)","v":""},{"$f":"IF(Schema!K437=\"\",\"\",Schema!K437)","v":""},{"$f":"IF(Schema!L437=\"\",\"\",Schema!L437)","v":""},{"$f":"IF(Schema!N437=\"\",\"\",Schema!N437)","v":"LEEG"}]
[{"$f":"Schema!A438&Schema!B438&Schema!C438&Schema!D438","v":"WPREMBP"},"LS",{"$f":"IF(A432=\"\",\"\",IF(LEN(Schema!A438)=2,1,IF(LEN(Schema!B438)=2,10,IF(LEN(Schema!C438)=2,100,0))))","v":0},10,{"$f":"IF(A432=\"\",\"\",SUM(Tabel2[[#This Row],[I1]:[I2]]))","v":10},{"$error":"#REF!"},"LS","",{"$error":"#REF!"},{"$f":"IF(C432=\"\",\"\",IF(LEN(Tabel2[[#This Row],[Entiteit of attribuut]])=2,\"\",Tabel2[[#This Row],[Entiteit]]&\"_\"&Tabel2[[#This Row],[Entiteit of attribuut]]))","v":"LS_WPREMBP"},{"$f":"IF(Schema!I438=\"\",\"\",Schema!I438)","v":""},{"$f":"IF(Schema!J438=\"\",\"\",Schema!J438)","v":""},{"$f":"IF(Schema!K438=\"\",\"\",Schema!K438)","v":""},{"$f":"IF(Schema!L438=\"\",\"\",Schema!L438)","v":""},{"$f":"IF(Schema!N438=\"\",\"\",Schema!N438)","v":"O"}]
[{"$f":"Schema!A439&Schema!B439&Schema!C439&Schema!D439","v":"MP"},"MP",{"$f":"IF(A433=\"\",\"\",IF(LEN(Schema!A439)=2,1,IF(LEN(Schema!B439)=2,10,IF(LEN(Schema!C439)=2,100,0))))","v":100},100,{"$f":"IF(A433=\"\",\"\",SUM(Tabel2[[#This Row],[I1]:[I2]]))","v":200},{"$error":"#REF!"},"LS","MP",{"$error":"#REF!"},{"$f":"IF(C433=\"\",\"\",IF(LEN(Tabel2[[#This Row],[Entiteit of attribuut]])=2,\"\",Tabel2[[#This Row],[Entiteit]]&\"_\"&Tabel2[[#This Row],[Entiteit of attribuut]]))","v":""},{"$f":"IF(Schema!I439=\"\",\"\",Schema!I439)","v":""},{"$f":"IF(Schema!J439=\"\",\"\",Schema!J439)","v":""},{"$f":"IF(Schema!K439=\"\",\"\",Schema!K439)","v":""},{"$f":"IF(Schema!L439=\"\",\"\",Schema!L439)","v":""},{"$f":"IF(Schema!N439=\"\",\"\",Schema!N439)","v":"O"}]
[{"$f":"Schema!A440&Schema!B440&Schema!C440&Schema!D440","v":"MYAAND"},"MP",{"$f":"IF(A434=\"\",\"\",IF(LEN(Schema!A440)=2,1,IF(LEN(Schema!B440)=2,10,IF(LEN(Schema!C440)=2,100,0))))","v":0},100,{"$f":"IF(A434=\"\",\"\",SUM(Tabel2[[#This Row],[I1]:[I2]]))","v":100},{"$error":"#REF!"},"LS","MP",{"$error":"#REF!"},{"$f":"IF(C434=\"\",\"\",IF(LEN(Tabel2[[#This Row],[Entiteit of attribuut]])=2,\"\",Tabel2[[#This Row],[Entiteit]]&\"_\"&Tabel2[[#This Row],[Entiteit of attribuut]]))","v":"MP_MYAAND"},{"$f":"IF(Schema!I440=\"\",\"\",Schema!I440)","v":""},{"$f":"IF(Schema!J440=\"\",\"\",Schema!J440)","v":""},{"$f":"IF(Schema!K440=\"\",\"\",Schema!K440)","v":""},{"$f":"IF(Schema!L440=\"\",\"\",Schema!L440)","v":""},{"$f":"IF(Schema!N440=\"\",\"\",Schema!N440)","v":"O"}]
[{"$f":"Schema!A441&Schema!B441&Schema!C441&Schema!D441","v":"PLLEAD"},"MP",{"$f":"IF(A435=\"\",\"\",IF(LEN(Schema!A441)=2,1,IF(LEN(Schema!B441)=2,10,IF(LEN(Schema!C441)=2,100,0))))","v":0},100,{"$f":"IF(A435=\"\",\"\",SUM(Tabel2[[#This Row],[I1]:[I2]]))","v":100},{"$error":"#REF!"},"LS","MP",{"$error":"#REF!"},{"$f":"IF(C435=\"\",\"\",IF(LEN(Tabel2[[#This Row],[Entiteit of attribuut]])=2,\"\",Tabel2[[#This Row],[Entiteit]]&\"_\"&Tabel2[[#This Row],[Entiteit of attribuut]]))","v":"MP_PLLEAD"},{"$f":"IF(Schema!I441=\"\",\"\",Schema!I441)","v":""},{"$f":"IF(Schema!J441=\"\",\"\",Schema!J441)","v":""},{"$f":"IF(Schema!K441=\"\",\"\",Schema!K441)","v":""},{"$f":"IF(Schema!L441=\"\",\"\",Schema!L441)","v":""},{"$f":"IF(Schema!N441=\"\",\"\",Schema!N441)","v":"O"}]
[{"$f":"Schema!A442&Schema!B442&Schema!C442&Schema!D442","v":"POOLNUM"},"MP",{"$f":"IF(A436=\"\",\"\",IF(LEN(Schema!A442)=2,1,IF(LEN(Schema!B442)=2,10,IF(LEN(Schema!C442)=2,100,0))))","v":0},100,{"$f":"IF(A436=\"\",\"\",SUM(Tabel2[[#This Row],[I1]:[I2]]))","v":100},{"$error":"#REF!"},"LS","MP",{"$error":"#REF!"},{"$f":"IF(C436=\"\",\"\",IF(LEN(Tabel2[[#This Row],[Entiteit of attribuut]])=2,\"\",Tabel2[[#This Row],[Entiteit]]&\"_\"&Tabel2[[#This Row],[Entiteit of attribuut]]))","v":"MP_POOLNUM"},{"$f":"IF(Schema!I442=\"\",\"\",Schema!I442)","v":""},{"$f":"IF(Schema!J442=\"\",\"\",Schema!J442)","v":""},{"$f":"IF(Schema!K442=\"\",\"\",Schema!K442)","v":""},{"$f":"IF(Schema!L442=\"\",\"\",Schema!L442)","v":""},{"$f":"IF(Schema!N442=\"\",\"\",Schema!N442)","v":"V"}]
[{"$f":"Schema!A443&Schema!B443&Schema!C443&Schema!D443","v":"POOLPRC"},"MP",{"$f":"IF(A437=\"\",\"\",IF(LEN(Schema!A443)=2,1,IF(LEN(Schema!B443)=2,10,IF(LEN(Schema!C443)=2,100,0))))","v":0},100,{"$f":"IF(A437=\"\",\"\",SUM(Tabel2[[#This Row],[I1]:[I2]]))","v":100},{"$error":"#REF!"},"LS","MP",{"$error":"#REF!"},{"$f":"IF(C437=\"\",\"\",IF(LEN(Tabel2[[#This Row],[Entiteit of attribuut]])=2,\"\",Tabel2[[#This Row],[Entiteit]]&\"_\"&Tabel2[[#This Row],[Entiteit of attribuut]]))","v":"MP_POOLPRC"},{"$f":"IF(Schema!I443=\"\",\"\",Schema!I443)","v":""},{"$f":"IF(Schema!J443=\"\",\"\",Schema!J443)","v":""},{"$f":"IF(Schema!K443=\"\",\"\",Schema!K443)","v":""},{"$f":"IF(Schema!L443=\"\",\"\",Schema!L443)","v":""},{"$f":"IF(Schema!N443=\"\",\"\",Schema!N443)","v":"V"}]
[{"$f":"Schema!A444&Schema!B444&Schema!C444&Schema!D444","v":"MI"},"MI",{"$f":"IF(A438=\"\",\"\",IF(LEN(Schema!A444)=2,1,IF(LEN(Schema!B444)=2,10,IF(LEN(Schema!C444)=2,100,0))))","v":10},10,{"$f":"IF(A438=\"\",\"\",SUM(Tabel2[[#This Row],[I1]:[I2]]))","v":20},{"$error":"#REF!"},"MI","",{"$error":"#REF!"},{"$f":"IF(C438=\"\",\"\",IF(LEN(Tabel2[[#This Row],[Entiteit of attribuut]])=2,\"\",Tabel2[[#This Row],[Entiteit]]&\"_\"&Tabel2[[#This Row],[Entiteit of attribuut]]))","v":""},{"$f":"IF(Schema!I444=\"\",\"\",Schema!I444)","v":""},{"$f":"IF(Schema!J444=\"\",\"\",Schema!J444)","v":""},{"$f":"IF(Schema!K444=\"\",\"\",Schema!K444)","v":""},{"$f":"IF(Schema!L444=\"\",\"\",Schema!L444)","v":""},{"$f":"IF(Schema!N444=\"\",\"\",Schema!N444)","v":"O"}]
[{"$f":"Schema!A445&Schema!B445&Schema!C445&Schema!D445","v":"BAFWST"},"MI",{"$f":"IF(A439=\"\",\"\",IF(LEN(Schema!A445)=2,1,IF(LEN(Schema!B445)=2,10,IF(LEN(Schema!C445)=2,100,0))))","v":0},10,{"$f":"IF(A439=\"\",\"\",SUM(Tabel2[[#This Row],[I1]:[I2]]))","v":10},{"$error":"#REF!"},"MI","",{"$error":"#REF!"},{"$f":"IF(C439=\"\",\"\",IF(LEN(Tabel2[[#This Row],[Entiteit of attribuut]])=2,\"\",Tabel2[[#This Row],[Entiteit]]&\"_\"&Tabel2[[#This Row],[Entiteit of attribuut]]))","v":"MI_BAFWST"},{"$f":"IF(Schema!I445=\"\",\"\",Schema!I445)","v":""},{"$f":"IF(Schema!J445=\"\",\"\",Schema!J445)","v":""},{"$f":"IF(Schema!K445=\"\",\"\",Schema!K445)","v":""},{"$f":"IF(Schema!L445=\"\",\"\",Schema!L445)","v":""},{"$f":"IF(Schema!N445=\"\",\"\",Schema!N445)","v":"O"}]
[{"$f":"Schema!A446&Schema!B446&Schema!C446&Schema!D446","v":"BTP"},"MI",{"$f":"IF(A440=\"\",\"\",IF(LEN(Schema!A446)=2,1,IF(LEN(Schema!B446)=2,10,IF(LEN(Schema!C446)=2,100,0))))","v":0},10,{"$f":"IF(A440=\"\",\"\",SUM(Tabel2[[#This Row],[I1]:[I2]]))","v":10},{"$error":"#REF!"},"MI","",{"$error":"#REF!"},{"$f":"IF(C440=\"\",\"\",IF(LEN(Tabel2[[#This Row],[Entiteit of attribuut]])=2,\"\",Tabel2[[#This Row],[Entiteit]]&\"_\"&Tabel2[[#This Row],[Entiteit of attribuut]]))","v":"MI_BTP"},{"$f":"IF(Schema!I446=\"\",\"\",Schema!I446)","v":""},{"$f":"IF(Schema!J446=\"\",\"\",Schema!J446)","v":""},{"$f":"IF(Schema!K446=\"\",\"\",Schema!K446)","v":""},{"$f":"IF(Schema!L446=\"\",\"\",Schema!L446)","v":""},{"$f":"IF(Schema!N446=\"\",\"\",Schema!N446)","v":"LEEG"}]
[{"$f":"Schema!A447&Schema!B447&Schema!C447&Schema!D447","v":"CODE"},"MI",{"$f":"IF(A441=\"\",\"\",IF(LEN(Schema!A447)=2,1,IF(LEN(Schema!B447)=2,10,IF(LEN(Schema!C447)=2,100,0))))","v":0},10,{"$f":"IF(A441=\"\",\"\",SUM(Tabel2[[#This Row],[I1]:[I2]]))","v":10},{"$error":"#REF!"},"MI","",{"$error":"#REF!"},{"$f":"IF(C441=\"\",\"\",IF(LEN(Tabel2[[#This Row],[Entiteit of attribuut]])=2,\"\",Tabel2[[#This Row],[Entiteit]]&\"_\"&Tabel2[[#This Row],[Entiteit of attribuut]]))","v":"MI_CODE"},{"$f":"IF(Schema!I447=\"\",\"\",Schema!I447)","v":""},{"$f":"IF(Schema!J447=\"\",\"\",Schema!J447)","v":""},{"$f":"IF(Schema!K447=\"\",\"\",Schema!K447)","v":""},{"$f":"IF(Schema!L447=\"\",\"\",Schema!L447)","v":""},{"$f":"IF(Schema!N447=\"\",\"\",Schema!N447)","v":"O"}]
[{"$f":"Schema!A448&Schema!B448&Schema!C448&Schema!D448","v":"COLFACT"},"MI",{"$f":"IF(A442=\"\",\"\",IF(LEN(Schema!A448)=2,1,IF(LEN(Schema!B448)=2,10,IF(LEN(Schema!C448)=2,100,0))))","v":0},10,{"$f":"IF(A442=\"\",\"\",SUM(Tabel2[[#This Row],[I1]:[I2]]))","v":10},{"$error":"#REF!"},"MI","",{"$error":"#REF!"},{"$f":"IF(C442=\"\",\"\",IF(LEN(Tabel2[[#This Row],[Entiteit of attribuut]])=2,\"\",Tabel2[[#This Row],[Entiteit]]&\"_\"&Tabel2[[#This Row],[Entiteit of attribuut]]))","v":"MI_COLFACT"},{"$f":"IF(Schema!I448=\"\",\"\",Schema!I448)","v":""},{"$f":"IF(Schema!J448=\"\",\"\",Schema!J448)","v":""},{"$f":"IF(Schema!K448=\"\",\"\",Schema!K448)","v":""},{"$f":"IF(Schema!L448=\"\",\"\",Schema!L448)","v":""},{"$f":"IF(Schema!N448=\"\",\"\",Schema!N448)","v":"O"}]
[{"$f":"Schema!A449&Schema!B449&Schema!C449&Schema!D449","v":"ERB"},"MI",{"$f":"IF(A443=\"\",\"\",IF(LEN(Schema!A449)=2,1,IF(LEN(Schema!B449)=2,10,IF(LEN(Schema!C449)=2,100,0))))","v":0},10,{"$f":"IF(A443=\"\",\"\",SUM(Tabel2[[#This Row],[I1]:[I2]]))","v":10},{"$error":"#REF!"},"MI","",{"$error":"#REF!"},{"$f":"IF(C443=\"\",\"\",IF(LEN(Tabel2[[#This Row],[Entiteit of attribuut]])=2,\"\",Tabel2[[#This Row],[Entiteit]]&\"_\"&Tabel2[[#This Row],[Entiteit of attribuut]]))","v":"MI_ERB"},{"$f":"IF(Schema!I449=\"\",\"\",Schema!I449)","v":""},{"$f":"IF(Schema!J449=\"\",\"\",Schema!J449)","v":""},{"$f":"IF(Schema!K449=\"\",\"\",Schema!K449)","v":""},{"$f":"IF(Schema!L449=\"\",\"\",Schema!L449)","v":""},{"$f":"IF(Schema!N449=\"\",\"\",Schema!N449)","v":"O"}]
[{"$f":"Schema!A450&Schema!B450&Schema!C450&Schema!D450","v":"GADEKCD"},"MI",{"$f":"IF(A444=\"\",\"\",IF(LEN(Schema!A450)=2,1,IF(LEN(Schema!B450)=2,10,IF(LEN(Schema!C450)=2,100,0))))","v":0},10,{"$f":"IF(A444=\"\",\"\",SUM(Tabel2[[#This Row],[I1]:[I2]]))","v":10},{"$error":"#REF!"},"MI","",{"$error":"#REF!"},{"$f":"IF(C444=\"\",\"\",IF(LEN(Tabel2[[#This Row],[Entiteit of attribuut]])=2,\"\",Tabel2[[#This Row],[Entiteit]]&\"_\"&Tabel2[[#This Row],[Entiteit of attribuut]]))","v":"MI_GADEKCD"},{"$f":"IF(Schema!I450=\"\",\"\",Schema!I450)","v":""},{"$f":"IF(Schema!J450=\"\",\"\",Schema!J450)","v":""},{"$f":"IF(Schema!K450=\"\",\"\",Schema!K450)","v":""},{"$f":"IF(Schema!L450=\"\",\"\",Schema!L450)","v":""},{"$f":"IF(Schema!N450=\"\",\"\",Schema!N450)","v":"V"}]
[{"$f":"Schema!A451&Schema!B451&Schema!C451&Schema!D451","v":"GADEKCO"},"MI",{"$f":"IF(A445=\"\",\"\",IF(LEN(Schema!A451)=2,1,IF(LEN(Schema!B451)=2,10,IF(LEN(Schema!C451)=2,100,0))))","v":0},10,{"$f":"IF(A445=\"\",\"\",SUM(Tabel2[[#This Row],[I1]:[I2]]))","v":10},{"$error":"#REF!"},"MI","",{"$error":"#REF!"},{"$f":"IF(C445=\"\",\"\",IF(LEN(Tabel2[[#This Row],[Entiteit of attribuut]])=2,\"\",Tabel2[[#This Row],[Entiteit]]&\"_\"&Tabel2[[#This Row],[Entiteit of attribuut]]))","v":"MI_GADEKCO"},{"$f":"IF(Schema!I451=\"\",\"\",Schema!I451)","v":""},{"$f":"IF(Schema!J451=\"\",\"\",Schema!J451)","v":""},{"$f":"IF(Schema!K451=\"\",\"\",Schema!K451)","v":""},{"$f":"IF(Schema!L451=\"\",\"\",Schema!L451)","v":""},{"$f":"IF(Schema!N451=\"\",\"\",Schema!N451)","v":"V"}]
[{"$f":"Schema!A452&Schema!B452&Schema!C452&Schema!D452","v":"MYCODE"},"MI",{"$f":"IF(A446=\"\",\"\",IF(LEN(Schema!A452)=2,1,IF(LEN(Schema!B452)=2,10,IF(LEN(Schema!C452)=2,100,0))))","v":0},10,{"$f":"IF(A446=\"\",\"\",SUM(Tabel2[[#This Row],[I1]:[I2]]))","v":10},{"$error":"#REF!"},"MI","",{"$error":"#REF!"},{"$f":"IF(C446=\"\",\"\",IF(LEN(Tabel2[[#This Row],[Entiteit of attribuut]])=2,\"\",Tabel2[[#This Row],[Entiteit]]&\"_\"&Tabel2[[#This Row],[Entiteit of attribuut]]))","v":"MI_MYCODE"},{"$f":"IF(Schema!I452=\"\",\"\",Schema!I452)","v":""},{"$f":"IF(Schema!J452=\"\",\"\",Schema!J452)","v":""},{"$f":"IF(Schema!K452=\"\",\"\",Schema!K452)","v":""},{"$f":"IF(Schema!L452=\"\",\"\",Schema!L452)","v":""},{"$f":"IF(Schema!N452=\"\",\"\",Schema!N452)","v":"O"}]
[{"$f":"Schema!A453&Schema!B453&Schema!C453&Schema!D453","v":"NJP"},"MI",{"$f":"IF(A447=\"\",\"\",IF(LEN(Schema!A453)=2,1,IF(LEN(Schema!B453)=2,10,IF(LEN(Schema!C453)=2,100,0))))","v":0},10,{"$f":"IF(A447=\"\",\"\",SUM(Tabel2[[#This Row],[I1]:[I2]]))","v":10},{"$error":"#REF!"},"MI","",{"$error":"#REF!"},{"$f":"IF(C447=\"\",\"\",IF(LEN(Tabel2[[#This Row],[Entiteit of attribuut]])=2,\"\",Tabel2[[#This Row],[Entiteit]]&\"_\"&Tabel2[[#This Row],[Entiteit of attribuut]]))","v":"MI_NJP"},{"$f":"IF(Schema!I453=\"\",\"\",Schema!I453)","v":""},{"$f":"IF(Schema!J453=\"\",\"\",Schema!J453)","v":""},{"$f":"IF(Schema!K453=\"\",\"\",Schema!K453)","v":""},{"$f":"IF(Schema!L453=\"\",\"\",Schema!L453)","v":""},{"$f":"IF(Schema!N453=\"\",\"\",Schema!N453)","v":"O"}]
[{"$f":"Schema!A454&Schema!B454&Schema!C454&Schema!D454","v":"PAFWST"},"MI",{"$f":"IF(A448=\"\",\"\",IF(LEN(Schema!A454)=2,1,IF(LEN(Schema!B454)=2,10,IF(LEN(Schema!C454)=2,100,0))))","v":0},10,{"$f":"IF(A448=\"\",\"\",SUM(Tabel2[[#This Row],[I1]:[I2]]))","v":10},{"$error":"#REF!"},"MI","",{"$error":"#REF!"},{"$f":"IF(C448=\"\",\"\",IF(LEN(Tabel2[[#This Row],[Entiteit of attribuut]])=2,\"\",Tabel2[[#This Row],[Entiteit]]&\"_\"&Tabel2[[#This Row],[Entiteit of attribuut]]))","v":"MI_PAFWST"},{"$f":"IF(Schema!I454=\"\",\"\",Schema!I454)","v":""},{"$f":"IF(Schema!J454=\"\",\"\",Schema!J454)","v":""},{"$f":"IF(Schema!K454=\"\",\"\",Schema!K454)","v":""},{"$f":"IF(Schema!L454=\"\",\"\",Schema!L454)","v":""},{"$f":"IF(Schema!N454=\"\",\"\",Schema!N454)","v":"O"}]
[{"$f":"Schema!A455&Schema!B455&Schema!C455&Schema!D455","v":"PPRC"},"MI",{"$f":"IF(A449=\"\",\"\",IF(LEN(Schema!A455)=2,1,IF(LEN(Schema!B455)=2,10,IF(LEN(Schema!C455)=2,100,0))))","v":0},10,{"$f":"IF(A449=\"\",\"\",SUM(Tabel2[[#This Row],[I1]:[I2]]))","v":10},{"$error":"#REF!"},"MI","",{"$error":"#REF!"},{"$f":"IF(C449=\"\",\"\",IF(LEN(Tabel2[[#This Row],[Entiteit of attribuut]])=2,\"\",Tabel2[[#This Row],[Entiteit]]&\"_\"&Tabel2[[#This Row],[Entiteit of attribuut]]))","v":"MI_PPRC"},{"$f":"IF(Schema!I455=\"\",\"\",Schema!I455)","v":""},{"$f":"IF(Schema!J455=\"\",\"\",Schema!J455)","v":""},{"$f":"IF(Schema!K455=\"\",\"\",Schema!K455)","v":""},{"$f":"IF(Schema!L455=\"\",\"\",Schema!L455)","v":""},{"$f":"IF(Schema!N455=\"\",\"\",Schema!N455)","v":"O"}]
[{"$f":"Schema!A456&Schema!B456&Schema!C456&Schema!D456","v":"PRCPKKT"},"MI",{"$f":"IF(A450=\"\",\"\",IF(LEN(Schema!A456)=2,1,IF(LEN(Schema!B456)=2,10,IF(LEN(Schema!C456)=2,100,0))))","v":0},10,{"$f":"IF(A450=\"\",\"\",SUM(Tabel2[[#This Row],[I1]:[I2]]))","v":10},{"$error":"#REF!"},"MI","",{"$error":"#REF!"},{"$f":"IF(C450=\"\",\"\",IF(LEN(Tabel2[[#This Row],[Entiteit of attribuut]])=2,\"\",Tabel2[[#This Row],[Entiteit]]&\"_\"&Tabel2[[#This Row],[Entiteit of attribuut]]))","v":"MI_PRCPKKT"},{"$f":"IF(Schema!I456=\"\",\"\",Schema!I456)","v":""},{"$f":"IF(Schema!J456=\"\",\"\",Schema!J456)","v":""},{"$f":"IF(Schema!K456=\"\",\"\",Schema!K456)","v":""},{"$f":"IF(Schema!L456=\"\",\"\",Schema!L456)","v":""},{"$f":"IF(Schema!N456=\"\",\"\",Schema!N456)","v":"O"}]
[{"$f":"Schema!A457&Schema!B457&Schema!C457&Schema!D457","v":"PRCTEKC"},{"$f":"IF(LEN(A451)=2,A451,IF(A451=\"\",\"Leeg\",B450))","v":"MI"},{"$f":"IF(A451=\"\",\"\",IF(LEN(Schema!A457)=2,1,IF(LEN(Schema!B457)=2,10,IF(LEN(Schema!C457)=2,100,0))))","v":0},{"$f":"IF(C451=0,D450,C451)","v":10},{"$f":"IF(A451=\"\",\"\",SUM(Tabel2[[#This Row],[I1]:[I2]]))","v":10},{"$f":"IF(A451=\"\",\"\",IF(C451=1,B451,F450))","v":{"$error":"#REF!"}},{"$f":"IF(C451=10,A451,IF(OR(C451=0,C451=100),G450,\"\"))","v":"MI"},{"$f":"IF(E451=200,B451,IF(C451=0,H450,\"\"))","v":""},{"$f":"IF(C451=\"\",\"\",IF(OR(E451=1,E451=10,E451=100),I450,IF(E451=2,F451,IF(E451=20,F451&\"/\"&G451,IF(E451=200,F451&\"/\"&G451&\"/\"&H451)))))","v":{"$error":"#REF!"}},{"$f":"IF(C451=\"\",\"\",IF(LEN(Tabel2[[#This Row],[Entiteit of attribuut]])=2,\"\",Tabel2[[#This Row],[Entiteit]]&\"_\"&Tabel2[[#This Row],[Entiteit of attribuut]]))","v":"MI_PRCTEKC"},{"$f":"IF(Schema!I457=\"\",\"\",Schema!I457)","v":""},{"$f":"IF(Schema!J457=\"\",\"\",Schema!J457)","v":""},{"$f":"IF(Schema!K457=\"\",\"\",Schema!K457)","v":""},{"$f":"IF(Schema!L457=\"\",\"\",Schema!L457)","v":""},{"$f":"IF(Schema!N457=\"\",\"\",Schema!N457)","v":"O"}]
[{"$f":"Schema!A458&Schema!B458&Schema!C458&Schema!D458","v":"RELVRH"},"MI",{"$f":"IF(A452=\"\",\"\",IF(LEN(Schema!A458)=2,1,IF(LEN(Schema!B458)=2,10,IF(LEN(Schema!C458)=2,100,0))))","v":0},10,{"$f":"IF(A452=\"\",\"\",SUM(Tabel2[[#This Row],[I1]:[I2]]))","v":10},{"$error":"#REF!"},"MI","",{"$error":"#REF!"},{"$f":"IF(C452=\"\",\"\",IF(LEN(Tabel2[[#This Row],[Entiteit of attribuut]])=2,\"\",Tabel2[[#This Row],[Entiteit]]&\"_\"&Tabel2[[#This Row],[Entiteit of attribuut]]))","v":"MI_RELVRH"},{"$f":"IF(Schema!I458=\"\",\"\",Schema!I458)","v":""},{"$f":"IF(Schema!J458=\"\",\"\",Schema!J458)","v":""},{"$f":"IF(Schema!K458=\"\",\"\",Schema!K458)","v":""},{"$f":"IF(Schema!L458=\"\",\"\",Schema!L458)","v":""},{"$f":"IF(Schema!N458=\"\",\"\",Schema!N458)","v":"O"}]
[{"$f":"Schema!A459&Schema!B459&Schema!C459&Schema!D459","v":"RELVVNR"},"MI",{"$f":"IF(A453=\"\",\"\",IF(LEN(Schema!A459)=2,1,IF(LEN(Schema!B459)=2,10,IF(LEN(Schema!C459)=2,100,0))))","v":0},10,{"$f":"IF(A453=\"\",\"\",SUM(Tabel2[[#This Row],[I1]:[I2]]))","v":10},{"$error":"#REF!"},"MI","",{"$error":"#REF!"},{"$f":"IF(C453=\"\",\"\",IF(LEN(Tabel2[[#This Row],[Entiteit of attribuut]])=2,\"\",Tabel2[[#This Row],[Entiteit]]&\"_\"&Tabel2[[#This Row],[Entiteit of attribuut]]))","v":"MI_RELVVNR"},{"$f":"IF(Schema!I459=\"\",\"\",Schema!I459)","v":""},{"$f":"IF(Schema!J459=\"\",\"\",Schema!J459)","v":""},{"$f":"IF(Schema!K459=\"\",\"\",Schema!K459)","v":""},{"$f":"IF(Schema!L459=\"\",\"\",Schema!L459)","v":""},{"$f":"IF(Schema!N459=\"\",\"\",Schema!N459)","v":"O"}]
[{"$f":"Schema!A460&Schema!B460&Schema!C460&Schema!D460","v":"RJRCOR"},"MI",{"$f":"IF(A454=\"\",\"\",IF(LEN(Schema!A460)=2,1,IF(LEN(Schema!B460)=2,10,IF(LEN(Schema!C460)=2,100,0))))","v":0},10,{"$f":"IF(A454=\"\",\"\",SUM(Tabel2[[#This Row],[I1]:[I2]]))","v":10},{"$error":"#REF!"},"MI","",{"$error":"#REF!"},{"$f":"IF(C454=\"\",\"\",IF(LEN(Tabel2[[#This Row],[Entiteit of attribuut]])=2,\"\",Tabel2[[#This Row],[Entiteit]]&\"_\"&Tabel2[[#This Row],[Entiteit of attribuut]]))","v":"MI_RJRCOR"},{"$f":"IF(Schema!I460=\"\",\"\",Schema!I460)","v":""},{"$f":"IF(Schema!J460=\"\",\"\",Schema!J460)","v":""},{"$f":"IF(Schema!K460=\"\",\"\",Schema!K460)","v":""},{"$f":"IF(Schema!L460=\"\",\"\",Schema!L460)","v":""},{"$f":"IF(Schema!N460=\"\",\"\",Schema!N460)","v":"O"}]
[{"$f":"Schema!A461&Schema!B461&Schema!C461&Schema!D461","v":"TCORBDR"},"MI",{"$f":"IF(A455=\"\",\"\",IF(LEN(Schema!A461)=2,1,IF(LEN(Schema!B461)=2,10,IF(LEN(Schema!C461)=2,100,0))))","v":0},10,{"$f":"IF(A455=\"\",\"\",SUM(Tabel2[[#This Row],[I1]:[I2]]))","v":10},{"$error":"#REF!"},"MI","",{"$error":"#REF!"},{"$f":"IF(C455=\"\",\"\",IF(LEN(Tabel2[[#This Row],[Entiteit of attribuut]])=2,\"\",Tabel2[[#This Row],[Entiteit]]&\"_\"&Tabel2[[#This Row],[Entiteit of attribuut]]))","v":"MI_TCORBDR"},{"$f":"IF(Schema!I461=\"\",\"\",Schema!I461)","v":""},{"$f":"IF(Schema!J461=\"\",\"\",Schema!J461)","v":""},{"$f":"IF(Schema!K461=\"\",\"\",Schema!K461)","v":""},{"$f":"IF(Schema!L461=\"\",\"\",Schema!L461)","v":""},{"$f":"IF(Schema!N461=\"\",\"\",Schema!N461)","v":"O"}]
[{"$f":"Schema!A462&Schema!B462&Schema!C462&Schema!D462","v":"VEERB"},"MI",{"$f":"IF(A456=\"\",\"\",IF(LEN(Schema!A462)=2,1,IF(LEN(Schema!B462)=2,10,IF(LEN(Schema!C462)=2,100,0))))","v":0},10,{"$f":"IF(A456=\"\",\"\",SUM(Tabel2[[#This Row],[I1]:[I2]]))","v":10},{"$error":"#REF!"},"MI","",{"$error":"#REF!"},{"$f":"IF(C456=\"\",\"\",IF(LEN(Tabel2[[#This Row],[Entiteit of attribuut]])=2,\"\",Tabel2[[#This Row],[Entiteit]]&\"_\"&Tabel2[[#This Row],[Entiteit of attribuut]]))","v":"MI_VEERB"},{"$f":"IF(Schema!I462=\"\",\"\",Schema!I462)","v":""},{"$f":"IF(Schema!J462=\"\",\"\",Schema!J462)","v":""},{"$f":"IF(Schema!K462=\"\",\"\",Schema!K462)","v":""},{"$f":"IF(Schema!L462=\"\",\"\",Schema!L462)","v":""},{"$f":"IF(Schema!N462=\"\",\"\",Schema!N462)","v":"LEEG"}]
[{"$f":"Schema!A463&Schema!B463&Schema!C463&Schema!D463","v":"VERZSOM"},"MI",{"$f":"IF(A457=\"\",\"\",IF(LEN(Schema!A463)=2,1,IF(LEN(Schema!B463)=2,10,IF(LEN(Schema!C463)=2,100,0))))","v":0},10,{"$f":"IF(A457=\"\",\"\",SUM(Tabel2[[#This Row],[I1]:[I2]]))","v":10},{"$error":"#REF!"},"MI","",{"$error":"#REF!"},{"$f":"IF(C457=\"\",\"\",IF(LEN(Tabel2[[#This Row],[Entiteit of attribuut]])=2,\"\",Tabel2[[#This Row],[Entiteit]]&\"_\"&Tabel2[[#This Row],[Entiteit of attribuut]]))","v":"MI_VERZSOM"},{"$f":"IF(Schema!I463=\"\",\"\",Schema!I463)","v":""},{"$f":"IF(Schema!J463=\"\",\"\",Schema!J463)","v":""},{"$f":"IF(Schema!K463=\"\",\"\",Schema!K463)","v":""},{"$f":"IF(Schema!L463=\"\",\"\",Schema!L463)","v":""},{"$f":"IF(Schema!N463=\"\",\"\",Schema!N463)","v":"O"}]
[{"$f":"Schema!A464&Schema!B464&Schema!C464&Schema!D464","v":"VGBRA"},"MI",{"$f":"IF(A458=\"\",\"\",IF(LEN(Schema!A464)=2,1,IF(LEN(Schema!B464)=2,10,IF(LEN(Schema!C464)=2,100,0))))","v":0},10,{"$f":"IF(A458=\"\",\"\",SUM(Tabel2[[#This Row],[I1]:[I2]]))","v":10},{"$error":"#REF!"},"MI","",{"$error":"#REF!"},{"$f":"IF(C458=\"\",\"\",IF(LEN(Tabel2[[#This Row],[Entiteit of attribuut]])=2,\"\",Tabel2[[#This Row],[Entiteit]]&\"_\"&Tabel2[[#This Row],[Entiteit of attribuut]]))","v":"MI_VGBRA"},{"$f":"IF(Schema!I464=\"\",\"\",Schema!I464)","v":""},{"$f":"IF(Schema!J464=\"\",\"\",Schema!J464)","v":""},{"$f":"IF(Schema!K464=\"\",\"\",Schema!K464)","v":""},{"$f":"IF(Schema!L464=\"\",\"\",Schema!L464)","v":""},{"$f":"IF(Schema!N464=\"\",\"\",Schema!N464)","v":"O"}]
[{"$f":"Schema!A465&Schema!B465&Schema!C465&Schema!D465","v":"VOLGNUM"},"MI",{"$f":"IF(A459=\"\",\"\",IF(LEN(Schema!A465)=2,1,IF(LEN(Schema!B465)=2,10,IF(LEN(Schema!C465)=2,100,0))))","v":0},10,{"$f":"IF(A459=\"\",\"\",SUM(Tabel2[[#This Row],[I1]:[I2]]))","v":10},{"$error":"#REF!"},"MI","",{"$error":"#REF!"},{"$f":"IF(C459=\"\",\"\",IF(LEN(Tabel2[[#This Row],[Entiteit of attribuut]])=2,\"\",Tabel2[[#This Row],[Entiteit]]&\"_\"&Tabel2[[#This Row],[Entiteit of attribuut]]))","v":"MI_VOLGNUM"},{"$f":"IF(Schema!I465=\"\",\"\",Schema!I465)","v":""},{"$f":"IF(Schema!J465=\"\",\"\",Schema!J465)","v":""},{"$f":"IF(Schema!K465=\"\",\"\",Schema!K465)","v":""},{"$f":"IF(Schema!L465=\"\",\"\",Schema!L465)","v":""},{"$f":"IF(Schema!N465=\"\",\"\",Schema!N465)","v":"LEEG"}]
[{"$f":"Schema!A466&Schema!B466&Schema!C466&Schema!D466","v":"VRWRKCD"},"MI",{"$f":"IF(A460=\"\",\"\",IF(LEN(Schema!A466)=2,1,IF(LEN(Schema!B466)=2,10,IF(LEN(Schema!C466)=2,100,0))))","v":0},10,{"$f":"IF(A460=\"\",\"\",SUM(Tabel2[[#This Row],[I1]:[I2]]))","v":10},{"$error":"#REF!"},"MI","",{"$error":"#REF!"},{"$f":"IF(C460=\"\",\"\",IF(LEN(Tabel2[[#This Row],[Entiteit of attribuut]])=2,\"\",Tabel2[[#This Row],[Entiteit]]&\"_\"&Tabel2[[#This Row],[Entiteit of attribuut]]))","v":"MI_VRWRKCD"},{"$f":"IF(Schema!I466=\"\",\"\",Schema!I466)","v":""},{"$f":"IF(Schema!J466=\"\",\"\",Schema!J466)","v":""},{"$f":"IF(Schema!K466=\"\",\"\",Schema!K466)","v":""},{"$f":"IF(Schema!L466=\"\",\"\",Schema!L466)","v":""},{"$f":"IF(Schema!N466=\"\",\"\",Schema!N466)","v":"LEEG"}]
[{"$f":"Schema!A467&Schema!B467&Schema!C467&Schema!D467","v":"WPREMBP"},"MI",{"$f":"IF(A461=\"\",\"\",IF(LEN(Schema!A467)=2,1,IF(LEN(Schema!B467)=2,10,IF(LEN(Schema!C467)=2,100,0))))","v":0},10,{"$f":"IF(A461=\"\",\"\",SUM(Tabel2[[#This Row],[I1]:[I2]]))","v":10},{"$error":"#REF!"},"MI","",{"$error":"#REF!"},{"$f":"IF(C461=\"\",\"\",IF(LEN(Tabel2[[#This Row],[Entiteit of attribuut]])=2,\"\",Tabel2[[#This Row],[Entiteit]]&\"_\"&Tabel2[[#This Row],[Entiteit of attribuut]]))","v":"MI_WPREMBP"},{"$f":"IF(Schema!I467=\"\",\"\",Schema!I467)","v":""},{"$f":"IF(Schema!J467=\"\",\"\",Schema!J467)","v":""},{"$f":"IF(Schema!K467=\"\",\"\",Schema!K467)","v":""},{"$f":"IF(Schema!L467=\"\",\"\",Schema!L467)","v":""},{"$f":"IF(Schema!N467=\"\",\"\",Schema!N467)","v":"O"}]
[{"$f":"Schema!A468&Schema!B468&Schema!C468&Schema!D468","v":"MP"},"MP",{"$f":"IF(A462=\"\",\"\",IF(LEN(Schema!A468)=2,1,IF(LEN(Schema!B468)=2,10,IF(LEN(Schema!C468)=2,100,0))))","v":100},100,{"$f":"IF(A462=\"\",\"\",SUM(Tabel2[[#This Row],[I1]:[I2]]))","v":200},{"$error":"#REF!"},"MI","MP",{"$error":"#REF!"},{"$f":"IF(C462=\"\",\"\",IF(LEN(Tabel2[[#This Row],[Entiteit of attribuut]])=2,\"\",Tabel2[[#This Row],[Entiteit]]&\"_\"&Tabel2[[#This Row],[Entiteit of attribuut]]))","v":""},{"$f":"IF(Schema!I468=\"\",\"\",Schema!I468)","v":""},{"$f":"IF(Schema!J468=\"\",\"\",Schema!J468)","v":""},{"$f":"IF(Schema!K468=\"\",\"\",Schema!K468)","v":""},{"$f":"IF(Schema!L468=\"\",\"\",Schema!L468)","v":""},{"$f":"IF(Schema!N468=\"\",\"\",Schema!N468)","v":"O"}]
[{"$f":"Schema!A469&Schema!B469&Schema!C469&Schema!D469","v":"MYAAND"},"MP",{"$f":"IF(A463=\"\",\"\",IF(LEN(Schema!A469)=2,1,IF(LEN(Schema!B469)=2,10,IF(LEN(Schema!C469)=2,100,0))))","v":0},100,{"$f":"IF(A463=\"\",\"\",SUM(Tabel2[[#This Row],[I1]:[I2]]))","v":100},{"$error":"#REF!"},"MI","MP",{"$error":"#REF!"},{"$f":"IF(C463=\"\",\"\",IF(LEN(Tabel2[[#This Row],[Entiteit of attribuut]])=2,\"\",Tabel2[[#This Row],[Entiteit]]&\"_\"&Tabel2[[#This Row],[Entiteit of attribuut]]))","v":"MP_MYAAND"},{"$f":"IF(Schema!I469=\"\",\"\",Schema!I469)","v":""},{"$f":"IF(Schema!J469=\"\",\"\",Schema!J469)","v":""},{"$f":"IF(Schema!K469=\"\",\"\",Schema!K469)","v":""},{"$f":"IF(Schema!L469=\"\",\"\",Schema!L469)","v":""},{"$f":"IF(Schema!N469=\"\",\"\",Schema!N469)","v":"O"}]
[{"$f":"Schema!A470&Schema!B470&Schema!C470&Schema!D470","v":"PLLEAD"},"MP",{"$f":"IF(A464=\"\",\"\",IF(LEN(Schema!A470)=2,1,IF(LEN(Schema!B470)=2,10,IF(LEN(Schema!C470)=2,100,0))))","v":0},100,{"$f":"IF(A464=\"\",\"\",SUM(Tabel2[[#This Row],[I1]:[I2]]))","v":100},{"$error":"#REF!"},"MI","MP",{"$error":"#REF!"},{"$f":"IF(C464=\"\",\"\",IF(LEN(Tabel2[[#This Row],[Entiteit of attribuut]])=2,\"\",Tabel2[[#This Row],[Entiteit]]&\"_\"&Tabel2[[#This Row],[Entiteit of attribuut]]))","v":"MP_PLLEAD"},{"$f":"IF(Schema!I470=\"\",\"\",Schema!I470)","v":""},{"$f":"IF(Schema!J470=\"\",\"\",Schema!J470)","v":""},{"$f":"IF(Schema!K470=\"\",\"\",Schema!K470)","v":""},{"$f":"IF(Schema!L470=\"\",\"\",Schema!L470)","v":""},{"$f":"IF(Schema!N470=\"\",\"\",Schema!N470)","v":"O"}]
[{"$f":"Schema!A471&Schema!B471&Schema!C471&Schema!D471","v":"POOLNUM"},"MP",{"$f":"IF(A465=\"\",\"\",IF(LEN(Schema!A471)=2,1,IF(LEN(Schema!B471)=2,10,IF(LEN(Schema!C471)=2,100,0))))","v":0},100,{"$f":"IF(A465=\"\",\"\",SUM(Tabel2[[#This Row],[I1]:[I2]]))","v":100},{"$error":"#REF!"},"MI","MP",{"$error":"#REF!"},{"$f":"IF(C465=\"\",\"\",IF(LEN(Tabel2[[#This Row],[Entiteit of attribuut]])=2,\"\",Tabel2[[#This Row],[Entiteit]]&\"_\"&Tabel2[[#This Row],[Entiteit of attribuut]]))","v":"MP_POOLNUM"},{"$f":"IF(Schema!I471=\"\",\"\",Schema!I471)","v":""},{"$f":"IF(Schema!J471=\"\",\"\",Schema!J471)","v":""},{"$f":"IF(Schema!K471=\"\",\"\",Schema!K471)","v":""},{"$f":"IF(Schema!L471=\"\",\"\",Schema!L471)","v":""},{"$f":"IF(Schema!N471=\"\",\"\",Schema!N471)","v":"V"}]
[{"$f":"Schema!A472&Schema!B472&Schema!C472&Schema!D472","v":"POOLPRC"},"MP",{"$f":"IF(A466=\"\",\"\",IF(LEN(Schema!A472)=2,1,IF(LEN(Schema!B472)=2,10,IF(LEN(Schema!C472)=2,100,0))))","v":0},100,{"$f":"IF(A466=\"\",\"\",SUM(Tabel2[[#This Row],[I1]:[I2]]))","v":100},{"$error":"#REF!"},"MI","MP",{"$error":"#REF!"},{"$f":"IF(C466=\"\",\"\",IF(LEN(Tabel2[[#This Row],[Entiteit of attribuut]])=2,\"\",Tabel2[[#This Row],[Entiteit]]&\"_\"&Tabel2[[#This Row],[Entiteit of attribuut]]))","v":"MP_POOLPRC"},{"$f":"IF(Schema!I472=\"\",\"\",Schema!I472)","v":""},{"$f":"IF(Schema!J472=\"\",\"\",Schema!J472)","v":""},{"$f":"IF(Schema!K472=\"\",\"\",Schema!K472)","v":""},{"$f":"IF(Schema!L472=\"\",\"\",Schema!L472)","v":""},{"$f":"IF(Schema!N472=\"\",\"\",Schema!N472)","v":"V"}]
[{"$f":"Schema!A473&Schema!B473&Schema!C473&Schema!D473","v":"OP"},"OP",{"$f":"IF(A467=\"\",\"\",IF(LEN(Schema!A473)=2,1,IF(LEN(Schema!B473)=2,10,IF(LEN(Schema!C473)=2,100,0))))","v":10},10,{"$f":"IF(A467=\"\",\"\",SUM(Tabel2[[#This Row],[I1]:[I2]]))","v":20},{"$error":"#REF!"},"OP","",{"$error":"#REF!"},{"$f":"IF(C467=\"\",\"\",IF(LEN(Tabel2[[#This Row],[Entiteit of attribuut]])=2,\"\",Tabel2[[#This Row],[Entiteit]]&\"_\"&Tabel2[[#This Row],[Entiteit of attribuut]]))","v":""},{"$f":"IF(Schema!I473=\"\",\"\",Schema!I473)","v":""},{"$f":"IF(Schema!J473=\"\",\"\",Schema!J473)","v":""},{"$f":"IF(Schema!K473=\"\",\"\",Schema!K473)","v":""},{"$f":"IF(Schema!L473=\"\",\"\",Schema!L473)","v":""},{"$f":"IF(Schema!N473=\"\",\"\",Schema!N473)","v":"O"}]
[{"$f":"Schema!A474&Schema!B474&Schema!C474&Schema!D474","v":"BAFWST"},"OP",{"$f":"IF(A468=\"\",\"\",IF(LEN(Schema!A474)=2,1,IF(LEN(Schema!B474)=2,10,IF(LEN(Schema!C474)=2,100,0))))","v":0},10,{"$f":"IF(A468=\"\",\"\",SUM(Tabel2[[#This Row],[I1]:[I2]]))","v":10},{"$error":"#REF!"},"OP","",{"$error":"#REF!"},{"$f":"IF(C468=\"\",\"\",IF(LEN(Tabel2[[#This Row],[Entiteit of attribuut]])=2,\"\",Tabel2[[#This Row],[Entiteit]]&\"_\"&Tabel2[[#This Row],[Entiteit of attribuut]]))","v":"OP_BAFWST"},{"$f":"IF(Schema!I474=\"\",\"\",Schema!I474)","v":""},{"$f":"IF(Schema!J474=\"\",\"\",Schema!J474)","v":""},{"$f":"IF(Schema!K474=\"\",\"\",Schema!K474)","v":""},{"$f":"IF(Schema!L474=\"\",\"\",Schema!L474)","v":""},{"$f":"IF(Schema!N474=\"\",\"\",Schema!N474)","v":"O"}]
[{"$f":"Schema!A475&Schema!B475&Schema!C475&Schema!D475","v":"BTP"},"OP",{"$f":"IF(A469=\"\",\"\",IF(LEN(Schema!A475)=2,1,IF(LEN(Schema!B475)=2,10,IF(LEN(Schema!C475)=2,100,0))))","v":0},10,{"$f":"IF(A469=\"\",\"\",SUM(Tabel2[[#This Row],[I1]:[I2]]))","v":10},{"$error":"#REF!"},"OP","",{"$error":"#REF!"},{"$f":"IF(C469=\"\",\"\",IF(LEN(Tabel2[[#This Row],[Entiteit of attribuut]])=2,\"\",Tabel2[[#This Row],[Entiteit]]&\"_\"&Tabel2[[#This Row],[Entiteit of attribuut]]))","v":"OP_BTP"},{"$f":"IF(Schema!I475=\"\",\"\",Schema!I475)","v":""},{"$f":"IF(Schema!J475=\"\",\"\",Schema!J475)","v":""},{"$f":"IF(Schema!K475=\"\",\"\",Schema!K475)","v":""},{"$f":"IF(Schema!L475=\"\",\"\",Schema!L475)","v":""},{"$f":"IF(Schema!N475=\"\",\"\",Schema!N475)","v":"LEEG"}]
[{"$f":"Schema!A476&Schema!B476&Schema!C476&Schema!D476","v":"CODE"},"OP",{"$f":"IF(A470=\"\",\"\",IF(LEN(Schema!A476)=2,1,IF(LEN(Schema!B476)=2,10,IF(LEN(Schema!C476)=2,100,0))))","v":0},10,{"$f":"IF(A470=\"\",\"\",SUM(Tabel2[[#This Row],[I1]:[I2]]))","v":10},{"$error":"#REF!"},"OP","",{"$error":"#REF!"},{"$f":"IF(C470=\"\",\"\",IF(LEN(Tabel2[[#This Row],[Entiteit of attribuut]])=2,\"\",Tabel2[[#This Row],[Entiteit]]&\"_\"&Tabel2[[#This Row],[Entiteit of attribuut]]))","v":"OP_CODE"},{"$f":"IF(Schema!I476=\"\",\"\",Schema!I476)","v":""},{"$f":"IF(Schema!J476=\"\",\"\",Schema!J476)","v":""},{"$f":"IF(Schema!K476=\"\",\"\",Schema!K476)","v":""},{"$f":"IF(Schema!L476=\"\",\"\",Schema!L476)","v":""},{"$f":"IF(Schema!N476=\"\",\"\",Schema!N476)","v":"O"}]
[{"$f":"Schema!A477&Schema!B477&Schema!C477&Schema!D477","v":"COLFACT"},"OP",{"$f":"IF(A471=\"\",\"\",IF(LEN(Schema!A477)=2,1,IF(LEN(Schema!B477)=2,10,IF(LEN(Schema!C477)=2,100,0))))","v":0},10,{"$f":"IF(A471=\"\",\"\",SUM(Tabel2[[#This Row],[I1]:[I2]]))","v":10},{"$error":"#REF!"},"OP","",{"$error":"#REF!"},{"$f":"IF(C471=\"\",\"\",IF(LEN(Tabel2[[#This Row],[Entiteit of attribuut]])=2,\"\",Tabel2[[#This Row],[Entiteit]]&\"_\"&Tabel2[[#This Row],[Entiteit of attribuut]]))","v":"OP_COLFACT"},{"$f":"IF(Schema!I477=\"\",\"\",Schema!I477)","v":""},{"$f":"IF(Schema!J477=\"\",\"\",Schema!J477)","v":""},{"$f":"IF(Schema!K477=\"\",\"\",Schema!K477)","v":""},{"$f":"IF(Schema!L477=\"\",\"\",Schema!L477)","v":""},{"$f":"IF(Schema!N477=\"\",\"\",Schema!N477)","v":"O"}]
[{"$f":"Schema!A478&Schema!B478&Schema!C478&Schema!D478","v":"ERB"},"OP",{"$f":"IF(A472=\"\",\"\",IF(LEN(Schema!A478)=2,1,IF(LEN(Schema!B478)=2,10,IF(LEN(Schema!C478)=2,100,0))))","v":0},10,{"$f":"IF(A472=\"\",\"\",SUM(Tabel2[[#This Row],[I1]:[I2]]))","v":10},{"$error":"#REF!"},"OP","",{"$error":"#REF!"},{"$f":"IF(C472=\"\",\"\",IF(LEN(Tabel2[[#This Row],[Entiteit of attribuut]])=2,\"\",Tabel2[[#This Row],[Entiteit]]&\"_\"&Tabel2[[#This Row],[Entiteit of attribuut]]))","v":"OP_ERB"},{"$f":"IF(Schema!I478=\"\",\"\",Schema!I478)","v":""},{"$f":"IF(Schema!J478=\"\",\"\",Schema!J478)","v":""},{"$f":"IF(Schema!K478=\"\",\"\",Schema!K478)","v":""},{"$f":"IF(Schema!L478=\"\",\"\",Schema!L478)","v":""},{"$f":"IF(Schema!N478=\"\",\"\",Schema!N478)","v":"O"}]
[{"$f":"Schema!A479&Schema!B479&Schema!C479&Schema!D479","v":"GADEKCD"},"OP",{"$f":"IF(A473=\"\",\"\",IF(LEN(Schema!A479)=2,1,IF(LEN(Schema!B479)=2,10,IF(LEN(Schema!C479)=2,100,0))))","v":0},10,{"$f":"IF(A473=\"\",\"\",SUM(Tabel2[[#This Row],[I1]:[I2]]))","v":10},{"$error":"#REF!"},"OP","",{"$error":"#REF!"},{"$f":"IF(C473=\"\",\"\",IF(LEN(Tabel2[[#This Row],[Entiteit of attribuut]])=2,\"\",Tabel2[[#This Row],[Entiteit]]&\"_\"&Tabel2[[#This Row],[Entiteit of attribuut]]))","v":"OP_GADEKCD"},{"$f":"IF(Schema!I479=\"\",\"\",Schema!I479)","v":""},{"$f":"IF(Schema!J479=\"\",\"\",Schema!J479)","v":""},{"$f":"IF(Schema!K479=\"\",\"\",Schema!K479)","v":""},{"$f":"IF(Schema!L479=\"\",\"\",Schema!L479)","v":""},{"$f":"IF(Schema!N479=\"\",\"\",Schema!N479)","v":"V"}]
[{"$f":"Schema!A480&Schema!B480&Schema!C480&Schema!D480","v":"GADEKCO"},"OP",{"$f":"IF(A474=\"\",\"\",IF(LEN(Schema!A480)=2,1,IF(LEN(Schema!B480)=2,10,IF(LEN(Schema!C480)=2,100,0))))","v":0},10,{"$f":"IF(A474=\"\",\"\",SUM(Tabel2[[#This Row],[I1]:[I2]]))","v":10},{"$error":"#REF!"},"OP","",{"$error":"#REF!"},{"$f":"IF(C474=\"\",\"\",IF(LEN(Tabel2[[#This Row],[Entiteit of attribuut]])=2,\"\",Tabel2[[#This Row],[Entiteit]]&\"_\"&Tabel2[[#This Row],[Entiteit of attribuut]]))","v":"OP_GADEKCO"},{"$f":"IF(Schema!I480=\"\",\"\",Schema!I480)","v":""},{"$f":"IF(Schema!J480=\"\",\"\",Schema!J480)","v":""},{"$f":"IF(Schema!K480=\"\",\"\",Schema!K480)","v":""},{"$f":"IF(Schema!L480=\"\",\"\",Schema!L480)","v":""},{"$f":"IF(Schema!N480=\"\",\"\",Schema!N480)","v":"V"}]
[{"$f":"Schema!A481&Schema!B481&Schema!C481&Schema!D481","v":"MYCODE"},"OP",{"$f":"IF(A475=\"\",\"\",IF(LEN(Schema!A481)=2,1,IF(LEN(Schema!B481)=2,10,IF(LEN(Schema!C481)=2,100,0))))","v":0},10,{"$f":"IF(A475=\"\",\"\",SUM(Tabel2[[#This Row],[I1]:[I2]]))","v":10},{"$error":"#REF!"},"OP","",{"$error":"#REF!"},{"$f":"IF(C475=\"\",\"\",IF(LEN(Tabel2[[#This Row],[Entiteit of attribuut]])=2,\"\",Tabel2[[#This Row],[Entiteit]]&\"_\"&Tabel2[[#This Row],[Entiteit of attribuut]]))","v":"OP_MYCODE"},{"$f":"IF(Schema!I481=\"\",\"\",Schema!I481)","v":""},{"$f":"IF(Schema!J481=\"\",\"\",Schema!J481)","v":""},{"$f":"IF(Schema!K481=\"\",\"\",Schema!K481)","v":""},{"$f":"IF(Schema!L481=\"\",\"\",Schema!L481)","v":""},{"$f":"IF(Schema!N481=\"\",\"\",Schema!N481)","v":"O"}]
[{"$f":"Schema!A482&Schema!B482&Schema!C482&Schema!D482","v":"NJP"},"OP",{"$f":"IF(A476=\"\",\"\",IF(LEN(Schema!A482)=2,1,IF(LEN(Schema!B482)=2,10,IF(LEN(Schema!C482)=2,100,0))))","v":0},10,{"$f":"IF(A476=\"\",\"\",SUM(Tabel2[[#This Row],[I1]:[I2]]))","v":10},{"$error":"#REF!"},"OP","",{"$error":"#REF!"},{"$f":"IF(C476=\"\",\"\",IF(LEN(Tabel2[[#This Row],[Entiteit of attribuut]])=2,\"\",Tabel2[[#This Row],[Entiteit]]&\"_\"&Tabel2[[#This Row],[Entiteit of attribuut]]))","v":"OP_NJP"},{"$f":"IF(Schema!I482=\"\",\"\",Schema!I482)","v":""},{"$f":"IF(Schema!J482=\"\",\"\",Schema!J482)","v":""},{"$f":"IF(Schema!K482=\"\",\"\",Schema!K482)","v":""},{"$f":"IF(Schema!L482=\"\",\"\",Schema!L482)","v":""},{"$f":"IF(Schema!N482=\"\",\"\",Schema!N482)","v":"O"}]
[{"$f":"Schema!A483&Schema!B483&Schema!C483&Schema!D483","v":"PAFWST"},"OP",{"$f":"IF(A477=\"\",\"\",IF(LEN(Schema!A483)=2,1,IF(LEN(Schema!B483)=2,10,IF(LEN(Schema!C483)=2,100,0))))","v":0},10,{"$f":"IF(A477=\"\",\"\",SUM(Tabel2[[#This Row],[I1]:[I2]]))","v":10},{"$error":"#REF!"},"OP","",{"$error":"#REF!"},{"$f":"IF(C477=\"\",\"\",IF(LEN(Tabel2[[#This Row],[Entiteit of attribuut]])=2,\"\",Tabel2[[#This Row],[Entiteit]]&\"_\"&Tabel2[[#This Row],[Entiteit of attribuut]]))","v":"OP_PAFWST"},{"$f":"IF(Schema!I483=\"\",\"\",Schema!I483)","v":""},{"$f":"IF(Schema!J483=\"\",\"\",Schema!J483)","v":""},{"$f":"IF(Schema!K483=\"\",\"\",Schema!K483)","v":""},{"$f":"IF(Schema!L483=\"\",\"\",Schema!L483)","v":""},{"$f":"IF(Schema!N483=\"\",\"\",Schema!N483)","v":"O"}]
[{"$f":"Schema!A484&Schema!B484&Schema!C484&Schema!D484","v":"PPRC"},"OP",{"$f":"IF(A478=\"\",\"\",IF(LEN(Schema!A484)=2,1,IF(LEN(Schema!B484)=2,10,IF(LEN(Schema!C484)=2,100,0))))","v":0},10,{"$f":"IF(A478=\"\",\"\",SUM(Tabel2[[#This Row],[I1]:[I2]]))","v":10},{"$error":"#REF!"},"OP","",{"$error":"#REF!"},{"$f":"IF(C478=\"\",\"\",IF(LEN(Tabel2[[#This Row],[Entiteit of attribuut]])=2,\"\",Tabel2[[#This Row],[Entiteit]]&\"_\"&Tabel2[[#This Row],[Entiteit of attribuut]]))","v":"OP_PPRC"},{"$f":"IF(Schema!I484=\"\",\"\",Schema!I484)","v":""},{"$f":"IF(Schema!J484=\"\",\"\",Schema!J484)","v":""},{"$f":"IF(Schema!K484=\"\",\"\",Schema!K484)","v":""},{"$f":"IF(Schema!L484=\"\",\"\",Schema!L484)","v":""},{"$f":"IF(Schema!N484=\"\",\"\",Schema!N484)","v":"O"}]
[{"$f":"Schema!A485&Schema!B485&Schema!C485&Schema!D485","v":"PRCPKKT"},"OP",{"$f":"IF(A479=\"\",\"\",IF(LEN(Schema!A485)=2,1,IF(LEN(Schema!B485)=2,10,IF(LEN(Schema!C485)=2,100,0))))","v":0},10,{"$f":"IF(A479=\"\",\"\",SUM(Tabel2[[#This Row],[I1]:[I2]]))","v":10},{"$error":"#REF!"},"OP","",{"$error":"#REF!"},{"$f":"IF(C479=\"\",\"\",IF(LEN(Tabel2[[#This Row],[Entiteit of attribuut]])=2,\"\",Tabel2[[#This Row],[Entiteit]]&\"_\"&Tabel2[[#This Row],[Entiteit of attribuut]]))","v":"OP_PRCPKKT"},{"$f":"IF(Schema!I485=\"\",\"\",Schema!I485)","v":""},{"$f":"IF(Schema!J485=\"\",\"\",Schema!J485)","v":""},{"$f":"IF(Schema!K485=\"\",\"\",Schema!K485)","v":""},{"$f":"IF(Schema!L485=\"\",\"\",Schema!L485)","v":""},{"$f":"IF(Schema!N485=\"\",\"\",Schema!N485)","v":"O"}]
[{"$f":"Schema!A486&Schema!B486&Schema!C486&Schema!D486","v":"PRCTEKC"},"OP",{"$f":"IF(A480=\"\",\"\",IF(LEN(Schema!A486)=2,1,IF(LEN(Schema!B486)=2,10,IF(LEN(Schema!C486)=2,100,0))))","v":0},10,{"$f":"IF(A480=\"\",\"\",SUM(Tabel2[[#This Row],[I1]:[I2]]))","v":10},{"$error":"#REF!"},"OP","",{"$error":"#REF!"},{"$f":"IF(C480=\"\",\"\",IF(LEN(Tabel2[[#This Row],[Entiteit of attribuut]])=2,\"\",Tabel2[[#This Row],[Entiteit]]&\"_\"&Tabel2[[#This Row],[Entiteit of attribuut]]))","v":"OP_PRCTEKC"},{"$f":"IF(Schema!I486=\"\",\"\",Schema!I486)","v":""},{"$f":"IF(Schema!J486=\"\",\"\",Schema!J486)","v":""},{"$f":"IF(Schema!K486=\"\",\"\",Schema!K486)","v":""},{"$f":"IF(Schema!L486=\"\",\"\",Schema!L486)","v":""},{"$f":"IF(Schema!N486=\"\",\"\",Schema!N486)","v":"O"}]
[{"$f":"Schema!A487&Schema!B487&Schema!C487&Schema!D487","v":"RELVRH"},"OP",{"$f":"IF(A481=\"\",\"\",IF(LEN(Schema!A487)=2,1,IF(LEN(Schema!B487)=2,10,IF(LEN(Schema!C487)=2,100,0))))","v":0},10,{"$f":"IF(A481=\"\",\"\",SUM(Tabel2[[#This Row],[I1]:[I2]]))","v":10},{"$error":"#REF!"},"OP","",{"$error":"#REF!"},{"$f":"IF(C481=\"\",\"\",IF(LEN(Tabel2[[#This Row],[Entiteit of attribuut]])=2,\"\",Tabel2[[#This Row],[Entiteit]]&\"_\"&Tabel2[[#This Row],[Entiteit of attribuut]]))","v":"OP_RELVRH"},{"$f":"IF(Schema!I487=\"\",\"\",Schema!I487)","v":""},{"$f":"IF(Schema!J487=\"\",\"\",Schema!J487)","v":""},{"$f":"IF(Schema!K487=\"\",\"\",Schema!K487)","v":""},{"$f":"IF(Schema!L487=\"\",\"\",Schema!L487)","v":""},{"$f":"IF(Schema!N487=\"\",\"\",Schema!N487)","v":"O"}]
[{"$f":"Schema!A488&Schema!B488&Schema!C488&Schema!D488","v":"RELVVNR"},"OP",{"$f":"IF(A482=\"\",\"\",IF(LEN(Schema!A488)=2,1,IF(LEN(Schema!B488)=2,10,IF(LEN(Schema!C488)=2,100,0))))","v":0},10,{"$f":"IF(A482=\"\",\"\",SUM(Tabel2[[#This Row],[I1]:[I2]]))","v":10},{"$error":"#REF!"},"OP","",{"$error":"#REF!"},{"$f":"IF(C482=\"\",\"\",IF(LEN(Tabel2[[#This Row],[Entiteit of attribuut]])=2,\"\",Tabel2[[#This Row],[Entiteit]]&\"_\"&Tabel2[[#This Row],[Entiteit of attribuut]]))","v":"OP_RELVVNR"},{"$f":"IF(Schema!I488=\"\",\"\",Schema!I488)","v":""},{"$f":"IF(Schema!J488=\"\",\"\",Schema!J488)","v":""},{"$f":"IF(Schema!K488=\"\",\"\",Schema!K488)","v":""},{"$f":"IF(Schema!L488=\"\",\"\",Schema!L488)","v":""},{"$f":"IF(Schema!N488=\"\",\"\",Schema!N488)","v":"O"}]
[{"$f":"Schema!A489&Schema!B489&Schema!C489&Schema!D489","v":"RJRCOR"},"OP",{"$f":"IF(A483=\"\",\"\",IF(LEN(Schema!A489)=2,1,IF(LEN(Schema!B489)=2,10,IF(LEN(Schema!C489)=2,100,0))))","v":0},10,{"$f":"IF(A483=\"\",\"\",SUM(Tabel2[[#This Row],[I1]:[I2]]))","v":10},{"$error":"#REF!"},"OP","",{"$error":"#REF!"},{"$f":"IF(C483=\"\",\"\",IF(LEN(Tabel2[[#This Row],[Entiteit of attribuut]])=2,\"\",Tabel2[[#This Row],[Entiteit]]&\"_\"&Tabel2[[#This Row],[Entiteit of attribuut]]))","v":"OP_RJRCOR"},{"$f":"IF(Schema!I489=\"\",\"\",Schema!I489)","v":""},{"$f":"IF(Schema!J489=\"\",\"\",Schema!J489)","v":""},{"$f":"IF(Schema!K489=\"\",\"\",Schema!K489)","v":""},{"$f":"IF(Schema!L489=\"\",\"\",Schema!L489)","v":""},{"$f":"IF(Schema!N489=\"\",\"\",Schema!N489)","v":"O"}]
[{"$f":"Schema!A490&Schema!B490&Schema!C490&Schema!D490","v":"TCORBDR"},"OP",{"$f":"IF(A484=\"\",\"\",IF(LEN(Schema!A490)=2,1,IF(LEN(Schema!B490)=2,10,IF(LEN(Schema!C490)=2,100,0))))","v":0},10,{"$f":"IF(A484=\"\",\"\",SUM(Tabel2[[#This Row],[I1]:[I2]]))","v":10},{"$error":"#REF!"},"OP","",{"$error":"#REF!"},{"$f":"IF(C484=\"\",\"\",IF(LEN(Tabel2[[#This Row],[Entiteit of attribuut]])=2,\"\",Tabel2[[#This Row],[Entiteit]]&\"_\"&Tabel2[[#This Row],[Entiteit of attribuut]]))","v":"OP_TCORBDR"},{"$f":"IF(Schema!I490=\"\",\"\",Schema!I490)","v":""},{"$f":"IF(Schema!J490=\"\",\"\",Schema!J490)","v":""},{"$f":"IF(Schema!K490=\"\",\"\",Schema!K490)","v":""},{"$f":"IF(Schema!L490=\"\",\"\",Schema!L490)","v":""},{"$f":"IF(Schema!N490=\"\",\"\",Schema!N490)","v":"O"}]
[{"$f":"Schema!A491&Schema!B491&Schema!C491&Schema!D491","v":"VERZSOM"},"OP",{"$f":"IF(A485=\"\",\"\",IF(LEN(Schema!A491)=2,1,IF(LEN(Schema!B491)=2,10,IF(LEN(Schema!C491)=2,100,0))))","v":0},10,{"$f":"IF(A485=\"\",\"\",SUM(Tabel2[[#This Row],[I1]:[I2]]))","v":10},{"$error":"#REF!"},"OP","",{"$error":"#REF!"},{"$f":"IF(C485=\"\",\"\",IF(LEN(Tabel2[[#This Row],[Entiteit of attribuut]])=2,\"\",Tabel2[[#This Row],[Entiteit]]&\"_\"&Tabel2[[#This Row],[Entiteit of attribuut]]))","v":"OP_VERZSOM"},{"$f":"IF(Schema!I491=\"\",\"\",Schema!I491)","v":""},{"$f":"IF(Schema!J491=\"\",\"\",Schema!J491)","v":""},{"$f":"IF(Schema!K491=\"\",\"\",Schema!K491)","v":""},{"$f":"IF(Schema!L491=\"\",\"\",Schema!L491)","v":""},{"$f":"IF(Schema!N491=\"\",\"\",Schema!N491)","v":"O"}]
[{"$f":"Schema!A492&Schema!B492&Schema!C492&Schema!D492","v":"VGBRA"},"OP",{"$f":"IF(A486=\"\",\"\",IF(LEN(Schema!A492)=2,1,IF(LEN(Schema!B492)=2,10,IF(LEN(Schema!C492)=2,100,0))))","v":0},10,{"$f":"IF(A486=\"\",\"\",SUM(Tabel2[[#This Row],[I1]:[I2]]))","v":10},{"$error":"#REF!"},"OP","",{"$error":"#REF!"},{"$f":"IF(C486=\"\",\"\",IF(LEN(Tabel2[[#This Row],[Entiteit of attribuut]])=2,\"\",Tabel2[[#This Row],[Entiteit]]&\"_\"&Tabel2[[#This Row],[Entiteit of attribuut]]))","v":"OP_VGBRA"},{"$f":"IF(Schema!I492=\"\",\"\",Schema!I492)","v":""},{"$f":"IF(Schema!J492=\"\",\"\",Schema!J492)","v":""},{"$f":"IF(Schema!K492=\"\",\"\",Schema!K492)","v":""},{"$f":"IF(Schema!L492=\"\",\"\",Schema!L492)","v":""},{"$f":"IF(Schema!N492=\"\",\"\",Schema!N492)","v":"O"}]
[{"$f":"Schema!A493&Schema!B493&Schema!C493&Schema!D493","v":"VOLGNUM"},"OP",{"$f":"IF(A487=\"\",\"\",IF(LEN(Schema!A493)=2,1,IF(LEN(Schema!B493)=2,10,IF(LEN(Schema!C493)=2,100,0))))","v":0},10,{"$f":"IF(A487=\"\",\"\",SUM(Tabel2[[#This Row],[I1]:[I2]]))","v":10},{"$error":"#REF!"},"OP","",{"$error":"#REF!"},{"$f":"IF(C487=\"\",\"\",IF(LEN(Tabel2[[#This Row],[Entiteit of attribuut]])=2,\"\",Tabel2[[#This Row],[Entiteit]]&\"_\"&Tabel2[[#This Row],[Entiteit of attribuut]]))","v":"OP_VOLGNUM"},{"$f":"IF(Schema!I493=\"\",\"\",Schema!I493)","v":""},{"$f":"IF(Schema!J493=\"\",\"\",Schema!J493)","v":""},{"$f":"IF(Schema!K493=\"\",\"\",Schema!K493)","v":""},{"$f":"IF(Schema!L493=\"\",\"\",Schema!L493)","v":""},{"$f":"IF(Schema!N493=\"\",\"\",Schema!N493)","v":"LEEG"}]
[{"$f":"Schema!A494&Schema!B494&Schema!C494&Schema!D494","v":"VRWRKCD"},"OP",{"$f":"IF(A488=\"\",\"\",IF(LEN(Schema!A494)=2,1,IF(LEN(Schema!B494)=2,10,IF(LEN(Schema!C494)=2,100,0))))","v":0},10,{"$f":"IF(A488=\"\",\"\",SUM(Tabel2[[#This Row],[I1]:[I2]]))","v":10},{"$error":"#REF!"},"OP","",{"$error":"#REF!"},{"$f":"IF(C488=\"\",\"\",IF(LEN(Tabel2[[#This Row],[Entiteit of attribuut]])=2,\"\",Tabel2[[#This Row],[Entiteit]]&\"_\"&Tabel2[[#This Row],[Entiteit of attribuut]]))","v":"OP_VRWRKCD"},{"$f":"IF(Schema!I494=\"\",\"\",Schema!I494)","v":""},{"$f":"IF(Schema!J494=\"\",\"\",Schema!J494)","v":""},{"$f":"IF(Schema!K494=\"\",\"\",Schema!K494)","v":""},{"$f":"IF(Schema!L494=\"\",\"\",Schema!L494)","v":""},{"$f":"IF(Schema!N494=\"\",\"\",Schema!N494)","v":"LEEG"}]
[{"$f":"Schema!A495&Schema!B495&Schema!C495&Schema!D495","v":"WPREMBP"},"OP",{"$f":"IF(A489=\"\",\"\",IF(LEN(Schema!A495)=2,1,IF(LEN(Schema!B495)=2,10,IF(LEN(Schema!C495)=2,100,0))))","v":0},10,{"$f":"IF(A489=\"\",\"\",SUM(Tabel2[[#This Row],[I1]:[I2]]))","v":10},{"$error":"#REF!"},"OP","",{"$error":"#REF!"},{"$f":"IF(C489=\"\",\"\",IF(LEN(Tabel2[[#This Row],[Entiteit of attribuut]])=2,\"\",Tabel2[[#This Row],[Entiteit]]&\"_\"&Tabel2[[#This Row],[Entiteit of attribuut]]))","v":"OP_WPREMBP"},{"$f":"IF(Schema!I495=\"\",\"\",Schema!I495)","v":""},{"$f":"IF(Schema!J495=\"\",\"\",Schema!J495)","v":""},{"$f":"IF(Schema!K495=\"\",\"\",Schema!K495)","v":""},{"$f":"IF(Schema!L495=\"\",\"\",Schema!L495)","v":""},{"$f":"IF(Schema!N495=\"\",\"\",Schema!N495)","v":"O"}]
[{"$f":"Schema!A496&Schema!B496&Schema!C496&Schema!D496","v":"MP"},"MP",{"$f":"IF(A490=\"\",\"\",IF(LEN(Schema!A496)=2,1,IF(LEN(Schema!B496)=2,10,IF(LEN(Schema!C496)=2,100,0))))","v":100},100,{"$f":"IF(A490=\"\",\"\",SUM(Tabel2[[#This Row],[I1]:[I2]]))","v":200},{"$error":"#REF!"},"OP","MP",{"$error":"#REF!"},{"$f":"IF(C490=\"\",\"\",IF(LEN(Tabel2[[#This Row],[Entiteit of attribuut]])=2,\"\",Tabel2[[#This Row],[Entiteit]]&\"_\"&Tabel2[[#This Row],[Entiteit of attribuut]]))","v":""},{"$f":"IF(Schema!I496=\"\",\"\",Schema!I496)","v":""},{"$f":"IF(Schema!J496=\"\",\"\",Schema!J496)","v":""},{"$f":"IF(Schema!K496=\"\",\"\",Schema!K496)","v":""},{"$f":"IF(Schema!L496=\"\",\"\",Schema!L496)","v":""},{"$f":"IF(Schema!N496=\"\",\"\",Schema!N496)","v":"O"}]
[{"$f":"Schema!A497&Schema!B497&Schema!C497&Schema!D497","v":"MYAAND"},"MP",{"$f":"IF(A491=\"\",\"\",IF(LEN(Schema!A497)=2,1,IF(LEN(Schema!B497)=2,10,IF(LEN(Schema!C497)=2,100,0))))","v":0},100,{"$f":"IF(A491=\"\",\"\",SUM(Tabel2[[#This Row],[I1]:[I2]]))","v":100},{"$error":"#REF!"},"OP","MP",{"$error":"#REF!"},{"$f":"IF(C491=\"\",\"\",IF(LEN(Tabel2[[#This Row],[Entiteit of attribuut]])=2,\"\",Tabel2[[#This Row],[Entiteit]]&\"_\"&Tabel2[[#This Row],[Entiteit of attribuut]]))","v":"MP_MYAAND"},{"$f":"IF(Schema!I497=\"\",\"\",Schema!I497)","v":""},{"$f":"IF(Schema!J497=\"\",\"\",Schema!J497)","v":""},{"$f":"IF(Schema!K497=\"\",\"\",Schema!K497)","v":""},{"$f":"IF(Schema!L497=\"\",\"\",Schema!L497)","v":""},{"$f":"IF(Schema!N497=\"\",\"\",Schema!N497)","v":"O"}]
[{"$f":"Schema!A498&Schema!B498&Schema!C498&Schema!D498","v":"PLLEAD"},"MP",{"$f":"IF(A492=\"\",\"\",IF(LEN(Schema!A498)=2,1,IF(LEN(Schema!B498)=2,10,IF(LEN(Schema!C498)=2,100,0))))","v":0},100,{"$f":"IF(A492=\"\",\"\",SUM(Tabel2[[#This Row],[I1]:[I2]]))","v":100},{"$error":"#REF!"},"OP","MP",{"$error":"#REF!"},{"$f":"IF(C492=\"\",\"\",IF(LEN(Tabel2[[#This Row],[Entiteit of attribuut]])=2,\"\",Tabel2[[#This Row],[Entiteit]]&\"_\"&Tabel2[[#This Row],[Entiteit of attribuut]]))","v":"MP_PLLEAD"},{"$f":"IF(Schema!I498=\"\",\"\",Schema!I498)","v":""},{"$f":"IF(Schema!J498=\"\",\"\",Schema!J498)","v":""},{"$f":"IF(Schema!K498=\"\",\"\",Schema!K498)","v":""},{"$f":"IF(Schema!L498=\"\",\"\",Schema!L498)","v":""},{"$f":"IF(Schema!N498=\"\",\"\",Schema!N498)","v":"O"}]
[{"$f":"Schema!A499&Schema!B499&Schema!C499&Schema!D499","v":"POOLNUM"},"MP",{"$f":"IF(A493=\"\",\"\",IF(LEN(Schema!A499)=2,1,IF(LEN(Schema!B499)=2,10,IF(LEN(Schema!C499)=2,100,0))))","v":0},100,{"$f":"IF(A493=\"\",\"\",SUM(Tabel2[[#This Row],[I1]:[I2]]))","v":100},{"$error":"#REF!"},"OP","MP",{"$error":"#REF!"},{"$f":"IF(C493=\"\",\"\",IF(LEN(Tabel2[[#This Row],[Entiteit of attribuut]])=2,\"\",Tabel2[[#This Row],[Entiteit]]&\"_\"&Tabel2[[#This Row],[Entiteit of attribuut]]))","v":"MP_POOLNUM"},{"$f":"IF(Schema!I499=\"\",\"\",Schema!I499)","v":""},{"$f":"IF(Schema!J499=\"\",\"\",Schema!J499)","v":""},{"$f":"IF(Schema!K499=\"\",\"\",Schema!K499)","v":""},{"$f":"IF(Schema!L499=\"\",\"\",Schema!L499)","v":""},{"$f":"IF(Schema!N499=\"\",\"\",Schema!N499)","v":"V"}]
[{"$f":"Schema!A500&Schema!B500&Schema!C500&Schema!D500","v":"POOLPRC"},"MP",{"$f":"IF(A494=\"\",\"\",IF(LEN(Schema!A500)=2,1,IF(LEN(Schema!B500)=2,10,IF(LEN(Schema!C500)=2,100,0))))","v":0},100,{"$f":"IF(A494=\"\",\"\",SUM(Tabel2[[#This Row],[I1]:[I2]]))","v":100},{"$error":"#REF!"},"OP","MP",{"$error":"#REF!"},{"$f":"IF(C494=\"\",\"\",IF(LEN(Tabel2[[#This Row],[Entiteit of attribuut]])=2,\"\",Tabel2[[#This Row],[Entiteit]]&\"_\"&Tabel2[[#This Row],[Entiteit of attribuut]]))","v":"MP_POOLPRC"},{"$f":"IF(Schema!I500=\"\",\"\",Schema!I500)","v":""},{"$f":"IF(Schema!J500=\"\",\"\",Schema!J500)","v":""},{"$f":"IF(Schema!K500=\"\",\"\",Schema!K500)","v":""},{"$f":"IF(Schema!L500=\"\",\"\",Schema!L500)","v":""},{"$f":"IF(Schema!N500=\"\",\"\",Schema!N500)","v":"V"}]
[{"$f":"Schema!A501&Schema!B501&Schema!C501&Schema!D501","v":"SU"},"SU",{"$f":"IF(A495=\"\",\"\",IF(LEN(Schema!A501)=2,1,IF(LEN(Schema!B501)=2,10,IF(LEN(Schema!C501)=2,100,0))))","v":10},10,{"$f":"IF(A495=\"\",\"\",SUM(Tabel2[[#This Row],[I1]:[I2]]))","v":20},{"$error":"#REF!"},"SU","",{"$error":"#REF!"},{"$f":"IF(C495=\"\",\"\",IF(LEN(Tabel2[[#This Row],[Entiteit of attribuut]])=2,\"\",Tabel2[[#This Row],[Entiteit]]&\"_\"&Tabel2[[#This Row],[Entiteit of attribuut]]))","v":""},{"$f":"IF(Schema!I501=\"\",\"\",Schema!I501)","v":""},{"$f":"IF(Schema!J501=\"\",\"\",Schema!J501)","v":""},{"$f":"IF(Schema!K501=\"\",\"\",Schema!K501)","v":""},{"$f":"IF(Schema!L501=\"\",\"\",Schema!L501)","v":""},{"$f":"IF(Schema!N501=\"\",\"\",Schema!N501)","v":"O"}]
[{"$f":"Schema!A502&Schema!B502&Schema!C502&Schema!D502","v":"BAFWST"},"SU",{"$f":"IF(A496=\"\",\"\",IF(LEN(Schema!A502)=2,1,IF(LEN(Schema!B502)=2,10,IF(LEN(Schema!C502)=2,100,0))))","v":0},10,{"$f":"IF(A496=\"\",\"\",SUM(Tabel2[[#This Row],[I1]:[I2]]))","v":10},{"$error":"#REF!"},"SU","",{"$error":"#REF!"},{"$f":"IF(C496=\"\",\"\",IF(LEN(Tabel2[[#This Row],[Entiteit of attribuut]])=2,\"\",Tabel2[[#This Row],[Entiteit]]&\"_\"&Tabel2[[#This Row],[Entiteit of attribuut]]))","v":"SU_BAFWST"},{"$f":"IF(Schema!I502=\"\",\"\",Schema!I502)","v":""},{"$f":"IF(Schema!J502=\"\",\"\",Schema!J502)","v":""},{"$f":"IF(Schema!K502=\"\",\"\",Schema!K502)","v":""},{"$f":"IF(Schema!L502=\"\",\"\",Schema!L502)","v":""},{"$f":"IF(Schema!N502=\"\",\"\",Schema!N502)","v":"O"}]
[{"$f":"Schema!A503&Schema!B503&Schema!C503&Schema!D503","v":"BTP"},"SU",{"$f":"IF(A497=\"\",\"\",IF(LEN(Schema!A503)=2,1,IF(LEN(Schema!B503)=2,10,IF(LEN(Schema!C503)=2,100,0))))","v":0},10,{"$f":"IF(A497=\"\",\"\",SUM(Tabel2[[#This Row],[I1]:[I2]]))","v":10},{"$error":"#REF!"},"SU","",{"$error":"#REF!"},{"$f":"IF(C497=\"\",\"\",IF(LEN(Tabel2[[#This Row],[Entiteit of attribuut]])=2,\"\",Tabel2[[#This Row],[Entiteit]]&\"_\"&Tabel2[[#This Row],[Entiteit of attribuut]]))","v":"SU_BTP"},{"$f":"IF(Schema!I503=\"\",\"\",Schema!I503)","v":""},{"$f":"IF(Schema!J503=\"\",\"\",Schema!J503)","v":""},{"$f":"IF(Schema!K503=\"\",\"\",Schema!K503)","v":""},{"$f":"IF(Schema!L503=\"\",\"\",Schema!L503)","v":""},{"$f":"IF(Schema!N503=\"\",\"\",Schema!N503)","v":"LEEG"}]
[{"$f":"Schema!A504&Schema!B504&Schema!C504&Schema!D504","v":"CODE"},"SU",{"$f":"IF(A498=\"\",\"\",IF(LEN(Schema!A504)=2,1,IF(LEN(Schema!B504)=2,10,IF(LEN(Schema!C504)=2,100,0))))","v":0},10,{"$f":"IF(A498=\"\",\"\",SUM(Tabel2[[#This Row],[I1]:[I2]]))","v":10},{"$error":"#REF!"},"SU","",{"$error":"#REF!"},{"$f":"IF(C498=\"\",\"\",IF(LEN(Tabel2[[#This Row],[Entiteit of attribuut]])=2,\"\",Tabel2[[#This Row],[Entiteit]]&\"_\"&Tabel2[[#This Row],[Entiteit of attribuut]]))","v":"SU_CODE"},{"$f":"IF(Schema!I504=\"\",\"\",Schema!I504)","v":""},{"$f":"IF(Schema!J504=\"\",\"\",Schema!J504)","v":""},{"$f":"IF(Schema!K504=\"\",\"\",Schema!K504)","v":""},{"$f":"IF(Schema!L504=\"\",\"\",Schema!L504)","v":""},{"$f":"IF(Schema!N504=\"\",\"\",Schema!N504)","v":"O"}]
[{"$f":"Schema!A505&Schema!B505&Schema!C505&Schema!D505","v":"COLFACT"},"SU",{"$f":"IF(A499=\"\",\"\",IF(LEN(Schema!A505)=2,1,IF(LEN(Schema!B505)=2,10,IF(LEN(Schema!C505)=2,100,0))))","v":0},10,{"$f":"IF(A499=\"\",\"\",SUM(Tabel2[[#This Row],[I1]:[I2]]))","v":10},{"$error":"#REF!"},"SU","",{"$error":"#REF!"},{"$f":"IF(C499=\"\",\"\",IF(LEN(Tabel2[[#This Row],[Entiteit of attribuut]])=2,\"\",Tabel2[[#This Row],[Entiteit]]&\"_\"&Tabel2[[#This Row],[Entiteit of attribuut]]))","v":"SU_COLFACT"},{"$f":"IF(Schema!I505=\"\",\"\",Schema!I505)","v":""},{"$f":"IF(Schema!J505=\"\",\"\",Schema!J505)","v":""},{"$f":"IF(Schema!K505=\"\",\"\",Schema!K505)","v":""},{"$f":"IF(Schema!L505=\"\",\"\",Schema!L505)","v":""},{"$f":"IF(Schema!N505=\"\",\"\",Schema!N505)","v":"O"}]
[{"$f":"Schema!A506&Schema!B506&Schema!C506&Schema!D506","v":"ERB"},"SU",{"$f":"IF(A500=\"\",\"\",IF(LEN(Schema!A506)=2,1,IF(LEN(Schema!B506)=2,10,IF(LEN(Schema!C506)=2,100,0))))","v":0},10,{"$f":"IF(A500=\"\",\"\",SUM(Tabel2[[#This Row],[I1]:[I2]]))","v":10},{"$error":"#REF!"},"SU","",{"$error":"#REF!"},{"$f":"IF(C500=\"\",\"\",IF(LEN(Tabel2[[#This Row],[Entiteit of attribuut]])=2,\"\",Tabel2[[#This Row],[Entiteit]]&\"_\"&Tabel2[[#This Row],[Entiteit of attribuut]]))","v":"SU_ERB"},{"$f":"IF(Schema!I506=\"\",\"\",Schema!I506)","v":""},{"$f":"IF(Schema!J506=\"\",\"\",Schema!J506)","v":""},{"$f":"IF(Schema!K506=\"\",\"\",Schema!K506)","v":""},{"$f":"IF(Schema!L506=\"\",\"\",Schema!L506)","v":""},{"$f":"IF(Schema!N506=\"\",\"\",Schema!N506)","v":"O"}]
[{"$f":"Schema!A507&Schema!B507&Schema!C507&Schema!D507","v":"GADEKCD"},"SU",{"$f":"IF(A501=\"\",\"\",IF(LEN(Schema!A507)=2,1,IF(LEN(Schema!B507)=2,10,IF(LEN(Schema!C507)=2,100,0))))","v":0},10,{"$f":"IF(A501=\"\",\"\",SUM(Tabel2[[#This Row],[I1]:[I2]]))","v":10},{"$error":"#REF!"},"SU","",{"$error":"#REF!"},{"$f":"IF(C501=\"\",\"\",IF(LEN(Tabel2[[#This Row],[Entiteit of attribuut]])=2,\"\",Tabel2[[#This Row],[Entiteit]]&\"_\"&Tabel2[[#This Row],[Entiteit of attribuut]]))","v":"SU_GADEKCD"},{"$f":"IF(Schema!I507=\"\",\"\",Schema!I507)","v":""},{"$f":"IF(Schema!J507=\"\",\"\",Schema!J507)","v":""},{"$f":"IF(Schema!K507=\"\",\"\",Schema!K507)","v":""},{"$f":"IF(Schema!L507=\"\",\"\",Schema!L507)","v":""},{"$f":"IF(Schema!N507=\"\",\"\",Schema!N507)","v":"V"}]
[{"$f":"Schema!A508&Schema!B508&Schema!C508&Schema!D508","v":"GADEKCO"},"SU",{"$f":"IF(A502=\"\",\"\",IF(LEN(Schema!A508)=2,1,IF(LEN(Schema!B508)=2,10,IF(LEN(Schema!C508)=2,100,0))))","v":0},10,{"$f":"IF(A502=\"\",\"\",SUM(Tabel2[[#This Row],[I1]:[I2]]))","v":10},{"$error":"#REF!"},"SU","",{"$error":"#REF!"},{"$f":"IF(C502=\"\",\"\",IF(LEN(Tabel2[[#This Row],[Entiteit of attribuut]])=2,\"\",Tabel2[[#This Row],[Entiteit]]&\"_\"&Tabel2[[#This Row],[Entiteit of attribuut]]))","v":"SU_GADEKCO"},{"$f":"IF(Schema!I508=\"\",\"\",Schema!I508)","v":""},{"$f":"IF(Schema!J508=\"\",\"\",Schema!J508)","v":""},{"$f":"IF(Schema!K508=\"\",\"\",Schema!K508)","v":""},{"$f":"IF(Schema!L508=\"\",\"\",Schema!L508)","v":""},{"$f":"IF(Schema!N508=\"\",\"\",Schema!N508)","v":"V"}]
[{"$f":"Schema!A509&Schema!B509&Schema!C509&Schema!D509","v":"MYCODE"},"SU",{"$f":"IF(A503=\"\",\"\",IF(LEN(Schema!A509)=2,1,IF(LEN(Schema!B509)=2,10,IF(LEN(Schema!C509)=2,100,0))))","v":0},10,{"$f":"IF(A503=\"\",\"\",SUM(Tabel2[[#This Row],[I1]:[I2]]))","v":10},{"$error":"#REF!"},"SU","",{"$error":"#REF!"},{"$f":"IF(C503=\"\",\"\",IF(LEN(Tabel2[[#This Row],[Entiteit of attribuut]])=2,\"\",Tabel2[[#This Row],[Entiteit]]&\"_\"&Tabel2[[#This Row],[Entiteit of attribuut]]))","v":"SU_MYCODE"},{"$f":"IF(Schema!I509=\"\",\"\",Schema!I509)","v":""},{"$f":"IF(Schema!J509=\"\",\"\",Schema!J509)","v":""},{"$f":"IF(Schema!K509=\"\",\"\",Schema!K509)","v":""},{"$f":"IF(Schema!L509=\"\",\"\",Schema!L509)","v":""},{"$f":"IF(Schema!N509=\"\",\"\",Schema!N509)","v":"O"}]
[{"$f":"Schema!A510&Schema!B510&Schema!C510&Schema!D510","v":"NJP"},"SU",{"$f":"IF(A504=\"\",\"\",IF(LEN(Schema!A510)=2,1,IF(LEN(Schema!B510)=2,10,IF(LEN(Schema!C510)=2,100,0))))","v":0},10,{"$f":"IF(A504=\"\",\"\",SUM(Tabel2[[#This Row],[I1]:[I2]]))","v":10},{"$error":"#REF!"},"SU","",{"$error":"#REF!"},{"$f":"IF(C504=\"\",\"\",IF(LEN(Tabel2[[#This Row],[Entiteit of attribuut]])=2,\"\",Tabel2[[#This Row],[Entiteit]]&\"_\"&Tabel2[[#This Row],[Entiteit of attribuut]]))","v":"SU_NJP"},{"$f":"IF(Schema!I510=\"\",\"\",Schema!I510)","v":""},{"$f":"IF(Schema!J510=\"\",\"\",Schema!J510)","v":""},{"$f":"IF(Schema!K510=\"\",\"\",Schema!K510)","v":""},{"$f":"IF(Schema!L510=\"\",\"\",Schema!L510)","v":""},{"$f":"IF(Schema!N510=\"\",\"\",Schema!N510)","v":"O"}]
[{"$f":"Schema!A511&Schema!B511&Schema!C511&Schema!D511","v":"PAFWST"},"SU",{"$f":"IF(A505=\"\",\"\",IF(LEN(Schema!A511)=2,1,IF(LEN(Schema!B511)=2,10,IF(LEN(Schema!C511)=2,100,0))))","v":0},10,{"$f":"IF(A505=\"\",\"\",SUM(Tabel2[[#This Row],[I1]:[I2]]))","v":10},{"$error":"#REF!"},"SU","",{"$error":"#REF!"},{"$f":"IF(C505=\"\",\"\",IF(LEN(Tabel2[[#This Row],[Entiteit of attribuut]])=2,\"\",Tabel2[[#This Row],[Entiteit]]&\"_\"&Tabel2[[#This Row],[Entiteit of attribuut]]))","v":"SU_PAFWST"},{"$f":"IF(Schema!I511=\"\",\"\",Schema!I511)","v":""},{"$f":"IF(Schema!J511=\"\",\"\",Schema!J511)","v":""},{"$f":"IF(Schema!K511=\"\",\"\",Schema!K511)","v":""},{"$f":"IF(Schema!L511=\"\",\"\",Schema!L511)","v":""},{"$f":"IF(Schema!N511=\"\",\"\",Schema!N511)","v":"O"}]
[{"$f":"Schema!A512&Schema!B512&Schema!C512&Schema!D512","v":"PPRC"},"SU",{"$f":"IF(A506=\"\",\"\",IF(LEN(Schema!A512)=2,1,IF(LEN(Schema!B512)=2,10,IF(LEN(Schema!C512)=2,100,0))))","v":0},10,{"$f":"IF(A506=\"\",\"\",SUM(Tabel2[[#This Row],[I1]:[I2]]))","v":10},{"$error":"#REF!"},"SU","",{"$error":"#REF!"},{"$f":"IF(C506=\"\",\"\",IF(LEN(Tabel2[[#This Row],[Entiteit of attribuut]])=2,\"\",Tabel2[[#This Row],[Entiteit]]&\"_\"&Tabel2[[#This Row],[Entiteit of attribuut]]))","v":"SU_PPRC"},{"$f":"IF(Schema!I512=\"\",\"\",Schema!I512)","v":""},{"$f":"IF(Schema!J512=\"\",\"\",Schema!J512)","v":""},{"$f":"IF(Schema!K512=\"\",\"\",Schema!K512)","v":""},{"$f":"IF(Schema!L512=\"\",\"\",Schema!L512)","v":""},{"$f":"IF(Schema!N512=\"\",\"\",Schema!N512)","v":"O"}]
[{"$f":"Schema!A513&Schema!B513&Schema!C513&Schema!D513","v":"PRCPKKT"},"SU",{"$f":"IF(A507=\"\",\"\",IF(LEN(Schema!A513)=2,1,IF(LEN(Schema!B513)=2,10,IF(LEN(Schema!C513)=2,100,0))))","v":0},10,{"$f":"IF(A507=\"\",\"\",SUM(Tabel2[[#This Row],[I1]:[I2]]))","v":10},{"$error":"#REF!"},"SU","",{"$error":"#REF!"},{"$f":"IF(C507=\"\",\"\",IF(LEN(Tabel2[[#This Row],[Entiteit of attribuut]])=2,\"\",Tabel2[[#This Row],[Entiteit]]&\"_\"&Tabel2[[#This Row],[Entiteit of attribuut]]))","v":"SU_PRCPKKT"},{"$f":"IF(Schema!I513=\"\",\"\",Schema!I513)","v":""},{"$f":"IF(Schema!J513=\"\",\"\",Schema!J513)","v":""},{"$f":"IF(Schema!K513=\"\",\"\",Schema!K513)","v":""},{"$f":"IF(Schema!L513=\"\",\"\",Schema!L513)","v":""},{"$f":"IF(Schema!N513=\"\",\"\",Schema!N513)","v":"O"}]
[{"$f":"Schema!A514&Schema!B514&Schema!C514&Schema!D514","v":"PRCTEKC"},"SU",{"$f":"IF(A508=\"\",\"\",IF(LEN(Schema!A514)=2,1,IF(LEN(Schema!B514)=2,10,IF(LEN(Schema!C514)=2,100,0))))","v":0},10,{"$f":"IF(A508=\"\",\"\",SUM(Tabel2[[#This Row],[I1]:[I2]]))","v":10},{"$error":"#REF!"},"SU","",{"$error":"#REF!"},{"$f":"IF(C508=\"\",\"\",IF(LEN(Tabel2[[#This Row],[Entiteit of attribuut]])=2,\"\",Tabel2[[#This Row],[Entiteit]]&\"_\"&Tabel2[[#This Row],[Entiteit of attribuut]]))","v":"SU_PRCTEKC"},{"$f":"IF(Schema!I514=\"\",\"\",Schema!I514)","v":""},{"$f":"IF(Schema!J514=\"\",\"\",Schema!J514)","v":""},{"$f":"IF(Schema!K514=\"\",\"\",Schema!K514)","v":""},{"$f":"IF(Schema!L514=\"\",\"\",Schema!L514)","v":""},{"$f":"IF(Schema!N514=\"\",\"\",Schema!N514)","v":"O"}]
[{"$f":"Schema!A515&Schema!B515&Schema!C515&Schema!D515","v":"RELVRH"},"SU",{"$f":"IF(A509=\"\",\"\",IF(LEN(Schema!A515)=2,1,IF(LEN(Schema!B515)=2,10,IF(LEN(Schema!C515)=2,100,0))))","v":0},10,{"$f":"IF(A509=\"\",\"\",SUM(Tabel2[[#This Row],[I1]:[I2]]))","v":10},{"$error":"#REF!"},"SU","",{"$error":"#REF!"},{"$f":"IF(C509=\"\",\"\",IF(LEN(Tabel2[[#This Row],[Entiteit of attribuut]])=2,\"\",Tabel2[[#This Row],[Entiteit]]&\"_\"&Tabel2[[#This Row],[Entiteit of attribuut]]))","v":"SU_RELVRH"},{"$f":"IF(Schema!I515=\"\",\"\",Schema!I515)","v":""},{"$f":"IF(Schema!J515=\"\",\"\",Schema!J515)","v":""},{"$f":"IF(Schema!K515=\"\",\"\",Schema!K515)","v":""},{"$f":"IF(Schema!L515=\"\",\"\",Schema!L515)","v":""},{"$f":"IF(Schema!N515=\"\",\"\",Schema!N515)","v":"O"}]
[{"$f":"Schema!A516&Schema!B516&Schema!C516&Schema!D516","v":"RELVVNR"},"SU",{"$f":"IF(A510=\"\",\"\",IF(LEN(Schema!A516)=2,1,IF(LEN(Schema!B516)=2,10,IF(LEN(Schema!C516)=2,100,0))))","v":0},10,{"$f":"IF(A510=\"\",\"\",SUM(Tabel2[[#This Row],[I1]:[I2]]))","v":10},{"$error":"#REF!"},"SU","",{"$error":"#REF!"},{"$f":"IF(C510=\"\",\"\",IF(LEN(Tabel2[[#This Row],[Entiteit of attribuut]])=2,\"\",Tabel2[[#This Row],[Entiteit]]&\"_\"&Tabel2[[#This Row],[Entiteit of attribuut]]))","v":"SU_RELVVNR"},{"$f":"IF(Schema!I516=\"\",\"\",Schema!I516)","v":""},{"$f":"IF(Schema!J516=\"\",\"\",Schema!J516)","v":""},{"$f":"IF(Schema!K516=\"\",\"\",Schema!K516)","v":""},{"$f":"IF(Schema!L516=\"\",\"\",Schema!L516)","v":""},{"$f":"IF(Schema!N516=\"\",\"\",Schema!N516)","v":"O"}]
[{"$f":"Schema!A517&Schema!B517&Schema!C517&Schema!D517","v":"RJRCOR"},"SU",{"$f":"IF(A511=\"\",\"\",IF(LEN(Schema!A517)=2,1,IF(LEN(Schema!B517)=2,10,IF(LEN(Schema!C517)=2,100,0))))","v":0},10,{"$f":"IF(A511=\"\",\"\",SUM(Tabel2[[#This Row],[I1]:[I2]]))","v":10},{"$error":"#REF!"},"SU","",{"$error":"#REF!"},{"$f":"IF(C511=\"\",\"\",IF(LEN(Tabel2[[#This Row],[Entiteit of attribuut]])=2,\"\",Tabel2[[#This Row],[Entiteit]]&\"_\"&Tabel2[[#This Row],[Entiteit of attribuut]]))","v":"SU_RJRCOR"},{"$f":"IF(Schema!I517=\"\",\"\",Schema!I517)","v":""},{"$f":"IF(Schema!J517=\"\",\"\",Schema!J517)","v":""},{"$f":"IF(Schema!K517=\"\",\"\",Schema!K517)","v":""},{"$f":"IF(Schema!L517=\"\",\"\",Schema!L517)","v":""},{"$f":"IF(Schema!N517=\"\",\"\",Schema!N517)","v":"O"}]
[{"$f":"Schema!A518&Schema!B518&Schema!C518&Schema!D518","v":"TCORBDR"},"SU",{"$f":"IF(A512=\"\",\"\",IF(LEN(Schema!A518)=2,1,IF(LEN(Schema!B518)=2,10,IF(LEN(Schema!C518)=2,100,0))))","v":0},10,{"$f":"IF(A512=\"\",\"\",SUM(Tabel2[[#This Row],[I1]:[I2]]))","v":10},{"$error":"#REF!"},"SU","",{"$error":"#REF!"},{"$f":"IF(C512=\"\",\"\",IF(LEN(Tabel2[[#This Row],[Entiteit of attribuut]])=2,\"\",Tabel2[[#This Row],[Entiteit]]&\"_\"&Tabel2[[#This Row],[Entiteit of attribuut]]))","v":"SU_TCORBDR"},{"$f":"IF(Schema!I518=\"\",\"\",Schema!I518)","v":""},{"$f":"IF(Schema!J518=\"\",\"\",Schema!J518)","v":""},{"$f":"IF(Schema!K518=\"\",\"\",Schema!K518)","v":""},{"$f":"IF(Schema!L518=\"\",\"\",Schema!L518)","v":""},{"$f":"IF(Schema!N518=\"\",\"\",Schema!N518)","v":"O"}]
[{"$f":"Schema!A519&Schema!B519&Schema!C519&Schema!D519","v":"VERZSOM"},"SU",{"$f":"IF(A513=\"\",\"\",IF(LEN(Schema!A519)=2,1,IF(LEN(Schema!B519)=2,10,IF(LEN(Schema!C519)=2,100,0))))","v":0},10,{"$f":"IF(A513=\"\",\"\",SUM(Tabel2[[#This Row],[I1]:[I2]]))","v":10},{"$error":"#REF!"},"SU","",{"$error":"#REF!"},{"$f":"IF(C513=\"\",\"\",IF(LEN(Tabel2[[#This Row],[Entiteit of attribuut]])=2,\"\",Tabel2[[#This Row],[Entiteit]]&\"_\"&Tabel2[[#This Row],[Entiteit of attribuut]]))","v":"SU_VERZSOM"},{"$f":"IF(Schema!I519=\"\",\"\",Schema!I519)","v":""},{"$f":"IF(Schema!J519=\"\",\"\",Schema!J519)","v":""},{"$f":"IF(Schema!K519=\"\",\"\",Schema!K519)","v":""},{"$f":"IF(Schema!L519=\"\",\"\",Schema!L519)","v":""},{"$f":"IF(Schema!N519=\"\",\"\",Schema!N519)","v":"O"}]
[{"$f":"Schema!A520&Schema!B520&Schema!C520&Schema!D520","v":"VGBRA"},"SU",{"$f":"IF(A514=\"\",\"\",IF(LEN(Schema!A520)=2,1,IF(LEN(Schema!B520)=2,10,IF(LEN(Schema!C520)=2,100,0))))","v":0},10,{"$f":"IF(A514=\"\",\"\",SUM(Tabel2[[#This Row],[I1]:[I2]]))","v":10},{"$error":"#REF!"},"SU","",{"$error":"#REF!"},{"$f":"IF(C514=\"\",\"\",IF(LEN(Tabel2[[#This Row],[Entiteit of attribuut]])=2,\"\",Tabel2[[#This Row],[Entiteit]]&\"_\"&Tabel2[[#This Row],[Entiteit of attribuut]]))","v":"SU_VGBRA"},{"$f":"IF(Schema!I520=\"\",\"\",Schema!I520)","v":""},{"$f":"IF(Schema!J520=\"\",\"\",Schema!J520)","v":""},{"$f":"IF(Schema!K520=\"\",\"\",Schema!K520)","v":""},{"$f":"IF(Schema!L520=\"\",\"\",Schema!L520)","v":""},{"$f":"IF(Schema!N520=\"\",\"\",Schema!N520)","v":"O"}]
[{"$f":"Schema!A521&Schema!B521&Schema!C521&Schema!D521","v":"VOLGNUM"},{"$f":"IF(LEN(A515)=2,A515,IF(A515=\"\",\"Leeg\",B514))","v":"SU"},{"$f":"IF(A515=\"\",\"\",IF(LEN(Schema!A521)=2,1,IF(LEN(Schema!B521)=2,10,IF(LEN(Schema!C521)=2,100,0))))","v":0},{"$f":"IF(C515=0,D514,C515)","v":10},{"$f":"IF(A515=\"\",\"\",SUM(Tabel2[[#This Row],[I1]:[I2]]))","v":10},{"$f":"IF(A515=\"\",\"\",IF(C515=1,B515,F514))","v":{"$error":"#REF!"}},{"$f":"IF(C515=10,A515,IF(OR(C515=0,C515=100),G514,\"\"))","v":"SU"},{"$f":"IF(E515=200,B515,IF(C515=0,H514,\"\"))","v":""},{"$f":"IF(C515=\"\",\"\",IF(OR(E515=1,E515=10,E515=100),I514,IF(E515=2,F515,IF(E515=20,F515&\"/\"&G515,IF(E515=200,F515&\"/\"&G515&\"/\"&H515)))))","v":{"$error":"#REF!"}},{"$f":"IF(C515=\"\",\"\",IF(LEN(Tabel2[[#This Row],[Entiteit of attribuut]])=2,\"\",Tabel2[[#This Row],[Entiteit]]&\"_\"&Tabel2[[#This Row],[Entiteit of attribuut]]))","v":"SU_VOLGNUM"},{"$f":"IF(Schema!I521=\"\",\"\",Schema!I521)","v":""},{"$f":"IF(Schema!J521=\"\",\"\",Schema!J521)","v":""},{"$f":"IF(Schema!K521=\"\",\"\",Schema!K521)","v":""},{"$f":"IF(Schema!L521=\"\",\"\",Schema!L521)","v":""},{"$f":"IF(Schema!N521=\"\",\"\",Schema!N521)","v":"LEEG"}]
[{"$f":"Schema!A522&Schema!B522&Schema!C522&Schema!D522","v":"VRWRKCD"},"SU",{"$f":"IF(A516=\"\",\"\",IF(LEN(Schema!A522)=2,1,IF(LEN(Schema!B522)=2,10,IF(LEN(Schema!C522)=2,100,0))))","v":0},10,{"$f":"IF(A516=\"\",\"\",SUM(Tabel2[[#This Row],[I1]:[I2]]))","v":10},{"$error":"#REF!"},"SU","",{"$error":"#REF!"},{"$f":"IF(C516=\"\",\"\",IF(LEN(Tabel2[[#This Row],[Entiteit of attribuut]])=2,\"\",Tabel2[[#This Row],[Entiteit]]&\"_\"&Tabel2[[#This Row],[Entiteit of attribuut]]))","v":"SU_VRWRKCD"},{"$f":"IF(Schema!I522=\"\",\"\",Schema!I522)","v":""},{"$f":"IF(Schema!J522=\"\",\"\",Schema!J522)","v":""},{"$f":"IF(Schema!K522=\"\",\"\",Schema!K522)","v":""},{"$f":"IF(Schema!L522=\"\",\"\",Schema!L522)","v":""},{"$f":"IF(Schema!N522=\"\",\"\",Schema!N522)","v":"LEEG"}]
[{"$f":"Schema!A523&Schema!B523&Schema!C523&Schema!D523","v":"WPREMBP"},"SU",{"$f":"IF(A517=\"\",\"\",IF(LEN(Schema!A523)=2,1,IF(LEN(Schema!B523)=2,10,IF(LEN(Schema!C523)=2,100,0))))","v":0},10,{"$f":"IF(A517=\"\",\"\",SUM(Tabel2[[#This Row],[I1]:[I2]]))","v":10},{"$error":"#REF!"},"SU","",{"$error":"#REF!"},{"$f":"IF(C517=\"\",\"\",IF(LEN(Tabel2[[#This Row],[Entiteit of attribuut]])=2,\"\",Tabel2[[#This Row],[Entiteit]]&\"_\"&Tabel2[[#This Row],[Entiteit of attribuut]]))","v":"SU_WPREMBP"},{"$f":"IF(Schema!I523=\"\",\"\",Schema!I523)","v":""},{"$f":"IF(Schema!J523=\"\",\"\",Schema!J523)","v":""},{"$f":"IF(Schema!K523=\"\",\"\",Schema!K523)","v":""},{"$f":"IF(Schema!L523=\"\",\"\",Schema!L523)","v":""},{"$f":"IF(Schema!N523=\"\",\"\",Schema!N523)","v":"O"}]
[{"$f":"Schema!A524&Schema!B524&Schema!C524&Schema!D524","v":"MP"},"MP",{"$f":"IF(A518=\"\",\"\",IF(LEN(Schema!A524)=2,1,IF(LEN(Schema!B524)=2,10,IF(LEN(Schema!C524)=2,100,0))))","v":100},100,{"$f":"IF(A518=\"\",\"\",SUM(Tabel2[[#This Row],[I1]:[I2]]))","v":200},{"$error":"#REF!"},"SU","MP",{"$error":"#REF!"},{"$f":"IF(C518=\"\",\"\",IF(LEN(Tabel2[[#This Row],[Entiteit of attribuut]])=2,\"\",Tabel2[[#This Row],[Entiteit]]&\"_\"&Tabel2[[#This Row],[Entiteit of attribuut]]))","v":""},{"$f":"IF(Schema!I524=\"\",\"\",Schema!I524)","v":""},{"$f":"IF(Schema!J524=\"\",\"\",Schema!J524)","v":""},{"$f":"IF(Schema!K524=\"\",\"\",Schema!K524)","v":""},{"$f":"IF(Schema!L524=\"\",\"\",Schema!L524)","v":""},{"$f":"IF(Schema!N524=\"\",\"\",Schema!N524)","v":"O"}]
[{"$f":"Schema!A525&Schema!B525&Schema!C525&Schema!D525","v":"MYAAND"},"MP",{"$f":"IF(A519=\"\",\"\",IF(LEN(Schema!A525)=2,1,IF(LEN(Schema!B525)=2,10,IF(LEN(Schema!C525)=2,100,0))))","v":0},100,{"$f":"IF(A519=\"\",\"\",SUM(Tabel2[[#This Row],[I1]:[I2]]))","v":100},{"$error":"#REF!"},"SU","MP",{"$error":"#REF!"},{"$f":"IF(C519=\"\",\"\",IF(LEN(Tabel2[[#This Row],[Entiteit of attribuut]])=2,\"\",Tabel2[[#This Row],[Entiteit]]&\"_\"&Tabel2[[#This Row],[Entiteit of attribuut]]))","v":"MP_MYAAND"},{"$f":"IF(Schema!I525=\"\",\"\",Schema!I525)","v":""},{"$f":"IF(Schema!J525=\"\",\"\",Schema!J525)","v":""},{"$f":"IF(Schema!K525=\"\",\"\",Schema!K525)","v":""},{"$f":"IF(Schema!L525=\"\",\"\",Schema!L525)","v":""},{"$f":"IF(Schema!N525=\"\",\"\",Schema!N525)","v":"O"}]
[{"$f":"Schema!A526&Schema!B526&Schema!C526&Schema!D526","v":"PLLEAD"},"MP",{"$f":"IF(A520=\"\",\"\",IF(LEN(Schema!A526)=2,1,IF(LEN(Schema!B526)=2,10,IF(LEN(Schema!C526)=2,100,0))))","v":0},100,{"$f":"IF(A520=\"\",\"\",SUM(Tabel2[[#This Row],[I1]:[I2]]))","v":100},{"$error":"#REF!"},"SU","MP",{"$error":"#REF!"},{"$f":"IF(C520=\"\",\"\",IF(LEN(Tabel2[[#This Row],[Entiteit of attribuut]])=2,\"\",Tabel2[[#This Row],[Entiteit]]&\"_\"&Tabel2[[#This Row],[Entiteit of attribuut]]))","v":"MP_PLLEAD"},{"$f":"IF(Schema!I526=\"\",\"\",Schema!I526)","v":""},{"$f":"IF(Schema!J526=\"\",\"\",Schema!J526)","v":""},{"$f":"IF(Schema!K526=\"\",\"\",Schema!K526)","v":""},{"$f":"IF(Schema!L526=\"\",\"\",Schema!L526)","v":""},{"$f":"IF(Schema!N526=\"\",\"\",Schema!N526)","v":"O"}]
[{"$f":"Schema!A527&Schema!B527&Schema!C527&Schema!D527","v":"POOLNUM"},"MP",{"$f":"IF(A521=\"\",\"\",IF(LEN(Schema!A527)=2,1,IF(LEN(Schema!B527)=2,10,IF(LEN(Schema!C527)=2,100,0))))","v":0},100,{"$f":"IF(A521=\"\",\"\",SUM(Tabel2[[#This Row],[I1]:[I2]]))","v":100},{"$error":"#REF!"},"SU","MP",{"$error":"#REF!"},{"$f":"IF(C521=\"\",\"\",IF(LEN(Tabel2[[#This Row],[Entiteit of attribuut]])=2,\"\",Tabel2[[#This Row],[Entiteit]]&\"_\"&Tabel2[[#This Row],[Entiteit of attribuut]]))","v":"MP_POOLNUM"},{"$f":"IF(Schema!I527=\"\",\"\",Schema!I527)","v":""},{"$f":"IF(Schema!J527=\"\",\"\",Schema!J527)","v":""},{"$f":"IF(Schema!K527=\"\",\"\",Schema!K527)","v":""},{"$f":"IF(Schema!L527=\"\",\"\",Schema!L527)","v":""},{"$f":"IF(Schema!N527=\"\",\"\",Schema!N527)","v":"V"}]
[{"$f":"Schema!A528&Schema!B528&Schema!C528&Schema!D528","v":"POOLPRC"},"MP",{"$f":"IF(A522=\"\",\"\",IF(LEN(Schema!A528)=2,1,IF(LEN(Schema!B528)=2,10,IF(LEN(Schema!C528)=2,100,0))))","v":0},100,{"$f":"IF(A522=\"\",\"\",SUM(Tabel2[[#This Row],[I1]:[I2]]))","v":100},{"$error":"#REF!"},"SU","MP",{"$error":"#REF!"},{"$f":"IF(C522=\"\",\"\",IF(LEN(Tabel2[[#This Row],[Entiteit of attribuut]])=2,\"\",Tabel2[[#This Row],[Entiteit]]&\"_\"&Tabel2[[#This Row],[Entiteit of attribuut]]))","v":"MP_POOLPRC"},{"$f":"IF(Schema!I528=\"\",\"\",Schema!I528)","v":""},{"$f":"IF(Schema!J528=\"\",\"\",Schema!J528)","v":""},{"$f":"IF(Schema!K528=\"\",\"\",Schema!K528)","v":""},{"$f":"IF(Schema!L528=\"\",\"\",Schema!L528)","v":""},{"$f":"IF(Schema!N528=\"\",\"\",Schema!N528)","v":"V"}]
[{"$f":"Schema!A529&Schema!B529&Schema!C529&Schema!D529","v":"CL"},"CL",{"$f":"IF(A523=\"\",\"\",IF(LEN(Schema!A529)=2,1,IF(LEN(Schema!B529)=2,10,IF(LEN(Schema!C529)=2,100,0))))","v":10},10,{"$f":"IF(A523=\"\",\"\",SUM(Tabel2[[#This Row],[I1]:[I2]]))","v":20},{"$error":"#REF!"},"CL","",{"$error":"#REF!"},{"$f":"IF(C523=\"\",\"\",IF(LEN(Tabel2[[#This Row],[Entiteit of attribuut]])=2,\"\",Tabel2[[#This Row],[Entiteit]]&\"_\"&Tabel2[[#This Row],[Entiteit of attribuut]]))","v":""},{"$f":"IF(Schema!I529=\"\",\"\",Schema!I529)","v":""},{"$f":"IF(Schema!J529=\"\",\"\",Schema!J529)","v":""},{"$f":"IF(Schema!K529=\"\",\"\",Schema!K529)","v":""},{"$f":"IF(Schema!L529=\"\",\"\",Schema!L529)","v":""},{"$f":"IF(Schema!N529=\"\",\"\",Schema!N529)","v":"LEEG"}]
[{"$f":"Schema!A530&Schema!B530&Schema!C530&Schema!D530","v":"CLAUSNR"},"CL",{"$f":"IF(A524=\"\",\"\",IF(LEN(Schema!A530)=2,1,IF(LEN(Schema!B530)=2,10,IF(LEN(Schema!C530)=2,100,0))))","v":0},10,{"$f":"IF(A524=\"\",\"\",SUM(Tabel2[[#This Row],[I1]:[I2]]))","v":10},{"$error":"#REF!"},"CL","",{"$error":"#REF!"},{"$f":"IF(C524=\"\",\"\",IF(LEN(Tabel2[[#This Row],[Entiteit of attribuut]])=2,\"\",Tabel2[[#This Row],[Entiteit]]&\"_\"&Tabel2[[#This Row],[Entiteit of attribuut]]))","v":"CL_CLAUSNR"},{"$f":"IF(Schema!I530=\"\",\"\",Schema!I530)","v":""},{"$f":"IF(Schema!J530=\"\",\"\",Schema!J530)","v":""},{"$f":"IF(Schema!K530=\"\",\"\",Schema!K530)","v":""},{"$f":"IF(Schema!L530=\"\",\"\",Schema!L530)","v":""},{"$f":"IF(Schema!N530=\"\",\"\",Schema!N530)","v":"LEEG"}]
[{"$f":"Schema!A531&Schema!B531&Schema!C531&Schema!D531","v":"CLAUSOM"},"CL",{"$f":"IF(A525=\"\",\"\",IF(LEN(Schema!A531)=2,1,IF(LEN(Schema!B531)=2,10,IF(LEN(Schema!C531)=2,100,0))))","v":0},10,{"$f":"IF(A525=\"\",\"\",SUM(Tabel2[[#This Row],[I1]:[I2]]))","v":10},{"$error":"#REF!"},"CL","",{"$error":"#REF!"},{"$f":"IF(C525=\"\",\"\",IF(LEN(Tabel2[[#This Row],[Entiteit of attribuut]])=2,\"\",Tabel2[[#This Row],[Entiteit]]&\"_\"&Tabel2[[#This Row],[Entiteit of attribuut]]))","v":"CL_CLAUSOM"},{"$f":"IF(Schema!I531=\"\",\"\",Schema!I531)","v":""},{"$f":"IF(Schema!J531=\"\",\"\",Schema!J531)","v":""},{"$f":"IF(Schema!K531=\"\",\"\",Schema!K531)","v":""},{"$f":"IF(Schema!L531=\"\",\"\",Schema!L531)","v":""},{"$f":"IF(Schema!N531=\"\",\"\",Schema!N531)","v":"LEEG"}]
[{"$f":"Schema!A532&Schema!B532&Schema!C532&Schema!D532","v":"CLAUTXT"},"CL",{"$f":"IF(A526=\"\",\"\",IF(LEN(Schema!A532)=2,1,IF(LEN(Schema!B532)=2,10,IF(LEN(Schema!C532)=2,100,0))))","v":0},10,{"$f":"IF(A526=\"\",\"\",SUM(Tabel2[[#This Row],[I1]:[I2]]))","v":10},{"$error":"#REF!"},"CL","",{"$error":"#REF!"},{"$f":"IF(C526=\"\",\"\",IF(LEN(Tabel2[[#This Row],[Entiteit of attribuut]])=2,\"\",Tabel2[[#This Row],[Entiteit]]&\"_\"&Tabel2[[#This Row],[Entiteit of attribuut]]))","v":"CL_CLAUTXT"},{"$f":"IF(Schema!I532=\"\",\"\",Schema!I532)","v":""},{"$f":"IF(Schema!J532=\"\",\"\",Schema!J532)","v":""},{"$f":"IF(Schema!K532=\"\",\"\",Schema!K532)","v":""},{"$f":"IF(Schema!L532=\"\",\"\",Schema!L532)","v":""},{"$f":"IF(Schema!N532=\"\",\"\",Schema!N532)","v":"LEEG"}]
[{"$f":"Schema!A533&Schema!B533&Schema!C533&Schema!D533","v":"VERSIEC"},"CL",{"$f":"IF(A527=\"\",\"\",IF(LEN(Schema!A533)=2,1,IF(LEN(Schema!B533)=2,10,IF(LEN(Schema!C533)=2,100,0))))","v":0},10,{"$f":"IF(A527=\"\",\"\",SUM(Tabel2[[#This Row],[I1]:[I2]]))","v":10},{"$error":"#REF!"},"CL","",{"$error":"#REF!"},{"$f":"IF(C527=\"\",\"\",IF(LEN(Tabel2[[#This Row],[Entiteit of attribuut]])=2,\"\",Tabel2[[#This Row],[Entiteit]]&\"_\"&Tabel2[[#This Row],[Entiteit of attribuut]]))","v":"CL_VERSIEC"},{"$f":"IF(Schema!I533=\"\",\"\",Schema!I533)","v":""},{"$f":"IF(Schema!J533=\"\",\"\",Schema!J533)","v":""},{"$f":"IF(Schema!K533=\"\",\"\",Schema!K533)","v":""},{"$f":"IF(Schema!L533=\"\",\"\",Schema!L533)","v":""},{"$f":"IF(Schema!N533=\"\",\"\",Schema!N533)","v":"LEEG"}]
[{"$f":"Schema!A534&Schema!B534&Schema!C534&Schema!D534","v":"VOLGNUM"},"CL",{"$f":"IF(A528=\"\",\"\",IF(LEN(Schema!A534)=2,1,IF(LEN(Schema!B534)=2,10,IF(LEN(Schema!C534)=2,100,0))))","v":0},10,{"$f":"IF(A528=\"\",\"\",SUM(Tabel2[[#This Row],[I1]:[I2]]))","v":10},{"$error":"#REF!"},"CL","",{"$error":"#REF!"},{"$f":"IF(C528=\"\",\"\",IF(LEN(Tabel2[[#This Row],[Entiteit of attribuut]])=2,\"\",Tabel2[[#This Row],[Entiteit]]&\"_\"&Tabel2[[#This Row],[Entiteit of attribuut]]))","v":"CL_VOLGNUM"},{"$f":"IF(Schema!I534=\"\",\"\",Schema!I534)","v":""},{"$f":"IF(Schema!J534=\"\",\"\",Schema!J534)","v":""},{"$f":"IF(Schema!K534=\"\",\"\",Schema!K534)","v":""},{"$f":"IF(Schema!L534=\"\",\"\",Schema!L534)","v":""},{"$f":"IF(Schema!N534=\"\",\"\",Schema!N534)","v":"LEEG"}]
[{"$f":"Schema!A535&Schema!B535&Schema!C535&Schema!D535","v":"VRWRKCD"},"CL",{"$f":"IF(A529=\"\",\"\",IF(LEN(Schema!A535)=2,1,IF(LEN(Schema!B535)=2,10,IF(LEN(Schema!C535)=2,100,0))))","v":0},10,{"$f":"IF(A529=\"\",\"\",SUM(Tabel2[[#This Row],[I1]:[I2]]))","v":10},{"$error":"#REF!"},"CL","",{"$error":"#REF!"},{"$f":"IF(C529=\"\",\"\",IF(LEN(Tabel2[[#This Row],[Entiteit of attribuut]])=2,\"\",Tabel2[[#This Row],[Entiteit]]&\"_\"&Tabel2[[#This Row],[Entiteit of attribuut]]))","v":"CL_VRWRKCD"},{"$f":"IF(Schema!I535=\"\",\"\",Schema!I535)","v":""},{"$f":"IF(Schema!J535=\"\",\"\",Schema!J535)","v":""},{"$f":"IF(Schema!K535=\"\",\"\",Schema!K535)","v":""},{"$f":"IF(Schema!L535=\"\",\"\",Schema!L535)","v":""},{"$f":"IF(Schema!N535=\"\",\"\",Schema!N535)","v":"LEEG"}]
[{"$f":"Schema!A536&Schema!B536&Schema!C536&Schema!D536","v":"VW"},"VW",{"$f":"IF(A530=\"\",\"\",IF(LEN(Schema!A536)=2,1,IF(LEN(Schema!B536)=2,10,IF(LEN(Schema!C536)=2,100,0))))","v":10},10,{"$f":"IF(A530=\"\",\"\",SUM(Tabel2[[#This Row],[I1]:[I2]]))","v":20},{"$error":"#REF!"},"VW","",{"$error":"#REF!"},{"$f":"IF(C530=\"\",\"\",IF(LEN(Tabel2[[#This Row],[Entiteit of attribuut]])=2,\"\",Tabel2[[#This Row],[Entiteit]]&\"_\"&Tabel2[[#This Row],[Entiteit of attribuut]]))","v":""},{"$f":"IF(Schema!I536=\"\",\"\",Schema!I536)","v":""},{"$f":"IF(Schema!J536=\"\",\"\",Schema!J536)","v":""},{"$f":"IF(Schema!K536=\"\",\"\",Schema!K536)","v":""},{"$f":"IF(Schema!L536=\"\",\"\",Schema!L536)","v":""},{"$f":"IF(Schema!N536=\"\",\"\",Schema!N536)","v":"LEEG"}]
[{"$f":"Schema!A537&Schema!B537&Schema!C537&Schema!D537","v":"VOLGNUM"},"VW",{"$f":"IF(A531=\"\",\"\",IF(LEN(Schema!A537)=2,1,IF(LEN(Schema!B537)=2,10,IF(LEN(Schema!C537)=2,100,0))))","v":0},10,{"$f":"IF(A531=\"\",\"\",SUM(Tabel2[[#This Row],[I1]:[I2]]))","v":10},{"$error":"#REF!"},"VW","",{"$error":"#REF!"},{"$f":"IF(C531=\"\",\"\",IF(LEN(Tabel2[[#This Row],[Entiteit of attribuut]])=2,\"\",Tabel2[[#This Row],[Entiteit]]&\"_\"&Tabel2[[#This Row],[Entiteit of attribuut]]))","v":"VW_VOLGNUM"},{"$f":"IF(Schema!I537=\"\",\"\",Schema!I537)","v":""},{"$f":"IF(Schema!J537=\"\",\"\",Schema!J537)","v":""},{"$f":"IF(Schema!K537=\"\",\"\",Schema!K537)","v":""},{"$f":"IF(Schema!L537=\"\",\"\",Schema!L537)","v":""},{"$f":"IF(Schema!N537=\"\",\"\",Schema!N537)","v":"LEEG"}]
[{"$f":"Schema!A538&Schema!B538&Schema!C538&Schema!D538","v":"VRWNR"},"VW",{"$f":"IF(A532=\"\",\"\",IF(LEN(Schema!A538)=2,1,IF(LEN(Schema!B538)=2,10,IF(LEN(Schema!C538)=2,100,0))))","v":0},10,{"$f":"IF(A532=\"\",\"\",SUM(Tabel2[[#This Row],[I1]:[I2]]))","v":10},{"$error":"#REF!"},"VW","",{"$error":"#REF!"},{"$f":"IF(C532=\"\",\"\",IF(LEN(Tabel2[[#This Row],[Entiteit of attribuut]])=2,\"\",Tabel2[[#This Row],[Entiteit]]&\"_\"&Tabel2[[#This Row],[Entiteit of attribuut]]))","v":"VW_VRWNR"},{"$f":"IF(Schema!I538=\"\",\"\",Schema!I538)","v":""},{"$f":"IF(Schema!J538=\"\",\"\",Schema!J538)","v":""},{"$f":"IF(Schema!K538=\"\",\"\",Schema!K538)","v":""},{"$f":"IF(Schema!L538=\"\",\"\",Schema!L538)","v":""},{"$f":"IF(Schema!N538=\"\",\"\",Schema!N538)","v":"LEEG"}]
[{"$f":"Schema!A539&Schema!B539&Schema!C539&Schema!D539","v":"VRWOM"},"VW",{"$f":"IF(A533=\"\",\"\",IF(LEN(Schema!A539)=2,1,IF(LEN(Schema!B539)=2,10,IF(LEN(Schema!C539)=2,100,0))))","v":0},10,{"$f":"IF(A533=\"\",\"\",SUM(Tabel2[[#This Row],[I1]:[I2]]))","v":10},{"$error":"#REF!"},"VW","",{"$error":"#REF!"},{"$f":"IF(C533=\"\",\"\",IF(LEN(Tabel2[[#This Row],[Entiteit of attribuut]])=2,\"\",Tabel2[[#This Row],[Entiteit]]&\"_\"&Tabel2[[#This Row],[Entiteit of attribuut]]))","v":"VW_VRWOM"},{"$f":"IF(Schema!I539=\"\",\"\",Schema!I539)","v":""},{"$f":"IF(Schema!J539=\"\",\"\",Schema!J539)","v":""},{"$f":"IF(Schema!K539=\"\",\"\",Schema!K539)","v":""},{"$f":"IF(Schema!L539=\"\",\"\",Schema!L539)","v":""},{"$f":"IF(Schema!N539=\"\",\"\",Schema!N539)","v":"LEEG"}]
[{"$f":"Schema!A540&Schema!B540&Schema!C540&Schema!D540","v":"VRWRKCD"},"VW",{"$f":"IF(A534=\"\",\"\",IF(LEN(Schema!A540)=2,1,IF(LEN(Schema!B540)=2,10,IF(LEN(Schema!C540)=2,100,0))))","v":0},10,{"$f":"IF(A534=\"\",\"\",SUM(Tabel2[[#This Row],[I1]:[I2]]))","v":10},{"$error":"#REF!"},"VW","",{"$error":"#REF!"},{"$f":"IF(C534=\"\",\"\",IF(LEN(Tabel2[[#This Row],[Entiteit of attribuut]])=2,\"\",Tabel2[[#This Row],[Entiteit]]&\"_\"&Tabel2[[#This Row],[Entiteit of attribuut]]))","v":"VW_VRWRKCD"},{"$f":"IF(Schema!I540=\"\",\"\",Schema!I540)","v":""},{"$f":"IF(Schema!J540=\"\",\"\",Schema!J540)","v":""},{"$f":"IF(Schema!K540=\"\",\"\",Schema!K540)","v":""},{"$f":"IF(Schema!L540=\"\",\"\",Schema!L540)","v":""},{"$f":"IF(Schema!N540=\"\",\"\",Schema!N540)","v":"LEEG"}]
[{"$f":"Schema!A541&Schema!B541&Schema!C541&Schema!D541","v":"VRWVERS"},"VW",{"$f":"IF(A535=\"\",\"\",IF(LEN(Schema!A541)=2,1,IF(LEN(Schema!B541)=2,10,IF(LEN(Schema!C541)=2,100,0))))","v":0},10,{"$f":"IF(A535=\"\",\"\",SUM(Tabel2[[#This Row],[I1]:[I2]]))","v":10},{"$error":"#REF!"},"VW","",{"$error":"#REF!"},{"$f":"IF(C535=\"\",\"\",IF(LEN(Tabel2[[#This Row],[Entiteit of attribuut]])=2,\"\",Tabel2[[#This Row],[Entiteit]]&\"_\"&Tabel2[[#This Row],[Entiteit of attribuut]]))","v":"VW_VRWVERS"},{"$f":"IF(Schema!I541=\"\",\"\",Schema!I541)","v":""},{"$f":"IF(Schema!J541=\"\",\"\",Schema!J541)","v":""},{"$f":"IF(Schema!K541=\"\",\"\",Schema!K541)","v":""},{"$f":"IF(Schema!L541=\"\",\"\",Schema!L541)","v":""},{"$f":"IF(Schema!N541=\"\",\"\",Schema!N541)","v":"LEEG"}]
[{"$f":"Schema!A542&Schema!B542&Schema!C542&Schema!D542","v":"WM"},"WM",{"$f":"IF(A536=\"\",\"\",IF(LEN(Schema!A542)=2,1,IF(LEN(Schema!B542)=2,10,IF(LEN(Schema!C542)=2,100,0))))","v":10},10,{"$f":"IF(A536=\"\",\"\",SUM(Tabel2[[#This Row],[I1]:[I2]]))","v":20},{"$error":"#REF!"},"WM","",{"$error":"#REF!"},{"$f":"IF(C536=\"\",\"\",IF(LEN(Tabel2[[#This Row],[Entiteit of attribuut]])=2,\"\",Tabel2[[#This Row],[Entiteit]]&\"_\"&Tabel2[[#This Row],[Entiteit of attribuut]]))","v":""},{"$f":"IF(Schema!I542=\"\",\"\",Schema!I542)","v":""},{"$f":"IF(Schema!J542=\"\",\"\",Schema!J542)","v":""},{"$f":"IF(Schema!K542=\"\",\"\",Schema!K542)","v":""},{"$f":"IF(Schema!L542=\"\",\"\",Schema!L542)","v":""},{"$f":"IF(Schema!N542=\"\",\"\",Schema!N542)","v":"LEEG"}]
[{"$f":"Schema!A543&Schema!B543&Schema!C543&Schema!D543","v":"INKHKW"},"WM",{"$f":"IF(A537=\"\",\"\",IF(LEN(Schema!A543)=2,1,IF(LEN(Schema!B543)=2,10,IF(LEN(Schema!C543)=2,100,0))))","v":0},10,{"$f":"IF(A537=\"\",\"\",SUM(Tabel2[[#This Row],[I1]:[I2]]))","v":10},{"$error":"#REF!"},"WM","",{"$error":"#REF!"},{"$f":"IF(C537=\"\",\"\",IF(LEN(Tabel2[[#This Row],[Entiteit of attribuut]])=2,\"\",Tabel2[[#This Row],[Entiteit]]&\"_\"&Tabel2[[#This Row],[Entiteit of attribuut]]))","v":"WM_INKHKW"},{"$f":"IF(Schema!I543=\"\",\"\",Schema!I543)","v":""},{"$f":"IF(Schema!J543=\"\",\"\",Schema!J543)","v":""},{"$f":"IF(Schema!K543=\"\",\"\",Schema!K543)","v":""},{"$f":"IF(Schema!L543=\"\",\"\",Schema!L543)","v":""},{"$f":"IF(Schema!N543=\"\",\"\",Schema!N543)","v":"LEEG"}]
[{"$f":"Schema!A544&Schema!B544&Schema!C544&Schema!D544","v":"VRWRKCD"},"WM",{"$f":"IF(A538=\"\",\"\",IF(LEN(Schema!A544)=2,1,IF(LEN(Schema!B544)=2,10,IF(LEN(Schema!C544)=2,100,0))))","v":0},10,{"$f":"IF(A538=\"\",\"\",SUM(Tabel2[[#This Row],[I1]:[I2]]))","v":10},{"$error":"#REF!"},"WM","",{"$error":"#REF!"},{"$f":"IF(C538=\"\",\"\",IF(LEN(Tabel2[[#This Row],[Entiteit of attribuut]])=2,\"\",Tabel2[[#This Row],[Entiteit]]&\"_\"&Tabel2[[#This Row],[Entiteit of attribuut]]))","v":"WM_VRWRKCD"},{"$f":"IF(Schema!I544=\"\",\"\",Schema!I544)","v":""},{"$f":"IF(Schema!J544=\"\",\"\",Schema!J544)","v":""},{"$f":"IF(Schema!K544=\"\",\"\",Schema!K544)","v":""},{"$f":"IF(Schema!L544=\"\",\"\",Schema!L544)","v":""},{"$f":"IF(Schema!N544=\"\",\"\",Schema!N544)","v":"LEEG"}]
[{"$f":"Schema!A545&Schema!B545&Schema!C545&Schema!D545","v":"TP"},"TP",{"$f":"IF(A539=\"\",\"\",IF(LEN(Schema!A545)=2,1,IF(LEN(Schema!B545)=2,10,IF(LEN(Schema!C545)=2,100,0))))","v":10},10,{"$f":"IF(A539=\"\",\"\",SUM(Tabel2[[#This Row],[I1]:[I2]]))","v":20},{"$error":"#REF!"},"TP","",{"$error":"#REF!"},{"$f":"IF(C539=\"\",\"\",IF(LEN(Tabel2[[#This Row],[Entiteit of attribuut]])=2,\"\",Tabel2[[#This Row],[Entiteit]]&\"_\"&Tabel2[[#This Row],[Entiteit of attribuut]]))","v":""},{"$f":"IF(Schema!I545=\"\",\"\",Schema!I545)","v":""},{"$f":"IF(Schema!J545=\"\",\"\",Schema!J545)","v":""},{"$f":"IF(Schema!K545=\"\",\"\",Schema!K545)","v":""},{"$f":"IF(Schema!L545=\"\",\"\",Schema!L545)","v":""},{"$f":"IF(Schema!N545=\"\",\"\",Schema!N545)","v":"O"}]
[{"$f":"Schema!A546&Schema!B546&Schema!C546&Schema!D546","v":"AFMVRGN"},"TP",{"$f":"IF(A540=\"\",\"\",IF(LEN(Schema!A546)=2,1,IF(LEN(Schema!B546)=2,10,IF(LEN(Schema!C546)=2,100,0))))","v":0},10,{"$f":"IF(A540=\"\",\"\",SUM(Tabel2[[#This Row],[I1]:[I2]]))","v":10},{"$error":"#REF!"},"TP","",{"$error":"#REF!"},{"$f":"IF(C540=\"\",\"\",IF(LEN(Tabel2[[#This Row],[Entiteit of attribuut]])=2,\"\",Tabel2[[#This Row],[Entiteit]]&\"_\"&Tabel2[[#This Row],[Entiteit of attribuut]]))","v":"TP_AFMVRGN"},{"$f":"IF(Schema!I546=\"\",\"\",Schema!I546)","v":""},{"$f":"IF(Schema!J546=\"\",\"\",Schema!J546)","v":""},{"$f":"IF(Schema!K546=\"\",\"\",Schema!K546)","v":""},{"$f":"IF(Schema!L546=\"\",\"\",Schema!L546)","v":""},{"$f":"IF(Schema!N546=\"\",\"\",Schema!N546)","v":"O"}]
[{"$f":"Schema!A547&Schema!B547&Schema!C547&Schema!D547","v":"IDNR"},"TP",{"$f":"IF(A541=\"\",\"\",IF(LEN(Schema!A547)=2,1,IF(LEN(Schema!B547)=2,10,IF(LEN(Schema!C547)=2,100,0))))","v":0},10,{"$f":"IF(A541=\"\",\"\",SUM(Tabel2[[#This Row],[I1]:[I2]]))","v":10},{"$error":"#REF!"},"TP","",{"$error":"#REF!"},{"$f":"IF(C541=\"\",\"\",IF(LEN(Tabel2[[#This Row],[Entiteit of attribuut]])=2,\"\",Tabel2[[#This Row],[Entiteit]]&\"_\"&Tabel2[[#This Row],[Entiteit of attribuut]]))","v":"TP_IDNR"},{"$f":"IF(Schema!I547=\"\",\"\",Schema!I547)","v":""},{"$f":"IF(Schema!J547=\"\",\"\",Schema!J547)","v":""},{"$f":"IF(Schema!K547=\"\",\"\",Schema!K547)","v":""},{"$f":"IF(Schema!L547=\"\",\"\",Schema!L547)","v":""},{"$f":"IF(Schema!N547=\"\",\"\",Schema!N547)","v":"O"}]
[{"$f":"Schema!A548&Schema!B548&Schema!C548&Schema!D548","v":"VE"},"VE",{"$f":"IF(A542=\"\",\"\",IF(LEN(Schema!A548)=2,1,IF(LEN(Schema!B548)=2,10,IF(LEN(Schema!C548)=2,100,0))))","v":10},10,{"$f":"IF(A542=\"\",\"\",SUM(Tabel2[[#This Row],[I1]:[I2]]))","v":20},{"$error":"#REF!"},"VE","",{"$error":"#REF!"},{"$f":"IF(C542=\"\",\"\",IF(LEN(Tabel2[[#This Row],[Entiteit of attribuut]])=2,\"\",Tabel2[[#This Row],[Entiteit]]&\"_\"&Tabel2[[#This Row],[Entiteit of attribuut]]))","v":""},{"$f":"IF(Schema!I548=\"\",\"\",Schema!I548)","v":""},{"$f":"IF(Schema!J548=\"\",\"\",Schema!J548)","v":""},{"$f":"IF(Schema!K548=\"\",\"\",Schema!K548)","v":""},{"$f":"IF(Schema!L548=\"\",\"\",Schema!L548)","v":""},{"$f":"IF(Schema!N548=\"\",\"\",Schema!N548)","v":"V"}]
[{"$f":"Schema!A549&Schema!B549&Schema!C549&Schema!D549","v":"ANAAM"},"VE",{"$f":"IF(A543=\"\",\"\",IF(LEN(Schema!A549)=2,1,IF(LEN(Schema!B549)=2,10,IF(LEN(Schema!C549)=2,100,0))))","v":0},10,{"$f":"IF(A543=\"\",\"\",SUM(Tabel2[[#This Row],[I1]:[I2]]))","v":10},{"$error":"#REF!"},"VE","",{"$error":"#REF!"},{"$f":"IF(C543=\"\",\"\",IF(LEN(Tabel2[[#This Row],[Entiteit of attribuut]])=2,\"\",Tabel2[[#This Row],[Entiteit]]&\"_\"&Tabel2[[#This Row],[Entiteit of attribuut]]))","v":"VE_ANAAM"},{"$f":"IF(Schema!I549=\"\",\"\",Schema!I549)","v":""},{"$f":"IF(Schema!J549=\"\",\"\",Schema!J549)","v":""},{"$f":"IF(Schema!K549=\"\",\"\",Schema!K549)","v":""},{"$f":"IF(Schema!L549=\"\",\"\",Schema!L549)","v":""},{"$f":"IF(Schema!N549=\"\",\"\",Schema!N549)","v":"V"}]
[{"$f":"Schema!A550&Schema!B550&Schema!C550&Schema!D550","v":"IDNR"},"VE",{"$f":"IF(A544=\"\",\"\",IF(LEN(Schema!A550)=2,1,IF(LEN(Schema!B550)=2,10,IF(LEN(Schema!C550)=2,100,0))))","v":0},10,{"$f":"IF(A544=\"\",\"\",SUM(Tabel2[[#This Row],[I1]:[I2]]))","v":10},{"$error":"#REF!"},"VE","",{"$error":"#REF!"},{"$f":"IF(C544=\"\",\"\",IF(LEN(Tabel2[[#This Row],[Entiteit of attribuut]])=2,\"\",Tabel2[[#This Row],[Entiteit]]&\"_\"&Tabel2[[#This Row],[Entiteit of attribuut]]))","v":"VE_IDNR"},{"$f":"IF(Schema!I550=\"\",\"\",Schema!I550)","v":""},{"$f":"IF(Schema!J550=\"\",\"\",Schema!J550)","v":""},{"$f":"IF(Schema!K550=\"\",\"\",Schema!K550)","v":""},{"$f":"IF(Schema!L550=\"\",\"\",Schema!L550)","v":""},{"$f":"IF(Schema!N550=\"\",\"\",Schema!N550)","v":"O"}]
[{"$f":"Schema!A551&Schema!B551&Schema!C551&Schema!D551","v":"MYAAND"},"VE",{"$f":"IF(A545=\"\",\"\",IF(LEN(Schema!A551)=2,1,IF(LEN(Schema!B551)=2,10,IF(LEN(Schema!C551)=2,100,0))))","v":0},10,{"$f":"IF(A545=\"\",\"\",SUM(Tabel2[[#This Row],[I1]:[I2]]))","v":10},{"$error":"#REF!"},"VE","",{"$error":"#REF!"},{"$f":"IF(C545=\"\",\"\",IF(LEN(Tabel2[[#This Row],[Entiteit of attribuut]])=2,\"\",Tabel2[[#This Row],[Entiteit]]&\"_\"&Tabel2[[#This Row],[Entiteit of attribuut]]))","v":"VE_MYAAND"},{"$f":"IF(Schema!I551=\"\",\"\",Schema!I551)","v":""},{"$f":"IF(Schema!J551=\"\",\"\",Schema!J551)","v":""},{"$f":"IF(Schema!K551=\"\",\"\",Schema!K551)","v":""},{"$f":"IF(Schema!L551=\"\",\"\",Schema!L551)","v":""},{"$f":"IF(Schema!N551=\"\",\"\",Schema!N551)","v":"O"}]
[{"$f":"Schema!A552&Schema!B552&Schema!C552&Schema!D552","v":"TELNUM"},"VE",{"$f":"IF(A546=\"\",\"\",IF(LEN(Schema!A552)=2,1,IF(LEN(Schema!B552)=2,10,IF(LEN(Schema!C552)=2,100,0))))","v":0},10,{"$f":"IF(A546=\"\",\"\",SUM(Tabel2[[#This Row],[I1]:[I2]]))","v":10},{"$error":"#REF!"},"VE","",{"$error":"#REF!"},{"$f":"IF(C546=\"\",\"\",IF(LEN(Tabel2[[#This Row],[Entiteit of attribuut]])=2,\"\",Tabel2[[#This Row],[Entiteit]]&\"_\"&Tabel2[[#This Row],[Entiteit of attribuut]]))","v":"VE_TELNUM"},{"$f":"IF(Schema!I552=\"\",\"\",Schema!I552)","v":""},{"$f":"IF(Schema!J552=\"\",\"\",Schema!J552)","v":""},{"$f":"IF(Schema!K552=\"\",\"\",Schema!K552)","v":""},{"$f":"IF(Schema!L552=\"\",\"\",Schema!L552)","v":""},{"$f":"IF(Schema!N552=\"\",\"\",Schema!N552)","v":"V"}]
[{"$f":"Schema!A553&Schema!B553&Schema!C553&Schema!D553","v":"TWEEDED"},"VE",{"$f":"IF(A547=\"\",\"\",IF(LEN(Schema!A553)=2,1,IF(LEN(Schema!B553)=2,10,IF(LEN(Schema!C553)=2,100,0))))","v":0},10,{"$f":"IF(A547=\"\",\"\",SUM(Tabel2[[#This Row],[I1]:[I2]]))","v":10},{"$error":"#REF!"},"VE","",{"$error":"#REF!"},{"$f":"IF(C547=\"\",\"\",IF(LEN(Tabel2[[#This Row],[Entiteit of attribuut]])=2,\"\",Tabel2[[#This Row],[Entiteit]]&\"_\"&Tabel2[[#This Row],[Entiteit of attribuut]]))","v":"VE_TWEEDED"},{"$f":"IF(Schema!I553=\"\",\"\",Schema!I553)","v":""},{"$f":"IF(Schema!J553=\"\",\"\",Schema!J553)","v":""},{"$f":"IF(Schema!K553=\"\",\"\",Schema!K553)","v":""},{"$f":"IF(Schema!L553=\"\",\"\",Schema!L553)","v":""},{"$f":"IF(Schema!N553=\"\",\"\",Schema!N553)","v":"O"}]
[{"$f":"Schema!A554&Schema!B554&Schema!C554&Schema!D554","v":"VOLGNUM"},"VE",{"$f":"IF(A548=\"\",\"\",IF(LEN(Schema!A554)=2,1,IF(LEN(Schema!B554)=2,10,IF(LEN(Schema!C554)=2,100,0))))","v":0},10,{"$f":"IF(A548=\"\",\"\",SUM(Tabel2[[#This Row],[I1]:[I2]]))","v":10},{"$error":"#REF!"},"VE","",{"$error":"#REF!"},{"$f":"IF(C548=\"\",\"\",IF(LEN(Tabel2[[#This Row],[Entiteit of attribuut]])=2,\"\",Tabel2[[#This Row],[Entiteit]]&\"_\"&Tabel2[[#This Row],[Entiteit of attribuut]]))","v":"VE_VOLGNUM"},{"$f":"IF(Schema!I554=\"\",\"\",Schema!I554)","v":""},{"$f":"IF(Schema!J554=\"\",\"\",Schema!J554)","v":""},{"$f":"IF(Schema!K554=\"\",\"\",Schema!K554)","v":""},{"$f":"IF(Schema!L554=\"\",\"\",Schema!L554)","v":""},{"$f":"IF(Schema!N554=\"\",\"\",Schema!N554)","v":"LEEG"}]
[{"$f":"Schema!A555&Schema!B555&Schema!C555&Schema!D555","v":"VRWRKCD"},"VE",{"$f":"IF(A549=\"\",\"\",IF(LEN(Schema!A555)=2,1,IF(LEN(Schema!B555)=2,10,IF(LEN(Schema!C555)=2,100,0))))","v":0},10,{"$f":"IF(A549=\"\",\"\",SUM(Tabel2[[#This Row],[I1]:[I2]]))","v":10},{"$error":"#REF!"},"VE","",{"$error":"#REF!"},{"$f":"IF(C549=\"\",\"\",IF(LEN(Tabel2[[#This Row],[Entiteit of attribuut]])=2,\"\",Tabel2[[#This Row],[Entiteit]]&\"_\"&Tabel2[[#This Row],[Entiteit of attribuut]]))","v":"VE_VRWRKCD"},{"$f":"IF(Schema!I555=\"\",\"\",Schema!I555)","v":""},{"$f":"IF(Schema!J555=\"\",\"\",Schema!J555)","v":""},{"$f":"IF(Schema!K555=\"\",\"\",Schema!K555)","v":""},{"$f":"IF(Schema!L555=\"\",\"\",Schema!L555)","v":""},{"$f":"IF(Schema!N555=\"\",\"\",Schema!N555)","v":"LEEG"}]
[{"$f":"Schema!A556&Schema!B556&Schema!C556&Schema!D556","v":"VL"},"VL",{"$f":"IF(A550=\"\",\"\",IF(LEN(Schema!A556)=2,1,IF(LEN(Schema!B556)=2,10,IF(LEN(Schema!C556)=2,100,0))))","v":10},10,{"$f":"IF(A550=\"\",\"\",SUM(Tabel2[[#This Row],[I1]:[I2]]))","v":20},{"$error":"#REF!"},"VL","",{"$error":"#REF!"},{"$f":"IF(C550=\"\",\"\",IF(LEN(Tabel2[[#This Row],[Entiteit of attribuut]])=2,\"\",Tabel2[[#This Row],[Entiteit]]&\"_\"&Tabel2[[#This Row],[Entiteit of attribuut]]))","v":""},{"$f":"IF(Schema!I556=\"\",\"\",Schema!I556)","v":""},{"$f":"IF(Schema!J556=\"\",\"\",Schema!J556)","v":""},{"$f":"IF(Schema!K556=\"\",\"\",Schema!K556)","v":""},{"$f":"IF(Schema!L556=\"\",\"\",Schema!L556)","v":""},{"$f":"IF(Schema!N556=\"\",\"\",Schema!N556)","v":"V"}]
[{"$f":"Schema!A557&Schema!B557&Schema!C557&Schema!D557","v":"ANAAM"},"VL",{"$f":"IF(A551=\"\",\"\",IF(LEN(Schema!A557)=2,1,IF(LEN(Schema!B557)=2,10,IF(LEN(Schema!C557)=2,100,0))))","v":0},10,{"$f":"IF(A551=\"\",\"\",SUM(Tabel2[[#This Row],[I1]:[I2]]))","v":10},{"$error":"#REF!"},"VL","",{"$error":"#REF!"},{"$f":"IF(C551=\"\",\"\",IF(LEN(Tabel2[[#This Row],[Entiteit of attribuut]])=2,\"\",Tabel2[[#This Row],[Entiteit]]&\"_\"&Tabel2[[#This Row],[Entiteit of attribuut]]))","v":"VL_ANAAM"},{"$f":"IF(Schema!I557=\"\",\"\",Schema!I557)","v":""},{"$f":"IF(Schema!J557=\"\",\"\",Schema!J557)","v":""},{"$f":"IF(Schema!K557=\"\",\"\",Schema!K557)","v":""},{"$f":"IF(Schema!L557=\"\",\"\",Schema!L557)","v":""},{"$f":"IF(Schema!N557=\"\",\"\",Schema!N557)","v":"V"}]
[{"$f":"Schema!A558&Schema!B558&Schema!C558&Schema!D558","v":"EMAIL"},"VL",{"$f":"IF(A552=\"\",\"\",IF(LEN(Schema!A558)=2,1,IF(LEN(Schema!B558)=2,10,IF(LEN(Schema!C558)=2,100,0))))","v":0},10,{"$f":"IF(A552=\"\",\"\",SUM(Tabel2[[#This Row],[I1]:[I2]]))","v":10},{"$error":"#REF!"},"VL","",{"$error":"#REF!"},{"$f":"IF(C552=\"\",\"\",IF(LEN(Tabel2[[#This Row],[Entiteit of attribuut]])=2,\"\",Tabel2[[#This Row],[Entiteit]]&\"_\"&Tabel2[[#This Row],[Entiteit of attribuut]]))","v":"VL_EMAIL"},{"$f":"IF(Schema!I558=\"\",\"\",Schema!I558)","v":""},{"$f":"IF(Schema!J558=\"\",\"\",Schema!J558)","v":""},{"$f":"IF(Schema!K558=\"\",\"\",Schema!K558)","v":""},{"$f":"IF(Schema!L558=\"\",\"\",Schema!L558)","v":""},{"$f":"IF(Schema!N558=\"\",\"\",Schema!N558)","v":"O"}]
[{"$f":"Schema!A559&Schema!B559&Schema!C559&Schema!D559","v":"MYAAND"},"VL",{"$f":"IF(A553=\"\",\"\",IF(LEN(Schema!A559)=2,1,IF(LEN(Schema!B559)=2,10,IF(LEN(Schema!C559)=2,100,0))))","v":0},10,{"$f":"IF(A553=\"\",\"\",SUM(Tabel2[[#This Row],[I1]:[I2]]))","v":10},{"$error":"#REF!"},"VL","",{"$error":"#REF!"},{"$f":"IF(C553=\"\",\"\",IF(LEN(Tabel2[[#This Row],[Entiteit of attribuut]])=2,\"\",Tabel2[[#This Row],[Entiteit]]&\"_\"&Tabel2[[#This Row],[Entiteit of attribuut]]))","v":"VL_MYAAND"},{"$f":"IF(Schema!I559=\"\",\"\",Schema!I559)","v":""},{"$f":"IF(Schema!J559=\"\",\"\",Schema!J559)","v":""},{"$f":"IF(Schema!K559=\"\",\"\",Schema!K559)","v":""},{"$f":"IF(Schema!L559=\"\",\"\",Schema!L559)","v":""},{"$f":"IF(Schema!N559=\"\",\"\",Schema!N559)","v":"V"}]
[{"$f":"Schema!A560&Schema!B560&Schema!C560&Schema!D560","v":"TELNUM"},"VL",{"$f":"IF(A554=\"\",\"\",IF(LEN(Schema!A560)=2,1,IF(LEN(Schema!B560)=2,10,IF(LEN(Schema!C560)=2,100,0))))","v":0},10,{"$f":"IF(A554=\"\",\"\",SUM(Tabel2[[#This Row],[I1]:[I2]]))","v":10},{"$error":"#REF!"},"VL","",{"$error":"#REF!"},{"$f":"IF(C554=\"\",\"\",IF(LEN(Tabel2[[#This Row],[Entiteit of attribuut]])=2,\"\",Tabel2[[#This Row],[Entiteit]]&\"_\"&Tabel2[[#This Row],[Entiteit of attribuut]]))","v":"VL_TELNUM"},{"$f":"IF(Schema!I560=\"\",\"\",Schema!I560)","v":""},{"$f":"IF(Schema!J560=\"\",\"\",Schema!J560)","v":""},{"$f":"IF(Schema!K560=\"\",\"\",Schema!K560)","v":""},{"$f":"IF(Schema!L560=\"\",\"\",Schema!L560)","v":""},{"$f":"IF(Schema!N560=\"\",\"\",Schema!N560)","v":"O"}]
[{"$f":"Schema!A561&Schema!B561&Schema!C561&Schema!D561","v":"TWEEDED"},"VL",{"$f":"IF(A555=\"\",\"\",IF(LEN(Schema!A561)=2,1,IF(LEN(Schema!B561)=2,10,IF(LEN(Schema!C561)=2,100,0))))","v":0},10,{"$f":"IF(A555=\"\",\"\",SUM(Tabel2[[#This Row],[I1]:[I2]]))","v":10},{"$error":"#REF!"},"VL","",{"$error":"#REF!"},{"$f":"IF(C555=\"\",\"\",IF(LEN(Tabel2[[#This Row],[Entiteit of attribuut]])=2,\"\",Tabel2[[#This Row],[Entiteit]]&\"_\"&Tabel2[[#This Row],[Entiteit of attribuut]]))","v":"VL_TWEEDED"},{"$f":"IF(Schema!I561=\"\",\"\",Schema!I561)","v":""},{"$f":"IF(Schema!J561=\"\",\"\",Schema!J561)","v":""},{"$f":"IF(Schema!K561=\"\",\"\",Schema!K561)","v":""},{"$f":"IF(Schema!L561=\"\",\"\",Schema!L561)","v":""},{"$f":"IF(Schema!N561=\"\",\"\",Schema!N561)","v":"O"}]
[{"$f":"Schema!A562&Schema!B562&Schema!C562&Schema!D562","v":"VEIDNR"},"VL",{"$f":"IF(A556=\"\",\"\",IF(LEN(Schema!A562)=2,1,IF(LEN(Schema!B562)=2,10,IF(LEN(Schema!C562)=2,100,0))))","v":0},10,{"$f":"IF(A556=\"\",\"\",SUM(Tabel2[[#This Row],[I1]:[I2]]))","v":10},{"$error":"#REF!"},"VL","",{"$error":"#REF!"},{"$f":"IF(C556=\"\",\"\",IF(LEN(Tabel2[[#This Row],[Entiteit of attribuut]])=2,\"\",Tabel2[[#This Row],[Entiteit]]&\"_\"&Tabel2[[#This Row],[Entiteit of attribuut]]))","v":"VL_VEIDNR"},{"$f":"IF(Schema!I562=\"\",\"\",Schema!I562)","v":""},{"$f":"IF(Schema!J562=\"\",\"\",Schema!J562)","v":""},{"$f":"IF(Schema!K562=\"\",\"\",Schema!K562)","v":""},{"$f":"IF(Schema!L562=\"\",\"\",Schema!L562)","v":""},{"$f":"IF(Schema!N562=\"\",\"\",Schema!N562)","v":"O"}]
[{"$f":"Schema!A563&Schema!B563&Schema!C563&Schema!D563","v":"VOLGNUM"},"VL",{"$f":"IF(A557=\"\",\"\",IF(LEN(Schema!A563)=2,1,IF(LEN(Schema!B563)=2,10,IF(LEN(Schema!C563)=2,100,0))))","v":0},10,{"$f":"IF(A557=\"\",\"\",SUM(Tabel2[[#This Row],[I1]:[I2]]))","v":10},{"$error":"#REF!"},"VL","",{"$error":"#REF!"},{"$f":"IF(C557=\"\",\"\",IF(LEN(Tabel2[[#This Row],[Entiteit of attribuut]])=2,\"\",Tabel2[[#This Row],[Entiteit]]&\"_\"&Tabel2[[#This Row],[Entiteit of attribuut]]))","v":"VL_VOLGNUM"},{"$f":"IF(Schema!I563=\"\",\"\",Schema!I563)","v":""},{"$f":"IF(Schema!J563=\"\",\"\",Schema!J563)","v":""},{"$f":"IF(Schema!K563=\"\",\"\",Schema!K563)","v":""},{"$f":"IF(Schema!L563=\"\",\"\",Schema!L563)","v":""},{"$f":"IF(Schema!N563=\"\",\"\",Schema!N563)","v":"LEEG"}]
[{"$f":"Schema!A564&Schema!B564&Schema!C564&Schema!D564","v":"VRWRKCD"},"VL",{"$f":"IF(A558=\"\",\"\",IF(LEN(Schema!A564)=2,1,IF(LEN(Schema!B564)=2,10,IF(LEN(Schema!C564)=2,100,0))))","v":0},10,{"$f":"IF(A558=\"\",\"\",SUM(Tabel2[[#This Row],[I1]:[I2]]))","v":10},{"$error":"#REF!"},"VL","",{"$error":"#REF!"},{"$f":"IF(C558=\"\",\"\",IF(LEN(Tabel2[[#This Row],[Entiteit of attribuut]])=2,\"\",Tabel2[[#This Row],[Entiteit]]&\"_\"&Tabel2[[#This Row],[Entiteit of attribuut]]))","v":"VL_VRWRKCD"},{"$f":"IF(Schema!I564=\"\",\"\",Schema!I564)","v":""},{"$f":"IF(Schema!J564=\"\",\"\",Schema!J564)","v":""},{"$f":"IF(Schema!K564=\"\",\"\",Schema!K564)","v":""},{"$f":"IF(Schema!L564=\"\",\"\",Schema!L564)","v":""},{"$f":"IF(Schema!N564=\"\",\"\",Schema!N564)","v":"LEEG"}]
[{"$f":"Schema!A565&Schema!B565&Schema!C565&Schema!D565","v":"VP"},"VP",{"$f":"IF(A559=\"\",\"\",IF(LEN(Schema!A565)=2,1,IF(LEN(Schema!B565)=2,10,IF(LEN(Schema!C565)=2,100,0))))","v":10},10,{"$f":"IF(A559=\"\",\"\",SUM(Tabel2[[#This Row],[I1]:[I2]]))","v":20},{"$error":"#REF!"},"VP","",{"$error":"#REF!"},{"$f":"IF(C559=\"\",\"\",IF(LEN(Tabel2[[#This Row],[Entiteit of attribuut]])=2,\"\",Tabel2[[#This Row],[Entiteit]]&\"_\"&Tabel2[[#This Row],[Entiteit of attribuut]]))","v":""},{"$f":"IF(Schema!I565=\"\",\"\",Schema!I565)","v":""},{"$f":"IF(Schema!J565=\"\",\"\",Schema!J565)","v":""},{"$f":"IF(Schema!K565=\"\",\"\",Schema!K565)","v":""},{"$f":"IF(Schema!L565=\"\",\"\",Schema!L565)","v":""},{"$f":"IF(Schema!N565=\"\",\"\",Schema!N565)","v":"V"}]
[{"$f":"Schema!A566&Schema!B566&Schema!C566&Schema!D566","v":"ANAAM"},"VP",{"$f":"IF(A560=\"\",\"\",IF(LEN(Schema!A566)=2,1,IF(LEN(Schema!B566)=2,10,IF(LEN(Schema!C566)=2,100,0))))","v":0},10,{"$f":"IF(A560=\"\",\"\",SUM(Tabel2[[#This Row],[I1]:[I2]]))","v":10},{"$error":"#REF!"},"VP","",{"$error":"#REF!"},{"$f":"IF(C560=\"\",\"\",IF(LEN(Tabel2[[#This Row],[Entiteit of attribuut]])=2,\"\",Tabel2[[#This Row],[Entiteit]]&\"_\"&Tabel2[[#This Row],[Entiteit of attribuut]]))","v":"VP_ANAAM"},{"$f":"IF(Schema!I566=\"\",\"\",Schema!I566)","v":""},{"$f":"IF(Schema!J566=\"\",\"\",Schema!J566)","v":""},{"$f":"IF(Schema!K566=\"\",\"\",Schema!K566)","v":""},{"$f":"IF(Schema!L566=\"\",\"\",Schema!L566)","v":""},{"$f":"IF(Schema!N566=\"\",\"\",Schema!N566)","v":"LEEG"}]
[{"$f":"Schema!A567&Schema!B567&Schema!C567&Schema!D567","v":"GEBDAT"},"VP",{"$f":"IF(A561=\"\",\"\",IF(LEN(Schema!A567)=2,1,IF(LEN(Schema!B567)=2,10,IF(LEN(Schema!C567)=2,100,0))))","v":0},10,{"$f":"IF(A561=\"\",\"\",SUM(Tabel2[[#This Row],[I1]:[I2]]))","v":10},{"$error":"#REF!"},"VP","",{"$error":"#REF!"},{"$f":"IF(C561=\"\",\"\",IF(LEN(Tabel2[[#This Row],[Entiteit of attribuut]])=2,\"\",Tabel2[[#This Row],[Entiteit]]&\"_\"&Tabel2[[#This Row],[Entiteit of attribuut]]))","v":"VP_GEBDAT"},{"$f":"IF(Schema!I567=\"\",\"\",Schema!I567)","v":""},{"$f":"IF(Schema!J567=\"\",\"\",Schema!J567)","v":""},{"$f":"IF(Schema!K567=\"\",\"\",Schema!K567)","v":""},{"$f":"IF(Schema!L567=\"\",\"\",Schema!L567)","v":""},{"$f":"IF(Schema!N567=\"\",\"\",Schema!N567)","v":"O"}]
[{"$f":"Schema!A568&Schema!B568&Schema!C568&Schema!D568","v":"GESLACH"},"VP",{"$f":"IF(A562=\"\",\"\",IF(LEN(Schema!A568)=2,1,IF(LEN(Schema!B568)=2,10,IF(LEN(Schema!C568)=2,100,0))))","v":0},10,{"$f":"IF(A562=\"\",\"\",SUM(Tabel2[[#This Row],[I1]:[I2]]))","v":10},{"$error":"#REF!"},"VP","",{"$error":"#REF!"},{"$f":"IF(C562=\"\",\"\",IF(LEN(Tabel2[[#This Row],[Entiteit of attribuut]])=2,\"\",Tabel2[[#This Row],[Entiteit]]&\"_\"&Tabel2[[#This Row],[Entiteit of attribuut]]))","v":"VP_GESLACH"},{"$f":"IF(Schema!I568=\"\",\"\",Schema!I568)","v":""},{"$f":"IF(Schema!J568=\"\",\"\",Schema!J568)","v":""},{"$f":"IF(Schema!K568=\"\",\"\",Schema!K568)","v":""},{"$f":"IF(Schema!L568=\"\",\"\",Schema!L568)","v":""},{"$f":"IF(Schema!N568=\"\",\"\",Schema!N568)","v":"O"}]
[{"$f":"Schema!A569&Schema!B569&Schema!C569&Schema!D569","v":"HUISNR"},"VP",{"$f":"IF(A563=\"\",\"\",IF(LEN(Schema!A569)=2,1,IF(LEN(Schema!B569)=2,10,IF(LEN(Schema!C569)=2,100,0))))","v":0},10,{"$f":"IF(A563=\"\",\"\",SUM(Tabel2[[#This Row],[I1]:[I2]]))","v":10},{"$error":"#REF!"},"VP","",{"$error":"#REF!"},{"$f":"IF(C563=\"\",\"\",IF(LEN(Tabel2[[#This Row],[Entiteit of attribuut]])=2,\"\",Tabel2[[#This Row],[Entiteit]]&\"_\"&Tabel2[[#This Row],[Entiteit of attribuut]]))","v":"VP_HUISNR"},{"$f":"IF(Schema!I569=\"\",\"\",Schema!I569)","v":""},{"$f":"IF(Schema!J569=\"\",\"\",Schema!J569)","v":""},{"$f":"IF(Schema!K569=\"\",\"\",Schema!K569)","v":""},{"$f":"IF(Schema!L569=\"\",\"\",Schema!L569)","v":""},{"$f":"IF(Schema!N569=\"\",\"\",Schema!N569)","v":"LEEG"}]
[{"$f":"Schema!A570&Schema!B570&Schema!C570&Schema!D570","v":"PARZAKC"},"VP",{"$f":"IF(A564=\"\",\"\",IF(LEN(Schema!A570)=2,1,IF(LEN(Schema!B570)=2,10,IF(LEN(Schema!C570)=2,100,0))))","v":0},10,{"$f":"IF(A564=\"\",\"\",SUM(Tabel2[[#This Row],[I1]:[I2]]))","v":10},{"$error":"#REF!"},"VP","",{"$error":"#REF!"},{"$f":"IF(C564=\"\",\"\",IF(LEN(Tabel2[[#This Row],[Entiteit of attribuut]])=2,\"\",Tabel2[[#This Row],[Entiteit]]&\"_\"&Tabel2[[#This Row],[Entiteit of attribuut]]))","v":"VP_PARZAKC"},{"$f":"IF(Schema!I570=\"\",\"\",Schema!I570)","v":""},{"$f":"IF(Schema!J570=\"\",\"\",Schema!J570)","v":""},{"$f":"IF(Schema!K570=\"\",\"\",Schema!K570)","v":""},{"$f":"IF(Schema!L570=\"\",\"\",Schema!L570)","v":""},{"$f":"IF(Schema!N570=\"\",\"\",Schema!N570)","v":"V"}]
[{"$f":"Schema!A571&Schema!B571&Schema!C571&Schema!D571","v":"PLAATS"},"VP",{"$f":"IF(A565=\"\",\"\",IF(LEN(Schema!A571)=2,1,IF(LEN(Schema!B571)=2,10,IF(LEN(Schema!C571)=2,100,0))))","v":0},10,{"$f":"IF(A565=\"\",\"\",SUM(Tabel2[[#This Row],[I1]:[I2]]))","v":10},{"$error":"#REF!"},"VP","",{"$error":"#REF!"},{"$f":"IF(C565=\"\",\"\",IF(LEN(Tabel2[[#This Row],[Entiteit of attribuut]])=2,\"\",Tabel2[[#This Row],[Entiteit]]&\"_\"&Tabel2[[#This Row],[Entiteit of attribuut]]))","v":"VP_PLAATS"},{"$f":"IF(Schema!I571=\"\",\"\",Schema!I571)","v":""},{"$f":"IF(Schema!J571=\"\",\"\",Schema!J571)","v":""},{"$f":"IF(Schema!K571=\"\",\"\",Schema!K571)","v":""},{"$f":"IF(Schema!L571=\"\",\"\",Schema!L571)","v":""},{"$f":"IF(Schema!N571=\"\",\"\",Schema!N571)","v":"LEEG"}]
[{"$f":"Schema!A572&Schema!B572&Schema!C572&Schema!D572","v":"PCODE"},"VP",{"$f":"IF(A566=\"\",\"\",IF(LEN(Schema!A572)=2,1,IF(LEN(Schema!B572)=2,10,IF(LEN(Schema!C572)=2,100,0))))","v":0},10,{"$f":"IF(A566=\"\",\"\",SUM(Tabel2[[#This Row],[I1]:[I2]]))","v":10},{"$error":"#REF!"},"VP","",{"$error":"#REF!"},{"$f":"IF(C566=\"\",\"\",IF(LEN(Tabel2[[#This Row],[Entiteit of attribuut]])=2,\"\",Tabel2[[#This Row],[Entiteit]]&\"_\"&Tabel2[[#This Row],[Entiteit of attribuut]]))","v":"VP_PCODE"},{"$f":"IF(Schema!I572=\"\",\"\",Schema!I572)","v":""},{"$f":"IF(Schema!J572=\"\",\"\",Schema!J572)","v":""},{"$f":"IF(Schema!K572=\"\",\"\",Schema!K572)","v":""},{"$f":"IF(Schema!L572=\"\",\"\",Schema!L572)","v":""},{"$f":"IF(Schema!N572=\"\",\"\",Schema!N572)","v":"V"}]
[{"$f":"Schema!A573&Schema!B573&Schema!C573&Schema!D573","v":"STRAAT"},"VP",{"$f":"IF(A567=\"\",\"\",IF(LEN(Schema!A573)=2,1,IF(LEN(Schema!B573)=2,10,IF(LEN(Schema!C573)=2,100,0))))","v":0},10,{"$f":"IF(A567=\"\",\"\",SUM(Tabel2[[#This Row],[I1]:[I2]]))","v":10},{"$error":"#REF!"},"VP","",{"$error":"#REF!"},{"$f":"IF(C567=\"\",\"\",IF(LEN(Tabel2[[#This Row],[Entiteit of attribuut]])=2,\"\",Tabel2[[#This Row],[Entiteit]]&\"_\"&Tabel2[[#This Row],[Entiteit of attribuut]]))","v":"VP_STRAAT"},{"$f":"IF(Schema!I573=\"\",\"\",Schema!I573)","v":""},{"$f":"IF(Schema!J573=\"\",\"\",Schema!J573)","v":""},{"$f":"IF(Schema!K573=\"\",\"\",Schema!K573)","v":""},{"$f":"IF(Schema!L573=\"\",\"\",Schema!L573)","v":""},{"$f":"IF(Schema!N573=\"\",\"\",Schema!N573)","v":"LEEG"}]
[{"$f":"Schema!A574&Schema!B574&Schema!C574&Schema!D574","v":"TOEVOEG"},"VP",{"$f":"IF(A568=\"\",\"\",IF(LEN(Schema!A574)=2,1,IF(LEN(Schema!B574)=2,10,IF(LEN(Schema!C574)=2,100,0))))","v":0},10,{"$f":"IF(A568=\"\",\"\",SUM(Tabel2[[#This Row],[I1]:[I2]]))","v":10},{"$error":"#REF!"},"VP","",{"$error":"#REF!"},{"$f":"IF(C568=\"\",\"\",IF(LEN(Tabel2[[#This Row],[Entiteit of attribuut]])=2,\"\",Tabel2[[#This Row],[Entiteit]]&\"_\"&Tabel2[[#This Row],[Entiteit of attribuut]]))","v":"VP_TOEVOEG"},{"$f":"IF(Schema!I574=\"\",\"\",Schema!I574)","v":""},{"$f":"IF(Schema!J574=\"\",\"\",Schema!J574)","v":""},{"$f":"IF(Schema!K574=\"\",\"\",Schema!K574)","v":""},{"$f":"IF(Schema!L574=\"\",\"\",Schema!L574)","v":""},{"$f":"IF(Schema!N574=\"\",\"\",Schema!N574)","v":"LEEG"}]
[{"$f":"Schema!A575&Schema!B575&Schema!C575&Schema!D575","v":"VOLGNUM"},"VP",{"$f":"IF(A569=\"\",\"\",IF(LEN(Schema!A575)=2,1,IF(LEN(Schema!B575)=2,10,IF(LEN(Schema!C575)=2,100,0))))","v":0},10,{"$f":"IF(A569=\"\",\"\",SUM(Tabel2[[#This Row],[I1]:[I2]]))","v":10},{"$error":"#REF!"},"VP","",{"$error":"#REF!"},{"$f":"IF(C569=\"\",\"\",IF(LEN(Tabel2[[#This Row],[Entiteit of attribuut]])=2,\"\",Tabel2[[#This Row],[Entiteit]]&\"_\"&Tabel2[[#This Row],[Entiteit of attribuut]]))","v":"VP_VOLGNUM"},{"$f":"IF(Schema!I575=\"\",\"\",Schema!I575)","v":""},{"$f":"IF(Schema!J575=\"\",\"\",Schema!J575)","v":""},{"$f":"IF(Schema!K575=\"\",\"\",Schema!K575)","v":""},{"$f":"IF(Schema!L575=\"\",\"\",Schema!L575)","v":""},{"$f":"IF(Schema!N575=\"\",\"\",Schema!N575)","v":"LEEG"}]
[{"$f":"Schema!A576&Schema!B576&Schema!C576&Schema!D576","v":"VOORL"},"VP",{"$f":"IF(A570=\"\",\"\",IF(LEN(Schema!A576)=2,1,IF(LEN(Schema!B576)=2,10,IF(LEN(Schema!C576)=2,100,0))))","v":0},10,{"$f":"IF(A570=\"\",\"\",SUM(Tabel2[[#This Row],[I1]:[I2]]))","v":10},{"$error":"#REF!"},"VP","",{"$error":"#REF!"},{"$f":"IF(C570=\"\",\"\",IF(LEN(Tabel2[[#This Row],[Entiteit of attribuut]])=2,\"\",Tabel2[[#This Row],[Entiteit]]&\"_\"&Tabel2[[#This Row],[Entiteit of attribuut]]))","v":"VP_VOORL"},{"$f":"IF(Schema!I576=\"\",\"\",Schema!I576)","v":""},{"$f":"IF(Schema!J576=\"\",\"\",Schema!J576)","v":""},{"$f":"IF(Schema!K576=\"\",\"\",Schema!K576)","v":""},{"$f":"IF(Schema!L576=\"\",\"\",Schema!L576)","v":""},{"$f":"IF(Schema!N576=\"\",\"\",Schema!N576)","v":"LEEG"}]
[{"$f":"Schema!A577&Schema!B577&Schema!C577&Schema!D577","v":"VOORV"},"VP",{"$f":"IF(A571=\"\",\"\",IF(LEN(Schema!A577)=2,1,IF(LEN(Schema!B577)=2,10,IF(LEN(Schema!C577)=2,100,0))))","v":0},10,{"$f":"IF(A571=\"\",\"\",SUM(Tabel2[[#This Row],[I1]:[I2]]))","v":10},{"$error":"#REF!"},"VP","",{"$error":"#REF!"},{"$f":"IF(C571=\"\",\"\",IF(LEN(Tabel2[[#This Row],[Entiteit of attribuut]])=2,\"\",Tabel2[[#This Row],[Entiteit]]&\"_\"&Tabel2[[#This Row],[Entiteit of attribuut]]))","v":"VP_VOORV"},{"$f":"IF(Schema!I577=\"\",\"\",Schema!I577)","v":""},{"$f":"IF(Schema!J577=\"\",\"\",Schema!J577)","v":""},{"$f":"IF(Schema!K577=\"\",\"\",Schema!K577)","v":""},{"$f":"IF(Schema!L577=\"\",\"\",Schema!L577)","v":""},{"$f":"IF(Schema!N577=\"\",\"\",Schema!N577)","v":"LEEG"}]
[{"$f":"Schema!A578&Schema!B578&Schema!C578&Schema!D578","v":"VRWRKCD"},"VP",{"$f":"IF(A572=\"\",\"\",IF(LEN(Schema!A578)=2,1,IF(LEN(Schema!B578)=2,10,IF(LEN(Schema!C578)=2,100,0))))","v":0},10,{"$f":"IF(A572=\"\",\"\",SUM(Tabel2[[#This Row],[I1]:[I2]]))","v":10},{"$error":"#REF!"},"VP","",{"$error":"#REF!"},{"$f":"IF(C572=\"\",\"\",IF(LEN(Tabel2[[#This Row],[Entiteit of attribuut]])=2,\"\",Tabel2[[#This Row],[Entiteit]]&\"_\"&Tabel2[[#This Row],[Entiteit of attribuut]]))","v":"VP_VRWRKCD"},{"$f":"IF(Schema!I578=\"\",\"\",Schema!I578)","v":""},{"$f":"IF(Schema!J578=\"\",\"\",Schema!J578)","v":""},{"$f":"IF(Schema!K578=\"\",\"\",Schema!K578)","v":""},{"$f":"IF(Schema!L578=\"\",\"\",Schema!L578)","v":""},{"$f":"IF(Schema!N578=\"\",\"\",Schema!N578)","v":"LEEG"}]
[{"$f":"Schema!A579&Schema!B579&Schema!C579&Schema!D579","v":"XG"},"XG",{"$f":"IF(A573=\"\",\"\",IF(LEN(Schema!A579)=2,1,IF(LEN(Schema!B579)=2,10,IF(LEN(Schema!C579)=2,100,0))))","v":1},1,{"$f":"IF(A573=\"\",\"\",SUM(Tabel2[[#This Row],[I1]:[I2]]))","v":2},"XG","","","XG",{"$f":"IF(C573=\"\",\"\",IF(LEN(Tabel2[[#This Row],[Entiteit of attribuut]])=2,\"\",Tabel2[[#This Row],[Entiteit]]&\"_\"&Tabel2[[#This Row],[Entiteit of attribuut]]))","v":""},{"$f":"IF(Schema!I579=\"\",\"\",Schema!I579)","v":""},{"$f":"IF(Schema!J579=\"\",\"\",Schema!J579)","v":""},{"$f":"IF(Schema!K579=\"\",\"\",Schema!K579)","v":""},{"$f":"IF(Schema!L579=\"\",\"\",Schema!L579)","v":""},{"$f":"IF(Schema!N579=\"\",\"\",Schema!N579)","v":"LEEG"}]
[{"$f":"Schema!A580&Schema!B580&Schema!C580&Schema!D580","v":"STATUS"},"XG",{"$f":"IF(A574=\"\",\"\",IF(LEN(Schema!A580)=2,1,IF(LEN(Schema!B580)=2,10,IF(LEN(Schema!C580)=2,100,0))))","v":0},1,{"$f":"IF(A574=\"\",\"\",SUM(Tabel2[[#This Row],[I1]:[I2]]))","v":1},"XG","","","XG",{"$f":"IF(C574=\"\",\"\",IF(LEN(Tabel2[[#This Row],[Entiteit of attribuut]])=2,\"\",Tabel2[[#This Row],[Entiteit]]&\"_\"&Tabel2[[#This Row],[Entiteit of attribuut]]))","v":"XG_STATUS"},{"$f":"IF(Schema!I580=\"\",\"\",Schema!I580)","v":""},{"$f":"IF(Schema!J580=\"\",\"\",Schema!J580)","v":""},{"$f":"IF(Schema!K580=\"\",\"\",Schema!K580)","v":""},{"$f":"IF(Schema!L580=\"\",\"\",Schema!L580)","v":""},{"$f":"IF(Schema!N580=\"\",\"\",Schema!N580)","v":"LEEG"}]
[{"$f":"Schema!A581&Schema!B581&Schema!C581&Schema!D581","v":"STATUST"},"XG",{"$f":"IF(A575=\"\",\"\",IF(LEN(Schema!A581)=2,1,IF(LEN(Schema!B581)=2,10,IF(LEN(Schema!C581)=2,100,0))))","v":0},1,{"$f":"IF(A575=\"\",\"\",SUM(Tabel2[[#This Row],[I1]:[I2]]))","v":1},"XG","","","XG",{"$f":"IF(C575=\"\",\"\",IF(LEN(Tabel2[[#This Row],[Entiteit of attribuut]])=2,\"\",Tabel2[[#This Row],[Entiteit]]&\"_\"&Tabel2[[#This Row],[Entiteit of attribuut]]))","v":"XG_STATUST"},{"$f":"IF(Schema!I581=\"\",\"\",Schema!I581)","v":""},{"$f":"IF(Schema!J581=\"\",\"\",Schema!J581)","v":""},{"$f":"IF(Schema!K581=\"\",\"\",Schema!K581)","v":""},{"$f":"IF(Schema!L581=\"\",\"\",Schema!L581)","v":""},{"$f":"IF(Schema!N581=\"\",\"\",Schema!N581)","v":"LEEG"}]
[{"$f":"Schema!A582&Schema!B582&Schema!C582&Schema!D582","v":"VRWRKCD"},"XG",{"$f":"IF(A576=\"\",\"\",IF(LEN(Schema!A582)=2,1,IF(LEN(Schema!B582)=2,10,IF(LEN(Schema!C582)=2,100,0))))","v":0},1,{"$f":"IF(A576=\"\",\"\",SUM(Tabel2[[#This Row],[I1]:[I2]]))","v":1},"XG","","","XG",{"$f":"IF(C576=\"\",\"\",IF(LEN(Tabel2[[#This Row],[Entiteit of attribuut]])=2,\"\",Tabel2[[#This Row],[Entiteit]]&\"_\"&Tabel2[[#This Row],[Entiteit of attribuut]]))","v":"XG_VRWRKCD"},{"$f":"IF(Schema!I582=\"\",\"\",Schema!I582)","v":""},{"$f":"IF(Schema!J582=\"\",\"\",Schema!J582)","v":""},{"$f":"IF(Schema!K582=\"\",\"\",Schema!K582)","v":""},{"$f":"IF(Schema!L582=\"\",\"\",Schema!L582)","v":""},{"$f":"IF(Schema!N582=\"\",\"\",Schema!N582)","v":"LEEG"}]
[{"$f":"Schema!A583&Schema!B583&Schema!C583&Schema!D583","v":"XM"},"XM",{"$f":"IF(A577=\"\",\"\",IF(LEN(Schema!A583)=2,1,IF(LEN(Schema!B583)=2,10,IF(LEN(Schema!C583)=2,100,0))))","v":10},10,{"$f":"IF(A577=\"\",\"\",SUM(Tabel2[[#This Row],[I1]:[I2]]))","v":20},"XG","XM","","XG/XM",{"$f":"IF(C577=\"\",\"\",IF(LEN(Tabel2[[#This Row],[Entiteit of attribuut]])=2,\"\",Tabel2[[#This Row],[Entiteit]]&\"_\"&Tabel2[[#This Row],[Entiteit of attribuut]]))","v":""},{"$f":"IF(Schema!I583=\"\",\"\",Schema!I583)","v":""},{"$f":"IF(Schema!J583=\"\",\"\",Schema!J583)","v":""},{"$f":"IF(Schema!K583=\"\",\"\",Schema!K583)","v":""},{"$f":"IF(Schema!L583=\"\",\"\",Schema!L583)","v":""},{"$f":"IF(Schema!N583=\"\",\"\",Schema!N583)","v":"LEEG"}]
[{"$f":"Schema!A584&Schema!B584&Schema!C584&Schema!D584","v":"STATTXT"},"XM",{"$f":"IF(A578=\"\",\"\",IF(LEN(Schema!A584)=2,1,IF(LEN(Schema!B584)=2,10,IF(LEN(Schema!C584)=2,100,0))))","v":0},10,{"$f":"IF(A578=\"\",\"\",SUM(Tabel2[[#This Row],[I1]:[I2]]))","v":10},"XG","XM","","XG/XM",{"$f":"IF(C578=\"\",\"\",IF(LEN(Tabel2[[#This Row],[Entiteit of attribuut]])=2,\"\",Tabel2[[#This Row],[Entiteit]]&\"_\"&Tabel2[[#This Row],[Entiteit of attribuut]]))","v":"XM_STATTXT"},{"$f":"IF(Schema!I584=\"\",\"\",Schema!I584)","v":""},{"$f":"IF(Schema!J584=\"\",\"\",Schema!J584)","v":""},{"$f":"IF(Schema!K584=\"\",\"\",Schema!K584)","v":""},{"$f":"IF(Schema!L584=\"\",\"\",Schema!L584)","v":""},{"$f":"IF(Schema!N584=\"\",\"\",Schema!N584)","v":"LEEG"}]
[{"$f":"Schema!A585&Schema!B585&Schema!C585&Schema!D585","v":"VOLGNUM"},{"$f":"IF(LEN(A579)=2,A579,IF(A579=\"\",\"Leeg\",B578))","v":"XM"},{"$f":"IF(A579=\"\",\"\",IF(LEN(Schema!A585)=2,1,IF(LEN(Schema!B585)=2,10,IF(LEN(Schema!C585)=2,100,0))))","v":0},{"$f":"IF(C579=0,D578,C579)","v":10},{"$f":"IF(A579=\"\",\"\",SUM(Tabel2[[#This Row],[I1]:[I2]]))","v":10},{"$f":"IF(A579=\"\",\"\",IF(C579=1,B579,F578))","v":"XG"},{"$f":"IF(C579=10,A579,IF(OR(C579=0,C579=100),G578,\"\"))","v":"XM"},{"$f":"IF(E579=200,B579,IF(C579=0,H578,\"\"))","v":""},{"$f":"IF(C579=\"\",\"\",IF(OR(E579=1,E579=10,E579=100),I578,IF(E579=2,F579,IF(E579=20,F579&\"/\"&G579,IF(E579=200,F579&\"/\"&G579&\"/\"&H579)))))","v":"XG/XM"},{"$f":"IF(C579=\"\",\"\",IF(LEN(Tabel2[[#This Row],[Entiteit of attribuut]])=2,\"\",Tabel2[[#This Row],[Entiteit]]&\"_\"&Tabel2[[#This Row],[Entiteit of attribuut]]))","v":"XM_VOLGNUM"},{"$f":"IF(Schema!I585=\"\",\"\",Schema!I585)","v":""},{"$f":"IF(Schema!J585=\"\",\"\",Schema!J585)","v":""},{"$f":"IF(Schema!K585=\"\",\"\",Schema!K585)","v":""},{"$f":"IF(Schema!L585=\"\",\"\",Schema!L585)","v":""},{"$f":"IF(Schema!N585=\"\",\"\",Schema!N585)","v":"LEEG"}]
[{"$f":"Schema!A586&Schema!B586&Schema!C586&Schema!D586","v":"VRWRKCD"},"XM",{"$f":"IF(A580=\"\",\"\",IF(LEN(Schema!A586)=2,1,IF(LEN(Schema!B586)=2,10,IF(LEN(Schema!C586)=2,100,0))))","v":0},10,{"$f":"IF(A580=\"\",\"\",SUM(Tabel2[[#This Row],[I1]:[I2]]))","v":10},"XG","XM","","XG/XM",{"$f":"IF(C580=\"\",\"\",IF(LEN(Tabel2[[#This Row],[Entiteit of attribuut]])=2,\"\",Tabel2[[#This Row],[Entiteit]]&\"_\"&Tabel2[[#This Row],[Entiteit of attribuut]]))","v":"XM_VRWRKCD"},{"$f":"IF(Schema!I586=\"\",\"\",Schema!I586)","v":""},{"$f":"IF(Schema!J586=\"\",\"\",Schema!J586)","v":""},{"$f":"IF(Schema!K586=\"\",\"\",Schema!K586)","v":""},{"$f":"IF(Schema!L586=\"\",\"\",Schema!L586)","v":""},{"$f":"IF(Schema!N586=\"\",\"\",Schema!N586)","v":"LEEG"}]
[{"$f":"Schema!A587&Schema!B587&Schema!C587&Schema!D587","v":"XPATH"},"XM",{"$f":"IF(A581=\"\",\"\",IF(LEN(Schema!A587)=2,1,IF(LEN(Schema!B587)=2,10,IF(LEN(Schema!C587)=2,100,0))))","v":0},10,{"$f":"IF(A581=\"\",\"\",SUM(Tabel2[[#This Row],[I1]:[I2]]))","v":10},"XG","XM","","XG/XM",{"$f":"IF(C581=\"\",\"\",IF(LEN(Tabel2[[#This Row],[Entiteit of attribuut]])=2,\"\",Tabel2[[#This Row],[Entiteit]]&\"_\"&Tabel2[[#This Row],[Entiteit of attribuut]]))","v":"XM_XPATH"},{"$f":"IF(Schema!I587=\"\",\"\",Schema!I587)","v":""},{"$f":"IF(Schema!J587=\"\",\"\",Schema!J587)","v":""},{"$f":"IF(Schema!K587=\"\",\"\",Schema!K587)","v":""},{"$f":"IF(Schema!L587=\"\",\"\",Schema!L587)","v":""},{"$f":"IF(Schema!N587=\"\",\"\",Schema!N587)","v":"LEEG"}]

{"sheet":"Functielijst","index":6,"n_rows":7,"n_cols":1,"rows_kept":7,"cut":false,"hidden":true,"merged":[]}
["Kolom1"]
["Functielijst"]
["premieBerekening_aanroep"]
["premieBerekening_resultaat"]
["Acceptatie_aanroep"]
["Acceptatie_resultaat"]
["kunnenAanleveren"]