{"text_format":"1","workbook":"xlsx","n_sheets":7,"sheets":["Toelichting & Leeswijzer","Schema"," Verbandscontrole","Openstaande punten","Updates","CSVoutput","Functielijst"],"not_rendered":{"charts":0,"images":2,"macros":1,"external_links":0,"defined_names":1,"comments":0,"pivot_tables":0},"unopened":[],"bounds":{"document_bytes":16777216,"sheet_cells":100000,"rows_first":2000,"rows_last":500,"rows_between":2000,"halvings":0,"cell_chars":16384,"cell_head_chars":4096},"cells_cut":0,"cells_raw":0,"read":"whole","date_system":"1900"}

{"sheet":"Toelichting & Leeswijzer","index":0,"n_rows":40,"n_cols":4,"rows_kept":40,"cut":false,"hidden":false,"merged":[]}
[null,"                           AFD Definitie"]
[null,"Toelichting"]
[null,"Leest u eerst de Instructie specificatie AFD-definitie voor u gebruik maakt van deze XLSM. U vindt de instructie op https://suiv.nl/instructies-en-templates/"]
[]
[null,"Deze XLS ondersteunt u bij het vaststellen van de specificaties voor de AFD-definitie. Hieronder staat uitgelegd hoe de XLSM is opgebouwd. "]
[]
[null,"De opbouw van deze XLSM"]
[null,"Deze XLSM bestaat uit 5 tabbladen:"]
[null,"1: Toelichting & Leeswijzer"]
[null,null,"U vindt hier in het kort informatie over het gebruik van deze XLSM en verwijzingen naar de Instructie specificatie AFD-definitie. "]
[null,"2: Schema"]
[null,null,"In het tabblad Schema meldt u de meta-gegevens voor de AFD-definitie en legt u de specificaties van de AFD-definitie vast. "]
[null,null,"Zie paragraven 3.1, 4.4 en 5.5 in Instructie specificatie AFD-definitie voor meer informatie. "]
[null,"3: Verbandscontroles"]
[null,null,"In het tabblad Verbandscontrole kunt u validatieregels opnemen. Deze verbandscontroles zorgen voor een snellere en betere kwaliteit van invoer door volmacht. "]
[null,null,"Zie paragraaf 3.2 in Instructie specificatie AFD-definitie voor meer informatie. "]
[null,"4: Openstaande punten"]
[null,null,"De tab Openstaande punten is opgenomen voor ondersteuning in interne communicatie over de specificaties van de AFD-definitie. "]
[null,"5: Updates"]
[null,null,"De tab Updates biedt u de optie om beheer te houden over versies in de geleverde AFD-definities."]
[]
[null,"Omzetten naar CSV voor importeren in de Online Samenstellen Tool"]
[null,"In de Online Samenstellen Tool is het mogelijk de benodigde entiteiten en attributen eenvoudig te importeren middels een CSV bestand. "]
[null,"Met onderstaande werkwijze kan dit XLSM omgezet worden naar een CSV bestand. "]
[null,"Verdere toelichting rond de import functie is te vinden in de documentatie van Online Samenstellen."]
[]
[null,null,"Optie 1: Automatisch (Let op, macro's moeten ingeschakeld zijn)"]
[null,null,"1. Druk op de knop 'CSV bestand'."]
[null,null,null,"(Een CSV bestand wordt automatisch opgeslagen in dezelfde map als dit XLSM.)"]
[null,null,"2. Open het CSV bestand."]
[null,null,"3. Gebruik de Excel functie 'Tekst naar kolommen' en kies de optie 'gescheiden' en selecter 'komma's'. Deze excelfunctie is te vinden onder het tabblad gegevens. "]
[null,null,"4. Het CSV vult automatisch de vijf functiekolommen. Is een functie ongebruikt? Verwijder dat kolom."]
[null,null,"5. Bestand is klaar voor importeren."]
[]
[null,null,"Optie 2: Handmatig (Indien macro's niet mogelijk zijn)"]
[null,null,"1. In dit XLS is een tabblad 'CSVoutput' verborgen. Klik met de rechtermuisknop op een bladwijzer en selecteer 'zichtbaar maken'. Kies vervolgens het tabblad 'CSVoutput'"]
[null,null,"2. Kopieer van tabblad 'CSVoutput' kolom I t/m O en plak de waarden in een nieuw Excel bestand."]
[null,null,"3. Sla dit bestand op als 'door komma gescheiden (* .csv)'."]
[null,null,"4. Is een functie ongebruikt? Verwijder dat kolom."]
[null,null,"5. Bestand is klaar voor importeren."]

{"sheet":"Schema","index":1,"n_rows":545,"n_cols":16,"rows_kept":545,"cut":false,"hidden":false,"merged":[[12,6,12,7]]}
["Inventarisatie noodzakelijke attributen "]
["Naam organisatie:"]
["Branche:"]
["POR maatschappij aanduiding:"]
["AFD Definitie naam:"]
["AFD Definitie versie nummer:"]
["Tag:"]
["Commerciele productnaam:"]
["Bronnen:"]
["Contactpersoon:"]
["E-mail / Telefoon:"]
["Datum:",null,"16-11-2021",null,null,null,"Let op: Actuele versie NVGA Protocol"]
[null,null,null,null,null,null,"NVGA Protocol ",null,"AFD-definitie","AFD-definitie","AFD-definitie","AFD-definitie",null,"AFD-definitie"]
["Entiteit","Attribuut /\n subentiteit","Attribuut/ \nsubentiteit","Attribuut","Codelijst","Omschrijving","NVGA Protocol altijd opnemen","NVGA Protocol te beoordelen","premieBerekening_aanroep","premieBerekening_resultaat","Acceptatie_aanroep","Acceptatie_resultaat","Polis\nInformatie","kunnenAanleveren","Toegestane herhaling/ Waardebeperking","Bevindingen"]
["AL",null,null,null,"","BERICHT ALGEMEEN","V",null,null,null,null,null,null,{"$f":"IF(LEFT(G15,1)=\"X\",\"X\",IF(LEFT(G15,1)=\"V\",\"V\",IF(H15=\"V\",\"V\",IF(I15=\"V\",\"V\",IF(J15=\"V\",\"O\",IF(K15=\"V\",\"O\",IF(L15=\"V\",\"O\",IF(M15=\"V\",\"O\",IF(LEFT(G15,1)=\"O\",\"O\",IF(LEFT(H15,1)=\"O\",\"O\",IF(I15=\"O\",\"O\",IF(J15=\"O\",\"O\",IF(K15=\"O\",\"O\",IF(L15=\"O\",\"O\",IF(M15=\"O\",\"O\",\"LEEG\")))))))))))))))","v":"V"}]
[null,"ADATMSG",null,null,"","Datum aanmaak bericht","V",null,null,null,null,null,null,{"$f":"IF(LEFT(G16,1)=\"X\",\"X\",IF(LEFT(G16,1)=\"V\",\"V\",IF(H16=\"V\",\"V\",IF(I16=\"V\",\"V\",IF(J16=\"V\",\"O\",IF(K16=\"V\",\"O\",IF(L16=\"V\",\"O\",IF(M16=\"V\",\"O\",IF(LEFT(G16,1)=\"O\",\"O\",IF(LEFT(H16,1)=\"O\",\"O\",IF(I16=\"O\",\"O\",IF(J16=\"O\",\"O\",IF(K16=\"O\",\"O\",IF(L16=\"O\",\"O\",IF(M16=\"O\",\"O\",\"LEEG\")))))))))))))))","v":"V"}]
[null,"APPCODE",null,null,null,"Toegangscode",null,null,null,null,null,null,null,"LEEG"]
[null,"APPLNM",null,null,"","Naam verzendende applicatie","O",null,null,null,null,null,null,"O"]
[null,"APPLVS",null,null,"","Versie verzendende applicatie","O",null,null,null,null,null,null,"O"]
[null,"APPUSER",null,null,null,"Gebruikscode",null,null,null,null,null,null,null,"LEEG"]
[null,"BRONNM",null,null,null,"Naam vullende applicatie",null,null,null,null,null,null,null,"LEEG"]
[null,"CPREF",null,null,"","Referentie zender","V",null,null,null,null,null,null,"V"]
[null,"DATACAT",null,null,"ADNAFM","Versie datacatalogus",null,null,null,null,null,null,null,"LEEG"]
[null,"FUNCTIE",null,null,"ADNFUN","Berichtfunctie, code",null,null,null,null,null,null,null,"LEEG"]
[null,"INCLGP",null,null,"ADNLOG","Inclusief geroyeerde polissen J/N","V",null,null,null,null,null,null,"V"]
[null,"INCLOP",null,null,"ADNLOG","Inclusief opgeschorte polissen J/N","V",null,null,null,null,null,null,"V"]
[null,"INCLPP",null,null,"ADNLOG","Inclusief premievrij polissen J/N","V",null,null,null,null,null,null,"V"]
[null,"MNDGP",null,null,"","Max. aantal mnd. geroyeerde polissen","O",null,null,null,null,null,null,"O"]
[null,"VERSIEV",null,null,"ADNVER","Versienummer view, code","V",null,null,null,null,null,null,"V"]
[null,"VIEWCOD",null,null,"ADNVIE","Soort view, code",null,null,null,null,null,null,null,"LEEG"]
[null,"VRWRKCD",null,null,"ADNVRC","Verwerkingscode entiteit",null,null,null,null,null,null,null,"LEEG"]
["PK",null,null,null,"","CONTRACT PAKKET","O",null,null,null,null,null,null,"O"]
[null,"NUMMER",null,null,"","Contractnummer","V",null,null,null,null,null,null,"V"]
["RC",null,null,null,"","CONTRACT RAAMCONTRACT","O",null,null,null,null,null,null,"O"]
[null,"NUMMER",null,null,"","Contractnummer","V",null,null,null,null,null,null,"V"]
[null,"VRWRKCD",null,null,"ADNVRC","Verwerkingscode entiteit",null,null,null,null,null,null,null,"LEEG"]
["PP",null,null,null,"","CONTRACT POLIS/ONDERDEEL","V",null,null,null,null,null,null,"V"]
[null,"ADEFVRS",null,null,"","AFD definitieversienummer","V",null,null,null,null,null,null,"V"]
[null,"AFDDEFN",null,null,"","AFD definitienaam","V",null,null,null,null,null,null,"V"]
[null,"BETTERM",null,null,"","Betaaltermijn in maanden","O",null,null,null,null,null,null,"O"]
[null,"BRANCHE",null,null,"ADNBRA","ADN branchecode","V",null,null,null,null,null,null,"V"]
[null,"BTP",null,null,null,"Termijnbedrag bruto premie",null,null,null,null,null,null,null,"LEEG"]
[null,"CDUUMND",null,null,"","Contractduur in maanden","O",null,null,null,null,null,null,"O"]
[null,"COASSJN",null,null,"ADNLOG","Polis ond. van verdeling/coass J/N","V",null,null,null,null,null,null,"V"]
[null,"ENDDATC",null,null,"","Beëindigingsdatum","O",null,null,null,null,null,null,"O"]
[null,"EXTERN",null,null,null,"Extern indicatief",null,null,null,null,null,null,null,"LEEG"]
[null,"GABRA",null,null,"","Volmacht branchecode","V",null,null,null,null,null,null,"V"]
[null,"GABRAO",null,null,"","Volmacht branchecode, omschr.","V",null,null,null,null,null,null,"V"]
[null,"GASBRA",null,null,"","Volmacht subbranchecode","V",null,null,null,null,null,null,"V"]
[null,"GASBRAO",null,null,"","Volmacht subbranchecode, omschr.","V",null,null,null,null,null,null,"V"]
[null,"HANDACC",null,null,"ADNLOG","Handmatige acceptatie J/N",null,null,null,null,null,null,null,"LEEG"]
[null,"HVVDAT",null,null,"","Hoofdvervaldatum","O",null,null,null,null,null,null,"O"]
[null,"INGDAT",null,null,"","Ingangsdatum","V",null,null,null,null,null,null,"V"]
[null,"INGDTW",null,null,null,"Ingangsdatum van de wijziging",null,null,null,null,null,null,null,"LEEG"]
[null,"INTKEY",null,null,"","Interne sleutel","O",null,null,null,null,null,null,"O"]
[null,"LWYZDAT",null,null,"","Datum laatste wijziging","O",null,null,null,null,null,null,"O"]
[null,"MYAAND",null,null,"PORMAA","POR Maatschappij aanduiding, code","V",null,null,null,null,null,null,"V"]
[null,"NJP",null,null,"","Netto jaarpremie","O",null,null,null,null,null,null,"O"]
[null,"NUMMER",null,null,"","Contractnummer","V",null,null,null,null,null,null,"V"]
[null,"POLPKJN",null,null,"ADNLOG","Polis onderdeel van een pakket J/N","V",null,null,null,null,null,null,"V"]
[null,"PPRC",null,null,null,"Percentage prolongatieprovisie",null,null,null,null,null,null,null,"LEEG"]
[null,"RDNMUT",null,null,"ADNMUT","Reden aanvraag, mutatie, code",null,null,null,null,null,null,null,"LEEG"]
[null,"SPECLIM",null,null,"ADNLOG","Special limit J/N","V",null,null,null,null,null,null,"V"]
[null,"STATUS",null,null,"ADNSTS","Status, code","V",null,null,null,null,null,null,"V"]
[null,"STPRV",null,null,"ADNLOG","Standaard provisie J/N",null,null,null,null,null,null,null,"LEEG"]
[null,"TARDAT",null,null,null,"Tariefdatum",null,null,null,null,null,null,null,"LEEG"]
[null,"TJRPO",null,null,"","Tekenjaar pool","O",null,null,null,null,null,null,"O"]
[null,"TJRPP",null,null,"","Tekenjaar polis","V",null,null,null,null,null,null,"V"]
[null,"VGCODE",null,null,"","Volmachtgever code","V",null,null,null,null,null,null,"V"]
[null,"VOLGNUM",null,null,null,"Volgnummer",null,null,null,null,null,null,null,"LEEG"]
[null,"VRWRKCD",null,null,"ADNVRC","Verwerkingscode entiteit",null,null,null,null,null,null,null,"LEEG"]
[null,"RS",null,null,"","OBJECT REIS",null,"O:XO",null,null,null,null,null,"O","maxOccurs 1"]
[null,null,"MAXDUUR",null,null,"Maximale reisduur in dagen",null,null,null,null,null,null,null,"LEEG"]
[null,null,"VOLGNUM",null,null,"Volgnummer","O:XO",null,null,null,null,null,null,"O"]
[null,null,"VRWRKCD",null,"ADNVRC","Verwerkingscode entiteit",null,null,null,null,null,null,null,"LEEG"]
[null,"AN",null,null,null,"DEKKING ANNULERING",null,"O:XD",null,null,null,null,null,"O","maxOccurs 1"]
[null,null,"BAFWST",null,null,"Bedrag afwijk. op standaard tarief","O:XD",null,null,null,null,null,null,"O"]
[null,null,"BTP",null,null,"Termijnbedrag bruto premie",null,null,null,null,null,null,null,"LEEG"]
[null,null,"CODE",null,"ADNDEK","Dekkingscode","O:XD",null,null,null,null,null,null,"O"]
[null,null,"COLFACT",null,null,"Perc. collectiviteitfactor","O:XD_PRCCOLK",null,null,null,null,null,null,{"$f":"IF(LEFT(G80,1)=\"X\",\"X\",IF(LEFT(G80,1)=\"V\",\"V\",IF(H80=\"V\",\"V\",IF(I80=\"V\",\"V\",IF(J80=\"V\",\"O\",IF(K80=\"V\",\"O\",IF(L80=\"V\",\"O\",IF(M80=\"V\",\"O\",IF(LEFT(G80,1)=\"O\",\"O\",IF(LEFT(H80,1)=\"O\",\"O\",IF(I80=\"O\",\"O\",IF(J80=\"O\",\"O\",IF(K80=\"O\",\"O\",IF(L80=\"O\",\"O\",IF(M80=\"O\",\"O\",\"LEEG\")))))))))))))))","v":"O"}]
[null,null,"ERB",null,null,"Bedrag eigen risico",null,"O:XD",null,null,null,null,null,"O"]
[null,null,"GADEKCD",null,null,"Volmacht dekkingscode","V:XD",null,null,null,null,null,null,"V"]
[null,null,"GADEKCO",null,null,"Volmacht dekkingscode, omschr.","V:XD",null,null,null,null,null,null,"V"]
[null,null,"GEBIED",null,"ADNDKG","Dekkingsgebied, code",null,null,null,null,null,null,null,"LEEG"]
[null,null,"GSS",null,"ADNGEZ","Verzekerde gezinssamenstelling, code",null,null,null,null,null,null,null,"LEEG"]
[null,null,"MYCODE",null,"ADNMCD","Dekkingscode maatschappij, code",null,"O:XD",null,null,null,null,null,"O"]
[null,null,"NJP",null,null,"Netto jaarpremie","O:XD",null,null,null,null,null,null,"O"]
[null,null,"PAFWST",null,null,"Percentage afw. op standaard tarief","O:XD",null,null,null,null,null,null,"O"]
[null,null,"PPRC",null,null,"Percentage prolongatieprovisie","O:XD",null,null,null,null,null,null,"O"]
[null,null,"PRCPKKT",null,null,"Percentage pakketkorting","O:XD",null,null,null,null,null,null,"O"]
[null,null,"PRCTEKC",null,null,"Percentage Volmachtbeloning","O:XD",null,null,null,null,null,null,"O"]
[null,null,"RELVRH",null,"ADNENT","Relatie verhouding tot, code","O:XD",null,null,null,null,null,null,"O"]
[null,null,"RELVVNR",null,null,"Relatie verhouding tot, volgnummer","O:XD",null,null,null,null,null,null,"O"]
[null,null,"RJRCOR",null,null,"Resterende jaren voor correctie","O:XD",null,null,null,null,null,null,"O"]
[null,null,"TCORBDR",null,null,"Toegepast correctiebedrag","O:XD",null,null,null,null,null,null,"O"]
[null,null,"VERZSOM",null,null,"Verzekerde som",null,"O:XD",null,null,null,null,null,"O"]
[null,null,"VGBRA",null,null,"Volmachtgever branchecode","O:XD",null,null,null,null,null,null,"O"]
[null,null,"VOLGNUM",null,null,"Volgnummer",null,null,null,null,null,null,null,"LEEG"]
[null,null,"VRWRKCD",null,null,"Verwerkingscode entiteit",null,null,null,null,null,null,null,"LEEG"]
[null,null,"WPREMBP",null,"ADNPBP","Wijze premieberekening prol., code","O:XD",null,null,null,null,null,null,"O"]
[null,null,"MP",null,null,"POOLAANDEEL","O",null,null,null,null,null,null,"O"]
[null,null,null,"MYAAND","PORMAA","POR Maatschappij aanduiding, code","O",null,null,null,null,null,null,"O"]
[null,null,null,"PLLEAD","ADNLOG","Poolleader J/N","O",null,null,null,null,null,null,"O"]
[null,null,null,"POOLNUM",null,"Poolnummer","V",null,null,null,null,null,null,"V"]
[null,null,null,"POOLPRC",null,"Percentage poolaandeel","V",null,null,null,null,null,null,"V"]
[null,"BR",null,null,null,"DEKKING BAGAGE",null,"O:XD",null,null,null,null,null,"O","maxOccurs 1"]
[null,null,"BAFWST",null,null,"Bedrag afwijk. op standaard tarief","O:XD",null,null,null,null,null,null,"O"]
[null,null,"BTP",null,null,"Termijnbedrag bruto premie",null,null,null,null,null,null,null,"LEEG"]
[null,null,"CODE",null,"ADNDEK","Dekkingscode","O:XD",null,null,null,null,null,null,"O"]
[null,null,"COLFACT",null,null,"Perc. collectiviteitfactor","O:XD_PRCCOLK",null,null,null,null,null,null,"O"]
[null,null,"ERB",null,null,"Bedrag eigen risico",null,"O:XD",null,null,null,null,null,"O"]
[null,null,"GADEKCD",null,null,"Volmacht dekkingscode","V:XD",null,null,null,null,null,null,"V"]
[null,null,"GADEKCO",null,null,"Volmacht dekkingscode, omschr.","V:XD",null,null,null,null,null,null,"V"]
[null,null,"MYCODE",null,"ADNMCD","Dekkingscode maatschappij, code",null,"O:XD",null,null,null,null,null,"O"]
[null,null,"NJP",null,null,"Netto jaarpremie","O:XD",null,null,null,null,null,null,"O"]
[null,null,"PAFWST",null,null,"Percentage afw. op standaard tarief","O:XD",null,null,null,null,null,null,"O"]
[null,null,"PPRC",null,null,"Percentage prolongatieprovisie","O:XD",null,null,null,null,null,null,"O"]
[null,null,"PRCPKKT",null,null,"Percentage pakketkorting","O:XD",null,null,null,null,null,null,"O"]
[null,null,"PRCTEKC",null,null,"Percentage Volmachtbeloning","O:XD",null,null,null,null,null,null,"O"]
[null,null,"RELVRH",null,"ADNENT","Relatie verhouding tot, code","O:XD",null,null,null,null,null,null,"O"]
[null,null,"RELVVNR",null,null,"Relatie verhouding tot, volgnummer","O:XD",null,null,null,null,null,null,"O"]
[null,null,"RJRCOR",null,null,"Resterende jaren voor correctie","O:XD",null,null,null,null,null,null,"O"]
[null,null,"TCORBDR",null,null,"Toegepast correctiebedrag","O:XD",null,null,null,null,null,null,"O"]
[null,null,"VERZSOM",null,null,"Verzekerde som",null,"O:XD",null,null,null,null,null,"O"]
[null,null,"VGBRA",null,null,"Volmachtgever branchecode","O:XD",null,null,null,null,null,null,"O"]
[null,null,"VOLGNUM",null,null,"Volgnummer",null,null,null,null,null,null,null,"LEEG"]
[null,null,"VRWRKCD",null,null,"Verwerkingscode entiteit",null,null,null,null,null,null,null,"LEEG"]
[null,null,"WPREMBP",null,"ADNPBP","Wijze premieberekening prol., code","O:XD",null,null,null,null,null,null,"O"]
[null,null,"MP",null,null,"POOLAANDEEL","O",null,null,null,null,null,null,"O"]
[null,null,null,"MYAAND","PORMAA","POR Maatschappij aanduiding, code","O",null,null,null,null,null,null,"O"]
[null,null,null,"PLLEAD","ADNLOG","Poolleader J/N","O",null,null,null,null,null,null,"O"]
[null,null,null,"POOLNUM",null,"Poolnummer","V",null,null,null,null,null,null,"V"]
[null,null,null,"POOLPRC",null,"Percentage poolaandeel","V",null,null,null,null,null,null,"V"]
[null,"DR",null,null,null,"DEKKING REIS",null,"O:XD",null,null,null,null,null,"O","maxOccurs 1"]
[null,null,"AANTPRS",null,null,"Verz. aantal personen",null,null,null,null,null,null,null,"LEEG"]
[null,null,"ASSKIDS",null,"ADNLOG","Mvz. kinder hulpverlening J/N",null,null,null,null,null,null,null,"LEEG"]
[null,null,"ASSLIFE",null,"ADNLOG","Mvz. medische info hulpverlening J/N",null,null,null,null,null,null,null,"LEEG"]
[null,null,"ASSLUG",null,"ADNLOG","Mvz. bagage hulpverlening J/N",null,null,null,null,null,null,null,"LEEG"]
[null,null,"ASSSMS",null,"ADNLOG","Mvz. SMS info hulpverlening J/N",null,null,null,null,null,null,null,"LEEG"]
[null,null,"BAFWST",null,null,"Bedrag afwijk. op standaard tarief","O:XD",null,null,null,null,null,null,"O"]
[null,null,"BTP",null,null,"Termijnbedrag bruto premie",null,null,null,null,null,null,null,"LEEG"]
[null,null,"CODE",null,"ADNDEK","Dekkingscode","O:XD",null,null,null,null,null,null,"O"]
[null,null,"COLFACT",null,null,"Perc. collectiviteitfactor","O:XD_PRCCOLK",null,null,null,null,null,null,"O"]
[null,null,"ERB",null,null,"Bedrag eigen risico",null,"O:XD",null,null,null,null,null,{"$f":"IF(LEFT(G144,1)=\"X\",\"X\",IF(LEFT(G144,1)=\"V\",\"V\",IF(H144=\"V\",\"V\",IF(I144=\"V\",\"V\",IF(J144=\"V\",\"O\",IF(K144=\"V\",\"O\",IF(L144=\"V\",\"O\",IF(M144=\"V\",\"O\",IF(LEFT(G144,1)=\"O\",\"O\",IF(LEFT(H144,1)=\"O\",\"O\",IF(I144=\"O\",\"O\",IF(J144=\"O\",\"O\",IF(K144=\"O\",\"O\",IF(L144=\"O\",\"O\",IF(M144=\"O\",\"O\",\"LEEG\")))))))))))))))","v":"O"}]
[null,null,"GADEKCD",null,null,"Volmacht dekkingscode","V:XD",null,null,null,null,null,null,"V"]
[null,null,"GADEKCO",null,null,"Volmacht dekkingscode, omschr.","V:XD",null,null,null,null,null,null,"V"]
[null,null,"GEBIED",null,"ADNDKG","Dekkingsgebied, code",null,null,null,null,null,null,null,"LEEG"]
[null,null,"GEZIN",null,"ADNLOG","Gezin J/N",null,null,null,null,null,null,null,"LEEG"]
[null,null,"GSS",null,"ADNGEZ","Verzekerde gezinssamenstelling, code",null,null,null,null,null,null,null,"LEEG"]
[null,null,"MVZRDUV",null,"ADNLOG","Mvz. verblijfsduur verlengen J/N",null,null,null,null,null,null,null,"LEEG"]
[null,null,"MVZVRBL",null,"ADNLOG","Mvz. schade aan logiesverblijven J/N",null,null,null,null,null,null,null,"LEEG"]
[null,null,"MYCODE",null,"ADNMCD","Dekkingscode maatschappij, code",null,"O:XD",null,null,null,null,null,"O"]
[null,null,"NJP",null,null,"Netto jaarpremie","O:XD",null,null,null,null,null,null,"O"]
[null,null,"PAFWST",null,null,"Percentage afw. op standaard tarief","O:XD",null,null,null,null,null,null,"O"]
[null,null,"PPRC",null,null,"Percentage prolongatieprovisie","O:XD",null,null,null,null,null,null,"O"]
[null,null,"PRCPKKT",null,null,"Percentage pakketkorting","O:XD",null,null,null,null,null,null,"O"]
[null,null,"PRCTEKC",null,null,"Percentage Volmachtbeloning","O:XD",null,null,null,null,null,null,"O"]
[null,null,"PREMBEL",null,null,"Bedrag premie belast",null,null,null,null,null,null,null,"LEEG"]
[null,null,"RELVRH",null,"ADNENT","Relatie verhouding tot, code","O:XD",null,null,null,null,null,null,"O"]
[null,null,"RELVVNR",null,null,"Relatie verhouding tot, volgnummer","O:XD",null,null,null,null,null,null,"O"]
[null,null,"RJRCOR",null,null,"Resterende jaren voor correctie","O:XD",null,null,null,null,null,null,"O"]
[null,null,"TCORBDR",null,null,"Toegepast correctiebedrag","O:XD",null,null,null,null,null,null,"O"]
[null,null,"VERZSOM",null,null,"Verzekerde som",null,"O:XD",null,null,null,null,null,"O"]
[null,null,"VGBRA",null,null,"Volmachtgever branchecode","O:XD",null,null,null,null,null,null,"O"]
[null,null,"VOLGNUM",null,null,"Volgnummer",null,null,null,null,null,null,null,"LEEG"]
[null,null,"VRWRKCD",null,null,"Verwerkingscode entiteit",null,null,null,null,null,null,null,"LEEG"]
[null,null,"WPREMBP",null,"ADNPBP","Wijze premieberekening prol., code","O:XD",null,null,null,null,null,null,"O"]
[null,null,"ZAKRMVZ",null,"ADNLOG","Mvz. zakenreis J/N",null,null,null,null,null,null,null,"LEEG"]
[null,null,"MP",null,null,"POOLAANDEEL","O",null,null,null,null,null,null,"O"]
[null,null,null,"MYAAND","PORMAA","POR Maatschappij aanduiding, code","O",null,null,null,null,null,null,"O"]
[null,null,null,"PLLEAD","ADNLOG","Poolleader J/N","O",null,null,null,null,null,null,"O"]
[null,null,null,"POOLNUM",null,"Poolnummer","V",null,null,null,null,null,null,"V"]
[null,null,null,"POOLPRC",null,"Percentage poolaandeel","V",null,null,null,null,null,null,"V"]
[null,"DW",null,null,null,"DEKKING ZAAKWAARNEMER",null,"O:XD",null,null,null,null,null,"O","maxOccurs 1"]
[null,null,"BAFWST",null,null,"Bedrag afwijk. op standaard tarief","O:XD",null,null,null,null,null,null,"O"]
[null,null,"BTP",null,null,"Termijnbedrag bruto premie",null,null,null,null,null,null,null,"LEEG"]
[null,null,"CODE",null,"ADNDEK","Dekkingscode","O:XD",null,null,null,null,null,null,"O"]
[null,null,"COLFACT",null,null,"Perc. collectiviteitfactor","O:XD_PRCCOLK",null,null,null,null,null,null,"O"]
[null,null,"ERB",null,null,"Bedrag eigen risico",null,"O:XD",null,null,null,null,null,"O"]
[null,null,"GADEKCD",null,null,"Volmacht dekkingscode","V:XD",null,null,null,null,null,null,"V"]
[null,null,"GADEKCO",null,null,"Volmacht dekkingscode, omschr.","V:XD",null,null,null,null,null,null,"V"]
[null,null,"MYCODE",null,"ADNMCD","Dekkingscode maatschappij, code",null,"O:XD",null,null,null,null,null,"O"]
[null,null,"NJP",null,null,"Netto jaarpremie","O:XD",null,null,null,null,null,null,"O"]
[null,null,"PAFWST",null,null,"Percentage afw. op standaard tarief","O:XD",null,null,null,null,null,null,"O"]
[null,null,"PPRC",null,null,"Percentage prolongatieprovisie","O:XD",null,null,null,null,null,null,"O"]
[null,null,"PRCPKKT",null,null,"Percentage pakketkorting","O:XD",null,null,null,null,null,null,"O"]
[null,null,"PRCTEKC",null,null,"Percentage Volmachtbeloning","O:XD",null,null,null,null,null,null,"O"]
[null,null,"RELVRH",null,"ADNENT","Relatie verhouding tot, code","O:XD",null,null,null,null,null,null,"O"]
[null,null,"RELVVNR",null,null,"Relatie verhouding tot, volgnummer","O:XD",null,null,null,null,null,null,"O"]
[null,null,"RJRCOR",null,null,"Resterende jaren voor correctie","O:XD",null,null,null,null,null,null,"O"]
[null,null,"TCORBDR",null,null,"Toegepast correctiebedrag","O:XD",null,null,null,null,null,null,"O"]
[null,null,"VERZSOM",null,null,"Verzekerde som",null,"O:XD",null,null,null,null,null,"O"]
[null,null,"VGBRA",null,null,"Volmachtgever branchecode","O:XD",null,null,null,null,null,null,"O"]
[null,null,"VOLGNUM",null,null,"Volgnummer",null,null,null,null,null,null,null,"LEEG"]
[null,null,"VRWRKCD",null,null,"Verwerkingscode entiteit",null,null,null,null,null,null,null,"LEEG"]
[null,null,"WPREMBP",null,"ADNPBP","Wijze premieberekening prol., code","O:XD",null,null,null,null,null,null,"O"]
[null,null,"MP",null,null,"POOLAANDEEL","O",null,null,null,null,null,null,"O"]
[null,null,null,"MYAAND","PORMAA","POR Maatschappij aanduiding, code","O",null,null,null,null,null,null,"O"]
[null,null,null,"PLLEAD","ADNLOG","Poolleader J/N","O",null,null,null,null,null,null,"O"]
[null,null,null,"POOLNUM",null,"Poolnummer","V",null,null,null,null,null,null,"V"]
[null,null,null,"POOLPRC",null,"Percentage poolaandeel","V",null,null,null,null,null,null,"V"]
[null,"GD",null,null,null,"DEKKING GELD",null,"O:XD",null,null,null,null,null,"O","maxOccurs 1"]
[null,null,"BAFWST",null,null,"Bedrag afwijk. op standaard tarief","O:XD",null,null,null,null,null,null,"O"]
[null,null,"BTP",null,null,"Termijnbedrag bruto premie",null,null,null,null,null,null,null,"LEEG"]
[null,null,"CODE",null,"ADNDEK","Dekkingscode","O:XD",null,null,null,null,null,null,"O"]
[null,null,"COLFACT",null,null,"Perc. collectiviteitfactor","O:XD_PRCCOLK",null,null,null,null,null,null,"O"]
[null,null,"ERB",null,null,"Bedrag eigen risico",null,"O:XD",null,null,null,null,null,"O"]
[null,null,"GADEKCD",null,null,"Volmacht dekkingscode","V:XD",null,null,null,null,null,null,{"$f":"IF(LEFT(G208,1)=\"X\",\"X\",IF(LEFT(G208,1)=\"V\",\"V\",IF(H208=\"V\",\"V\",IF(I208=\"V\",\"V\",IF(J208=\"V\",\"O\",IF(K208=\"V\",\"O\",IF(L208=\"V\",\"O\",IF(M208=\"V\",\"O\",IF(LEFT(G208,1)=\"O\",\"O\",IF(LEFT(H208,1)=\"O\",\"O\",IF(I208=\"O\",\"O\",IF(J208=\"O\",\"O\",IF(K208=\"O\",\"O\",IF(L208=\"O\",\"O\",IF(M208=\"O\",\"O\",\"LEEG\")))))))))))))))","v":"V"}]
[null,null,"GADEKCO",null,null,"Volmacht dekkingscode, omschr.","V:XD",null,null,null,null,null,null,"V"]
[null,null,"MYCODE",null,"ADNMCD","Dekkingscode maatschappij, code",null,"O:XD",null,null,null,null,null,"O"]
[null,null,"NJP",null,null,"Netto jaarpremie","O:XD",null,null,null,null,null,null,"O"]
[null,null,"PAFWST",null,null,"Percentage afw. op standaard tarief","O:XD",null,null,null,null,null,null,"O"]
[null,null,"PPRC",null,null,"Percentage prolongatieprovisie","O:XD",null,null,null,null,null,null,"O"]
[null,null,"PRCPKKT",null,null,"Percentage pakketkorting","O:XD",null,null,null,null,null,null,"O"]
[null,null,"PRCTEKC",null,null,"Percentage Volmachtbeloning","O:XD",null,null,null,null,null,null,"O"]
[null,null,"RELVRH",null,"ADNENT","Relatie verhouding tot, code","O:XD",null,null,null,null,null,null,"O"]
[null,null,"RELVVNR",null,null,"Relatie verhouding tot, volgnummer","O:XD",null,null,null,null,null,null,"O"]
[null,null,"RJRCOR",null,null,"Resterende jaren voor correctie","O:XD",null,null,null,null,null,null,"O"]
[null,null,"TCORBDR",null,null,"Toegepast correctiebedrag","O:XD",null,null,null,null,null,null,"O"]
[null,null,"VERZSOM",null,null,"Verzekerde som",null,"O:XD",null,null,null,null,null,"O"]
[null,null,"VGBRA",null,null,"Volmachtgever branchecode","O:XD",null,null,null,null,null,null,"O"]
[null,null,"VOLGNUM",null,null,"Volgnummer",null,null,null,null,null,null,null,"LEEG"]
[null,null,"VRWRKCD",null,null,"Verwerkingscode entiteit",null,null,null,null,null,null,null,"LEEG"]
[null,null,"WPREMBP",null,"ADNPBP","Wijze premieberekening prol., code","O:XD",null,null,null,null,null,null,"O"]
[null,null,"MP",null,null,"POOLAANDEEL","O",null,null,null,null,null,null,"O"]
[null,null,null,"MYAAND","PORMAA","POR Maatschappij aanduiding, code","O",null,null,null,null,null,null,"O"]
[null,null,null,"PLLEAD","ADNLOG","Poolleader J/N","O",null,null,null,null,null,null,"O"]
[null,null,null,"POOLNUM",null,"Poolnummer","V",null,null,null,null,null,null,"V"]
[null,null,null,"POOLPRC",null,"Percentage poolaandeel","V",null,null,null,null,null,null,"V"]
[null,"OD",null,null,null,"DEKKING ONGEVALLEN",null,"O:XD",null,null,null,null,null,"O","maxOccurs 1"]
[null,null,"BAFWST",null,null,"Bedrag afwijk. op standaard tarief","O:XD",null,null,null,null,null,null,"O"]
[null,null,"BTP",null,null,"Termijnbedrag bruto premie",null,null,null,null,null,null,null,"LEEG"]
[null,null,"CODE",null,"ADNDEK","Dekkingscode","O:XD",null,null,null,null,null,null,"O"]
[null,null,"COLFACT",null,null,"Perc. collectiviteitfactor","O:XD_PRCCOLK",null,null,null,null,null,null,"O"]
[null,null,"ERB",null,null,"Bedrag eigen risico",null,"O:XD",null,null,null,null,null,"O"]
[null,null,"GADEKCD",null,null,"Volmacht dekkingscode","V:XD",null,null,null,null,null,null,"V"]
[null,null,"GADEKCO",null,null,"Volmacht dekkingscode, omschr.","V:XD",null,null,null,null,null,null,"V"]
[null,null,"MYCODE",null,"ADNMCD","Dekkingscode maatschappij, code",null,"O:XD",null,null,null,null,null,"O"]
[null,null,"NJP",null,null,"Netto jaarpremie","O:XD",null,null,null,null,null,null,"O"]
[null,null,"PAFWST",null,null,"Percentage afw. op standaard tarief","O:XD",null,null,null,null,null,null,"O"]
[null,null,"PPRC",null,null,"Percentage prolongatieprovisie","O:XD",null,null,null,null,null,null,"O"]
[null,null,"PRCPKKT",null,null,"Percentage pakketkorting","O:XD",null,null,null,null,null,null,"O"]
[null,null,"PRCTEKC",null,null,"Percentage Volmachtbeloning","O:XD",null,null,null,null,null,null,"O"]
[null,null,"RELVRH",null,"ADNENT","Relatie verhouding tot, code","O:XD",null,null,null,null,null,null,"O"]
[null,null,"RELVVNR",null,null,"Relatie verhouding tot, volgnummer","O:XD",null,null,null,null,null,null,"O"]
[null,null,"RJRCOR",null,null,"Resterende jaren voor correctie","O:XD",null,null,null,null,null,null,"O"]
[null,null,"TCORBDR",null,null,"Toegepast correctiebedrag","O:XD",null,null,null,null,null,null,"O"]
[null,null,"VERZSOM",null,null,"Verzekerde som",null,"O:XD",null,null,null,null,null,"O"]
[null,null,"VGBRA",null,null,"Volmachtgever branchecode","O:XD",null,null,null,null,null,null,"O"]
[null,null,"VOLGNUM",null,null,"Volgnummer",null,null,null,null,null,null,null,"LEEG"]
[null,null,"VRWRKCD",null,null,"Verwerkingscode entiteit",null,null,null,null,null,null,null,"LEEG"]
[null,null,"WACHTTY",null,null,"Wachttijd in dagen",null,"O:XD",null,null,null,null,null,"O"]
[null,null,"WPREMBP",null,"ADNPBP","Wijze premieberekening prol., code","O:XD",null,null,null,null,null,null,"O"]
[null,null,"MP",null,null,"POOLAANDEEL","O",null,null,null,null,null,null,"O"]
[null,null,null,"MYAAND","PORMAA","POR Maatschappij aanduiding, code","O",null,null,null,null,null,null,"O"]
[null,null,null,"PLLEAD","ADNLOG","Poolleader J/N","O",null,null,null,null,null,null,"O"]
[null,null,null,"POOLNUM",null,"Poolnummer","V",null,null,null,null,null,null,"V"]
[null,null,null,"POOLPRC",null,"Percentage poolaandeel","V",null,null,null,null,null,null,"V"]
[null,"PH",null,null,null,"DEKKING (INTERNATIONALE) (PECH) HULP",null,"O:XD",null,null,null,null,null,"O","maxOccurs 1"]
[null,null,"BAFWST",null,null,"Bedrag afwijk. op standaard tarief","O:XD",null,null,null,null,null,null,"O"]
[null,null,"BTP",null,null,"Termijnbedrag bruto premie",null,null,null,null,null,null,null,"LEEG"]
[null,null,"CODE",null,"ADNDEK","Dekkingscode","O:XD",null,null,null,null,null,null,"O"]
[null,null,"COLFACT",null,null,"Perc. collectiviteitfactor","O:XD_PRCCOLK",null,null,null,null,null,null,"O"]
[null,null,"ERB",null,null,"Bedrag eigen risico",null,"O:XD",null,null,null,null,null,"O"]
[null,null,"GADEKCD",null,null,"Volmacht dekkingscode","V:XD",null,null,null,null,null,null,"V"]
[null,null,"GADEKCO",null,null,"Volmacht dekkingscode, omschr.","V:XD",null,null,null,null,null,null,"V"]
[null,null,"MYCODE",null,"ADNMCD","Dekkingscode maatschappij, code",null,"O:XD",null,null,null,null,null,"O"]
[null,null,"NJP",null,null,"Netto jaarpremie","O:XD",null,null,null,null,null,null,"O"]
[null,null,"PAFWST",null,null,"Percentage afw. op standaard tarief","O:XD",null,null,null,null,null,null,"O"]
[null,null,"PPRC",null,null,"Percentage prolongatieprovisie","O:XD",null,null,null,null,null,null,"O"]
[null,null,"PRCPKKT",null,null,"Percentage pakketkorting","O:XD",null,null,null,null,null,null,"O"]
[null,null,"PRCTEKC",null,null,"Percentage Volmachtbeloning","O:XD",null,null,null,null,null,null,{"$f":"IF(LEFT(G272,1)=\"X\",\"X\",IF(LEFT(G272,1)=\"V\",\"V\",IF(H272=\"V\",\"V\",IF(I272=\"V\",\"V\",IF(J272=\"V\",\"O\",IF(K272=\"V\",\"O\",IF(L272=\"V\",\"O\",IF(M272=\"V\",\"O\",IF(LEFT(G272,1)=\"O\",\"O\",IF(LEFT(H272,1)=\"O\",\"O\",IF(I272=\"O\",\"O\",IF(J272=\"O\",\"O\",IF(K272=\"O\",\"O\",IF(L272=\"O\",\"O\",IF(M272=\"O\",\"O\",\"LEEG\")))))))))))))))","v":"O"}]
[null,null,"RELVRH",null,"ADNENT","Relatie verhouding tot, code","O:XD",null,null,null,null,null,null,"O"]
[null,null,"RELVVNR",null,null,"Relatie verhouding tot, volgnummer","O:XD",null,null,null,null,null,null,"O"]
[null,null,"RJRCOR",null,null,"Resterende jaren voor correctie","O:XD",null,null,null,null,null,null,"O"]
[null,null,"TCORBDR",null,null,"Toegepast correctiebedrag","O:XD",null,null,null,null,null,null,"O"]
[null,null,"VERZSOM",null,null,"Verzekerde som",null,"O:XD",null,null,null,null,null,"O"]
[null,null,"VGBRA",null,null,"Volmachtgever branchecode","O:XD",null,null,null,null,null,null,"O"]
[null,null,"VOLGNUM",null,null,"Volgnummer",null,null,null,null,null,null,null,"LEEG"]
[null,null,"VRWRKCD",null,null,"Verwerkingscode entiteit",null,null,null,null,null,null,null,"LEEG"]
[null,null,"WPREMBP",null,"ADNPBP","Wijze premieberekening prol., code","O:XD",null,null,null,null,null,null,"O"]
[null,null,"MP",null,null,"POOLAANDEEL","O",null,null,null,null,null,null,"O"]
[null,null,null,"MYAAND","PORMAA","POR Maatschappij aanduiding, code","O",null,null,null,null,null,null,"O"]
[null,null,null,"PLLEAD","ADNLOG","Poolleader J/N","O",null,null,null,null,null,null,"O"]
[null,null,null,"POOLNUM",null,"Poolnummer","V",null,null,null,null,null,null,"V"]
[null,null,null,"POOLPRC",null,"Percentage poolaandeel","V",null,null,null,null,null,null,"V"]
[null,"RD",null,null,null,"DEKKING REIS UITBREIDING",null,"O:XD",null,null,null,null,null,"O","maxOccurs 1"]
[null,null,"BAFWST",null,null,"Bedrag afwijk. op standaard tarief","O:XD",null,null,null,null,null,null,"O"]
[null,null,"BTP",null,null,"Termijnbedrag bruto premie",null,null,null,null,null,null,null,"LEEG"]
[null,null,"CODE",null,"ADNDEK","Dekkingscode","O:XD",null,null,null,null,null,null,"O"]
[null,null,"COLFACT",null,null,"Perc. collectiviteitfactor","O:XD_PRCCOLK",null,null,null,null,null,null,"O"]
[null,null,"ERB",null,null,"Bedrag eigen risico",null,"O:XD",null,null,null,null,null,"O"]
[null,null,"GADEKCD",null,null,"Volmacht dekkingscode","V:XD",null,null,null,null,null,null,"V"]
[null,null,"GADEKCO",null,null,"Volmacht dekkingscode, omschr.","V:XD",null,null,null,null,null,null,"V"]
[null,null,"MYCODE",null,"ADNMCD","Dekkingscode maatschappij, code",null,"O:XD",null,null,null,null,null,"O"]
[null,null,"NJP",null,null,"Netto jaarpremie","O:XD",null,null,null,null,null,null,"O"]
[null,null,"PAFWST",null,null,"Percentage afw. op standaard tarief","O:XD",null,null,null,null,null,null,"O"]
[null,null,"PPRC",null,null,"Percentage prolongatieprovisie","O:XD",null,null,null,null,null,null,"O"]
[null,null,"PRCPKKT",null,null,"Percentage pakketkorting","O:XD",null,null,null,null,null,null,"O"]
[null,null,"PRCTEKC",null,null,"Percentage Volmachtbeloning","O:XD",null,null,null,null,null,null,"O"]
[null,null,"RELVRH",null,"ADNENT","Relatie verhouding tot, code","O:XD",null,null,null,null,null,null,"O"]
[null,null,"RELVVNR",null,null,"Relatie verhouding tot, volgnummer","O:XD",null,null,null,null,null,null,"O"]
[null,null,"RJRCOR",null,null,"Resterende jaren voor correctie","O:XD",null,null,null,null,null,null,"O"]
[null,null,"TCORBDR",null,null,"Toegepast correctiebedrag","O:XD",null,null,null,null,null,null,"O"]
[null,null,"VERZSOM",null,null,"Verzekerde som",null,"O:XD",null,null,null,null,null,"O"]
[null,null,"VGBRA",null,null,"Volmachtgever branchecode","O:XD",null,null,null,null,null,null,"O"]
[null,null,"VOLGNUM",null,null,"Volgnummer",null,null,null,null,null,null,null,"LEEG"]
[null,null,"VRWRKCD",null,null,"Verwerkingscode entiteit",null,null,null,null,null,null,null,"LEEG"]
[null,null,"WPREMBP",null,"ADNPBP","Wijze premieberekening prol., code","O:XD",null,null,null,null,null,null,"O"]
[null,null,"MP",null,null,"POOLAANDEEL","O",null,null,null,null,null,null,"O"]
[null,null,null,"MYAAND","PORMAA","POR Maatschappij aanduiding, code","O",null,null,null,null,null,null,"O"]
[null,null,null,"PLLEAD","ADNLOG","Poolleader J/N","O",null,null,null,null,null,null,"O"]
[null,null,null,"POOLNUM",null,"Poolnummer","V",null,null,null,null,null,null,"V"]
[null,null,null,"POOLPRC",null,"Percentage poolaandeel","V",null,null,null,null,null,null,"V"]
[null,"RP",null,null,null,"DEKKING RECHTSBIJSTAND",null,"O:XD",null,null,null,null,null,"O","maxOccurs 1"]
[null,null,"BAFWST",null,null,"Bedrag afwijk. op standaard tarief","O:XD",null,null,null,null,null,null,"O"]
[null,null,"BTP",null,null,"Termijnbedrag bruto premie",null,null,null,null,null,null,null,"LEEG"]
[null,null,"CODE",null,"ADNDEK","Dekkingscode","O:XD",null,null,null,null,null,null,"O"]
[null,null,"COLFACT",null,null,"Perc. collectiviteitfactor","O:XD_PRCCOLK",null,null,null,null,null,null,"O"]
[null,null,"ERB",null,null,"Bedrag eigen risico",null,"O:XD",null,null,null,null,null,"O"]
[null,null,"GADEKCD",null,null,"Volmacht dekkingscode","V:XD",null,null,null,null,null,null,"V"]
[null,null,"GADEKCO",null,null,"Volmacht dekkingscode, omschr.","V:XD",null,null,null,null,null,null,"V"]
[null,null,"MYCODE",null,"ADNMCD","Dekkingscode maatschappij, code",null,"O:XD",null,null,null,null,null,"O"]
[null,null,"NJP",null,null,"Netto jaarpremie","O:XD",null,null,null,null,null,null,"O"]
[null,null,"PAFWST",null,null,"Percentage afw. op standaard tarief","O:XD",null,null,null,null,null,null,"O"]
[null,null,"PPRC",null,null,"Percentage prolongatieprovisie","O:XD",null,null,null,null,null,null,"O"]
[null,null,"PRCPKKT",null,null,"Percentage pakketkorting","O:XD",null,null,null,null,null,null,"O"]
[null,null,"PRCTEKC",null,null,"Percentage Volmachtbeloning","O:XD",null,null,null,null,null,null,"O"]
[null,null,"RELVRH",null,"ADNENT","Relatie verhouding tot, code","O:XD",null,null,null,null,null,null,"O"]
[null,null,"RELVVNR",null,null,"Relatie verhouding tot, volgnummer","O:XD",null,null,null,null,null,null,"O"]
[null,null,"RJRCOR",null,null,"Resterende jaren voor correctie","O:XD",null,null,null,null,null,null,"O"]
[null,null,"TCORBDR",null,null,"Toegepast correctiebedrag","O:XD",null,null,null,null,null,null,"O"]
[null,null,"VERZSOM",null,null,"Verzekerde som",null,"O:XD",null,null,null,null,null,"O"]
[null,null,"VGBRA",null,null,"Volmachtgever branchecode","O:XD",null,null,null,null,null,null,"O"]
[null,null,"VOLGNUM",null,null,"Volgnummer",null,null,null,null,null,null,null,"LEEG"]
[null,null,"VRWRKCD",null,null,"Verwerkingscode entiteit",null,null,null,null,null,null,null,{"$f":"IF(LEFT(G336,1)=\"X\",\"X\",IF(LEFT(G336,1)=\"V\",\"V\",IF(H336=\"V\",\"V\",IF(I336=\"V\",\"V\",IF(J336=\"V\",\"O\",IF(K336=\"V\",\"O\",IF(L336=\"V\",\"O\",IF(M336=\"V\",\"O\",IF(LEFT(G336,1)=\"O\",\"O\",IF(LEFT(H336,1)=\"O\",\"O\",IF(I336=\"O\",\"O\",IF(J336=\"O\",\"O\",IF(K336=\"O\",\"O\",IF(L336=\"O\",\"O\",IF(M336=\"O\",\"O\",\"LEEG\")))))))))))))))","v":"LEEG"}]
[null,null,"WPREMBP",null,"ADNPBP","Wijze premieberekening prol., code","O:XD",null,null,null,null,null,null,"O"]
[null,null,"MP",null,null,"POOLAANDEEL","O",null,null,null,null,null,null,"O"]
[null,null,null,"MYAAND","PORMAA","POR Maatschappij aanduiding, code","O",null,null,null,null,null,null,"O"]
[null,null,null,"PLLEAD","ADNLOG","Poolleader J/N","O",null,null,null,null,null,null,"O"]
[null,null,null,"POOLNUM",null,"Poolnummer","V",null,null,null,null,null,null,"V"]
[null,null,null,"POOLPRC",null,"Percentage poolaandeel","V",null,null,null,null,null,null,"V"]
[null,"SB",null,null,null,"DEKKING BIJZONDERE SPORTEN",null,"O:XD",null,null,null,null,null,"O","maxOccurs 1"]
[null,null,"BAFWST",null,null,"Bedrag afwijk. op standaard tarief","O:XD",null,null,null,null,null,null,"O"]
[null,null,"BTP",null,null,"Termijnbedrag bruto premie",null,null,null,null,null,null,null,"LEEG"]
[null,null,"CODE",null,"ADNDEK","Dekkingscode","O:XD",null,null,null,null,null,null,"O"]
[null,null,"COLFACT",null,null,"Perc. collectiviteitfactor","O:XD_PRCCOLK",null,null,null,null,null,null,"O"]
[null,null,"ERB",null,null,"Bedrag eigen risico",null,"O:XD",null,null,null,null,null,"O"]
[null,null,"GADEKCD",null,null,"Volmacht dekkingscode","V:XD",null,null,null,null,null,null,"V"]
[null,null,"GADEKCO",null,null,"Volmacht dekkingscode, omschr.","V:XD",null,null,null,null,null,null,"V"]
[null,null,"MYCODE",null,"ADNMCD","Dekkingscode maatschappij, code",null,"O:XD",null,null,null,null,null,"O"]
[null,null,"NJP",null,null,"Netto jaarpremie","O:XD",null,null,null,null,null,null,"O"]
[null,null,"PAFWST",null,null,"Percentage afw. op standaard tarief","O:XD",null,null,null,null,null,null,"O"]
[null,null,"PPRC",null,null,"Percentage prolongatieprovisie","O:XD",null,null,null,null,null,null,"O"]
[null,null,"PRCPKKT",null,null,"Percentage pakketkorting","O:XD",null,null,null,null,null,null,"O"]
[null,null,"PRCTEKC",null,null,"Percentage Volmachtbeloning","O:XD",null,null,null,null,null,null,"O"]
[null,null,"RELVRH",null,"ADNENT","Relatie verhouding tot, code","O:XD",null,null,null,null,null,null,"O"]
[null,null,"RELVVNR",null,null,"Relatie verhouding tot, volgnummer","O:XD",null,null,null,null,null,null,"O"]
[null,null,"RJRCOR",null,null,"Resterende jaren voor correctie","O:XD",null,null,null,null,null,null,"O"]
[null,null,"TCORBDR",null,null,"Toegepast correctiebedrag","O:XD",null,null,null,null,null,null,"O"]
[null,null,"VERZSOM",null,null,"Verzekerde som",null,"O:XD",null,null,null,null,null,"O"]
[null,null,"VGBRA",null,null,"Volmachtgever branchecode","O:XD",null,null,null,null,null,null,"O"]
[null,null,"VOLGNUM",null,null,"Volgnummer",null,null,null,null,null,null,null,"LEEG"]
[null,null,"VRWRKCD",null,null,"Verwerkingscode entiteit",null,null,null,null,null,null,null,"LEEG"]
[null,null,"WPREMBP",null,"ADNPBP","Wijze premieberekening prol., code","O:XD",null,null,null,null,null,null,"O"]
[null,null,"MP",null,null,"POOLAANDEEL","O",null,null,null,null,null,null,"O"]
[null,null,null,"MYAAND","PORMAA","POR Maatschappij aanduiding, code","O",null,null,null,null,null,null,"O"]
[null,null,null,"PLLEAD","ADNLOG","Poolleader J/N","O",null,null,null,null,null,null,"O"]
[null,null,null,"POOLNUM",null,"Poolnummer","V",null,null,null,null,null,null,"V"]
[null,null,null,"POOLPRC",null,"Percentage poolaandeel","V",null,null,null,null,null,null,"V"]
[null,"SG",null,null,null,"DEKKING SAMENGESTELDE REIS",null,"O:XD",null,null,null,null,null,"O","maxOccurs 1"]
[null,null,"BAFWST",null,null,"Bedrag afwijk. op standaard tarief","O:XD",null,null,null,null,null,null,"O"]
[null,null,"BTP",null,null,"Termijnbedrag bruto premie",null,null,null,null,null,null,null,"LEEG"]
[null,null,"CODE",null,"ADNDEK","Dekkingscode","O:XD",null,null,null,null,null,null,"O"]
[null,null,"COLFACT",null,null,"Perc. collectiviteitfactor","O:XD_PRCCOLK",null,null,null,null,null,null,"O"]
[null,null,"ERB",null,null,"Bedrag eigen risico",null,"O:XD",null,null,null,null,null,"O"]
[null,null,"GADEKCD",null,null,"Volmacht dekkingscode","V:XD",null,null,null,null,null,null,"V"]
[null,null,"GADEKCO",null,null,"Volmacht dekkingscode, omschr.","V:XD",null,null,null,null,null,null,"V"]
[null,null,"MYCODE",null,"ADNMCD","Dekkingscode maatschappij, code",null,"O:XD",null,null,null,null,null,"O"]
[null,null,"NJP",null,null,"Netto jaarpremie","O:XD",null,null,null,null,null,null,"O"]
[null,null,"PAFWST",null,null,"Percentage afw. op standaard tarief","O:XD",null,null,null,null,null,null,"O"]
[null,null,"PPRC",null,null,"Percentage prolongatieprovisie","O:XD",null,null,null,null,null,null,"O"]
[null,null,"PRCPKKT",null,null,"Percentage pakketkorting","O:XD",null,null,null,null,null,null,"O"]
[null,null,"PRCTEKC",null,null,"Percentage Volmachtbeloning","O:XD",null,null,null,null,null,null,"O"]
[null,null,"RELVRH",null,"ADNENT","Relatie verhouding tot, code","O:XD",null,null,null,null,null,null,"O"]
[null,null,"RELVVNR",null,null,"Relatie verhouding tot, volgnummer","O:XD",null,null,null,null,null,null,"O"]
[null,null,"RJRCOR",null,null,"Resterende jaren voor correctie","O:XD",null,null,null,null,null,null,"O"]
[null,null,"TCORBDR",null,null,"Toegepast correctiebedrag","O:XD",null,null,null,null,null,null,"O"]
[null,null,"VERZSOM",null,null,"Verzekerde som",null,"O:XD",null,null,null,null,null,"O"]
[null,null,"VGBRA",null,null,"Volmachtgever branchecode","O:XD",null,null,null,null,null,null,"O"]
[null,null,"VOLGNUM",null,null,"Volgnummer",null,null,null,null,null,null,null,"LEEG"]
[null,null,"VRWRKCD",null,null,"Verwerkingscode entiteit",null,null,null,null,null,null,null,"LEEG"]
[null,null,"WPREMBP",null,"ADNPBP","Wijze premieberekening prol., code","O:XD",null,null,null,null,null,null,"O"]
[null,null,"MP",null,null,"POOLAANDEEL","O",null,null,null,null,null,null,"O"]
[null,null,null,"MYAAND","PORMAA","POR Maatschappij aanduiding, code","O",null,null,null,null,null,null,"O"]
[null,null,null,"PLLEAD","ADNLOG","Poolleader J/N","O",null,null,null,null,null,null,"O"]
[null,null,null,"POOLNUM",null,"Poolnummer","V",null,null,null,null,null,null,"V"]
[null,null,null,"POOLPRC",null,"Percentage poolaandeel","V",null,null,null,null,null,null,"V"]
[null,"SU",null,null,null,"DEKKING SPORTUITRUSTING",null,"O:XD",null,null,null,null,null,"O","maxOccurs 1"]
[null,null,"BAFWST",null,null,"Bedrag afwijk. op standaard tarief","O:XD",null,null,null,null,null,null,{"$f":"IF(LEFT(G400,1)=\"X\",\"X\",IF(LEFT(G400,1)=\"V\",\"V\",IF(H400=\"V\",\"V\",IF(I400=\"V\",\"V\",IF(J400=\"V\",\"O\",IF(K400=\"V\",\"O\",IF(L400=\"V\",\"O\",IF(M400=\"V\",\"O\",IF(LEFT(G400,1)=\"O\",\"O\",IF(LEFT(H400,1)=\"O\",\"O\",IF(I400=\"O\",\"O\",IF(J400=\"O\",\"O\",IF(K400=\"O\",\"O\",IF(L400=\"O\",\"O\",IF(M400=\"O\",\"O\",\"LEEG\")))))))))))))))","v":"O"}]
[null,null,"BTP",null,null,"Termijnbedrag bruto premie",null,null,null,null,null,null,null,"LEEG"]
[null,null,"CODE",null,"ADNDEK","Dekkingscode","O:XD",null,null,null,null,null,null,"O"]
[null,null,"COLFACT",null,null,"Perc. collectiviteitfactor","O:XD_PRCCOLK",null,null,null,null,null,null,"O"]
[null,null,"ERB",null,null,"Bedrag eigen risico",null,"O:XD",null,null,null,null,null,"O"]
[null,null,"GADEKCD",null,null,"Volmacht dekkingscode","V:XD",null,null,null,null,null,null,"V"]
[null,null,"GADEKCO",null,null,"Volmacht dekkingscode, omschr.","V:XD",null,null,null,null,null,null,"V"]
[null,null,"MYCODE",null,"ADNMCD","Dekkingscode maatschappij, code",null,"O:XD",null,null,null,null,null,"O"]
[null,null,"NJP",null,null,"Netto jaarpremie","O:XD",null,null,null,null,null,null,"O"]
[null,null,"PAFWST",null,null,"Percentage afw. op standaard tarief","O:XD",null,null,null,null,null,null,"O"]
[null,null,"PPRC",null,null,"Percentage prolongatieprovisie","O:XD",null,null,null,null,null,null,"O"]
[null,null,"PRCPKKT",null,null,"Percentage pakketkorting","O:XD",null,null,null,null,null,null,"O"]
[null,null,"PRCTEKC",null,null,"Percentage Volmachtbeloning","O:XD",null,null,null,null,null,null,"O"]
[null,null,"RELVRH",null,"ADNENT","Relatie verhouding tot, code","O:XD",null,null,null,null,null,null,"O"]
[null,null,"RELVVNR",null,null,"Relatie verhouding tot, volgnummer","O:XD",null,null,null,null,null,null,"O"]
[null,null,"RJRCOR",null,null,"Resterende jaren voor correctie","O:XD",null,null,null,null,null,null,"O"]
[null,null,"TCORBDR",null,null,"Toegepast correctiebedrag","O:XD",null,null,null,null,null,null,"O"]
[null,null,"VERZSOM",null,null,"Verzekerde som",null,"O:XD",null,null,null,null,null,"O"]
[null,null,"VGBRA",null,null,"Volmachtgever branchecode","O:XD",null,null,null,null,null,null,"O"]
[null,null,"VOLGNUM",null,null,"Volgnummer",null,null,null,null,null,null,null,"LEEG"]
[null,null,"VRWRKCD",null,null,"Verwerkingscode entiteit",null,null,null,null,null,null,null,"LEEG"]
[null,null,"WPREMBP",null,"ADNPBP","Wijze premieberekening prol., code","O:XD",null,null,null,null,null,null,"O"]
[null,null,"MP",null,null,"POOLAANDEEL","O",null,null,null,null,null,null,"O"]
[null,null,null,"MYAAND","PORMAA","POR Maatschappij aanduiding, code","O",null,null,null,null,null,null,"O"]
[null,null,null,"PLLEAD","ADNLOG","Poolleader J/N","O",null,null,null,null,null,null,"O"]
[null,null,null,"POOLNUM",null,"Poolnummer","V",null,null,null,null,null,null,"V"]
[null,null,null,"POOLPRC",null,"Percentage poolaandeel","V",null,null,null,null,null,null,"V"]
[null,"WS",null,null,null,"DEKKING WINTERSPORTEN",null,"O:XD",null,null,null,null,null,"O","maxOccurs 1"]
[null,null,"AANTPRS",null,null,"Verz. aantal personen",null,null,null,null,null,null,null,"LEEG"]
[null,null,"BAFWST",null,null,"Bedrag afwijk. op standaard tarief","O:XD",null,null,null,null,null,null,"O"]
[null,null,"BTP",null,null,"Termijnbedrag bruto premie",null,null,null,null,null,null,null,"LEEG"]
[null,null,"CODE",null,"ADNDEK","Dekkingscode","O:XD",null,null,null,null,null,null,"O"]
[null,null,"COLFACT",null,null,"Perc. collectiviteitfactor","O:XD_PRCCOLK",null,null,null,null,null,null,"O"]
[null,null,"ERB",null,null,"Bedrag eigen risico",null,"O:XD",null,null,null,null,null,"O"]
[null,null,"GADEKCD",null,null,"Volmacht dekkingscode","V:XD",null,null,null,null,null,null,"V"]
[null,null,"GADEKCO",null,null,"Volmacht dekkingscode, omschr.","V:XD",null,null,null,null,null,null,"V"]
[null,null,"GEZIN",null,"ADNLOG","Gezin J/N",null,null,null,null,null,null,null,"LEEG"]
[null,null,"GSS",null,"ADNGEZ","Verzekerde gezinssamenstelling, code",null,null,null,null,null,null,null,"LEEG"]
[null,null,"MYCODE",null,"ADNMCD","Dekkingscode maatschappij, code",null,"O:XD",null,null,null,null,null,"O"]
[null,null,"NJP",null,null,"Netto jaarpremie","O:XD",null,null,null,null,null,null,"O"]
[null,null,"PAFWST",null,null,"Percentage afw. op standaard tarief","O:XD",null,null,null,null,null,null,"O"]
[null,null,"PPRC",null,null,"Percentage prolongatieprovisie","O:XD",null,null,null,null,null,null,"O"]
[null,null,"PRCPKKT",null,null,"Percentage pakketkorting","O:XD",null,null,null,null,null,null,"O"]
[null,null,"PRCTEKC",null,null,"Percentage Volmachtbeloning","O:XD",null,null,null,null,null,null,"O"]
[null,null,"PREMBEL",null,null,"Bedrag premie belast",null,null,null,null,null,null,null,"LEEG"]
[null,null,"RELVRH",null,"ADNENT","Relatie verhouding tot, code","O:XD",null,null,null,null,null,null,"O"]
[null,null,"RELVVNR",null,null,"Relatie verhouding tot, volgnummer","O:XD",null,null,null,null,null,null,"O"]
[null,null,"RJRCOR",null,null,"Resterende jaren voor correctie","O:XD",null,null,null,null,null,null,"O"]
[null,null,"TCORBDR",null,null,"Toegepast correctiebedrag","O:XD",null,null,null,null,null,null,"O"]
[null,null,"VERZSOM",null,null,"Verzekerde som",null,"O:XD",null,null,null,null,null,"O"]
[null,null,"VGBRA",null,null,"Volmachtgever branchecode","O:XD",null,null,null,null,null,null,"O"]
[null,null,"VOLGNUM",null,null,"Volgnummer",null,null,null,null,null,null,null,"LEEG"]
[null,null,"VRWRKCD",null,null,"Verwerkingscode entiteit",null,null,null,null,null,null,null,"LEEG"]
[null,null,"WPREMBP",null,"ADNPBP","Wijze premieberekening prol., code","O:XD",null,null,null,null,null,null,"O"]
[null,null,"MP",null,null,"POOLAANDEEL","O",null,null,null,null,null,null,"O"]
[null,null,null,"MYAAND","PORMAA","POR Maatschappij aanduiding, code","O",null,null,null,null,null,null,"O"]
[null,null,null,"PLLEAD","ADNLOG","Poolleader J/N","O",null,null,null,null,null,null,"O"]
[null,null,null,"POOLNUM",null,"Poolnummer","V",null,null,null,null,null,null,"V"]
[null,null,null,"POOLPRC",null,"Percentage poolaandeel","V",null,null,null,null,null,null,"V"]
[null,"ZK",null,null,null,"DEKKING ZIEKTEKOSTEN",null,"O:XD",null,null,null,null,null,"O","maxOccurs 1"]
[null,null,"BAFWST",null,null,"Bedrag afwijk. op standaard tarief","O:XD",null,null,null,null,null,null,"O"]
[null,null,"BTP",null,null,"Termijnbedrag bruto premie",null,null,null,null,null,null,null,"LEEG"]
[null,null,"CODE",null,"ADNDEK","Dekkingscode","O:XD",null,null,null,null,null,null,"O"]
[null,null,"COLFACT",null,null,"Perc. collectiviteitfactor","O:XD_PRCCOLK",null,null,null,null,null,null,"O"]
[null,null,"ERB",null,null,"Bedrag eigen risico",null,"O:XD",null,null,null,null,null,{"$f":"IF(LEFT(G464,1)=\"X\",\"X\",IF(LEFT(G464,1)=\"V\",\"V\",IF(H464=\"V\",\"V\",IF(I464=\"V\",\"V\",IF(J464=\"V\",\"O\",IF(K464=\"V\",\"O\",IF(L464=\"V\",\"O\",IF(M464=\"V\",\"O\",IF(LEFT(G464,1)=\"O\",\"O\",IF(LEFT(H464,1)=\"O\",\"O\",IF(I464=\"O\",\"O\",IF(J464=\"O\",\"O\",IF(K464=\"O\",\"O\",IF(L464=\"O\",\"O\",IF(M464=\"O\",\"O\",\"LEEG\")))))))))))))))","v":"O"}]
[null,null,"GADEKCD",null,null,"Volmacht dekkingscode","V:XD",null,null,null,null,null,null,"V"]
[null,null,"GADEKCO",null,null,"Volmacht dekkingscode, omschr.","V:XD",null,null,null,null,null,null,"V"]
[null,null,"MYCODE",null,"ADNMCD","Dekkingscode maatschappij, code",null,"O:XD",null,null,null,null,null,"O"]
[null,null,"NJP",null,null,"Netto jaarpremie","O:XD",null,null,null,null,null,null,"O"]
[null,null,"PAFWST",null,null,"Percentage afw. op standaard tarief","O:XD",null,null,null,null,null,null,"O"]
[null,null,"PPRC",null,null,"Percentage prolongatieprovisie","O:XD",null,null,null,null,null,null,"O"]
[null,null,"PRCPKKT",null,null,"Percentage pakketkorting","O:XD",null,null,null,null,null,null,"O"]
[null,null,"PRCTEKC",null,null,"Percentage Volmachtbeloning","O:XD",null,null,null,null,null,null,"O"]
[null,null,"RELVRH",null,"ADNENT","Relatie verhouding tot, code","O:XD",null,null,null,null,null,null,"O"]
[null,null,"RELVVNR",null,null,"Relatie verhouding tot, volgnummer","O:XD",null,null,null,null,null,null,"O"]
[null,null,"RJRCOR",null,null,"Resterende jaren voor correctie","O:XD",null,null,null,null,null,null,"O"]
[null,null,"TCORBDR",null,null,"Toegepast correctiebedrag","O:XD",null,null,null,null,null,null,"O"]
[null,null,"VERZSOM",null,null,"Verzekerde som",null,"O:XD",null,null,null,null,null,"O"]
[null,null,"VGBRA",null,null,"Volmachtgever branchecode","O:XD",null,null,null,null,null,null,"O"]
[null,null,"VOLGNUM",null,null,"Volgnummer",null,null,null,null,null,null,null,"LEEG"]
[null,null,"VRWRKCD",null,null,"Verwerkingscode entiteit",null,null,null,null,null,null,null,"LEEG"]
[null,null,"WPREMBP",null,"ADNPBP","Wijze premieberekening prol., code","O:XD",null,null,null,null,null,null,"O"]
[null,null,"MP",null,null,"POOLAANDEEL","O",null,null,null,null,null,null,"O"]
[null,null,null,"MYAAND","PORMAA","POR Maatschappij aanduiding, code","O",null,null,null,null,null,null,"O"]
[null,null,null,"PLLEAD","ADNLOG","Poolleader J/N","O",null,null,null,null,null,null,"O"]
[null,null,null,"POOLNUM",null,"Poolnummer","V",null,null,null,null,null,null,"V"]
[null,null,null,"POOLPRC",null,"Percentage poolaandeel","V",null,null,null,null,null,null,"V"]
[null,"VW",null,null,null,"VOORWAARDEN",null,null,null,null,null,null,null,"LEEG","maxOccurs 1"]
[null,null,"VOLGNUM",null,null,"Volgnummer",null,null,null,null,null,null,null,"LEEG"]
[null,null,"VRWNR",null,null,"Voorwaarde nummer",null,null,null,null,null,null,null,"LEEG"]
[null,null,"VRWOM",null,null,"Voorwaardentekst",null,null,null,null,null,null,null,"LEEG"]
[null,null,"VRWRKCD",null,null,"Verwerkingscode entiteit",null,null,null,null,null,null,null,"LEEG"]
[null,null,"VRWVERS",null,null,"Voorwaarde versie",null,null,null,null,null,null,null,"LEEG"]
[null,"CL",null,null,null,"CLAUSULE",null,null,null,null,null,null,null,"LEEG","maxOccurs 1"]
[null,null,"CLAUSNR",null,null,"Clausule nummers",null,null,null,null,null,null,null,"LEEG"]
[null,null,"CLAUSOM",null,null,"Clausuletekst",null,null,null,null,null,null,null,"LEEG"]
[null,null,"CLAUTXT",null,null,"Clausule tekst",null,null,null,null,null,null,null,"LEEG"]
[null,null,"VERSIEC",null,null,"Clausule versienummer",null,null,null,null,null,null,null,"LEEG"]
[null,null,"VOLGNUM",null,null,"Volgnummer",null,null,null,null,null,null,null,"LEEG"]
[null,null,"VRWRKCD",null,"ADNVRC","Verwerkingscode entiteit",null,null,null,null,null,null,null,"LEEG"]
[null,"TP",null,null,"","PARTIJ TUSSENPERSOON","O",null,null,null,null,null,null,"O","maxOccurs 1"]
[null,null,"AFMVRGN",null,"","AFM vergunningnummer","O",null,null,null,null,null,null,"O"]
[null,null,"IDNR",null,"","Identificatienummer","O",null,null,null,null,null,null,"O"]
[null,"VE",null,null,"","PARTIJ VOLMACHTNEMER","V",null,null,null,null,null,null,"V","maxOccurs 1"]
[null,null,"ANAAM",null,"","Naam","V",null,null,null,null,null,null,"V"]
[null,null,"IDNR",null,"","Identificatie nummer","O",null,null,null,null,null,null,"O"]
[null,null,"MYAAND",null,"PORMAA","POR Maatschappij aanduiding, code","O",null,null,null,null,null,null,"O"]
[null,null,"TELNUM",null,"","Telefoonnummer","V",null,null,null,null,null,null,"V"]
[null,null,"TWEEDED",null,"","Tweede deel naam","O",null,null,null,null,null,null,"O"]
[null,null,"VOLGNUM",null,null,"Volgnummer",null,null,null,null,null,null,null,"LEEG"]
[null,null,"VRWRKCD",null,"ADNVRC","Verwerkingscode entiteit",null,null,null,null,null,null,null,"LEEG"]
[null,"VL",null,null,"","PARTIJ VOLMACHTGEVER","V",null,null,null,null,null,null,"V","maxOccurs 1"]
[null,null,"ANAAM",null,"","Naam","V",null,null,null,null,null,null,"V"]
[null,null,"EMAIL",null,"","E-mail adres","O",null,null,null,null,null,null,"O"]
[null,null,"MYAAND",null,"PORMAA","POR Maatschappij aanduiding, code","V",null,null,null,null,null,null,"V"]
[null,null,"TELNUM",null,"","Telefoonnummer","O",null,null,null,null,null,null,"O"]
[null,null,"TWEEDED",null,"","Tweede deel naam","O",null,null,null,null,null,null,"O"]
[null,null,"VEIDNR",null,null,"Volmachtnemer identificatie","O",null,null,null,null,null,null,"O"]
[null,null,"VOLGNUM",null,null,"Volgnummer",null,null,null,null,null,null,null,"LEEG"]
[null,null,"VRWRKCD",null,"ADNVRC","Verwerkingscode entiteit",null,null,null,null,null,null,null,"LEEG"]
[null,"VP",null,null,"","PARTIJ VERZEKERINGNEMER","V",null,null,null,null,null,null,"V","maxOccurs 1"]
[null,null,"ANAAM",null,null,"Naam",null,null,null,null,null,null,null,"LEEG"]
[null,null,"GEBDAT",null,"ADNGES","Geboortedatum","O",null,null,null,null,null,null,"O"]
[null,null,"GESLACH",null,null,"Geslacht/rechtspersoon, code","O",null,null,null,null,null,null,"O"]
[null,null,"HUISNR",null,null,"Huisnummer",null,null,null,null,null,null,null,"LEEG"]
[null,null,"LAND",null,"ISOLAN","Land, code",null,null,null,null,null,null,null,"LEEG"]
[null,null,"PARZAKC",null,"ADNSRL","Particulier of zakelijk, code","V",null,null,null,null,null,null,"V"]
[null,null,"PCODE",null,null,"Postcode","V",null,null,null,null,null,null,"V"]
[null,null,"PLAATS",null,null,"Plaats",null,null,null,null,null,null,null,{"$f":"IF(LEFT(G528,1)=\"X\",\"X\",IF(LEFT(G528,1)=\"V\",\"V\",IF(H528=\"V\",\"V\",IF(I528=\"V\",\"V\",IF(J528=\"V\",\"O\",IF(K528=\"V\",\"O\",IF(L528=\"V\",\"O\",IF(M528=\"V\",\"O\",IF(LEFT(G528,1)=\"O\",\"O\",IF(LEFT(H528,1)=\"O\",\"O\",IF(I528=\"O\",\"O\",IF(J528=\"O\",\"O\",IF(K528=\"O\",\"O\",IF(L528=\"O\",\"O\",IF(M528=\"O\",\"O\",\"LEEG\")))))))))))))))","v":"LEEG"}]
[null,null,"STRAAT",null,null,"Straat",null,null,null,null,null,null,null,"LEEG"]
[null,null,"TOEVOEG",null,null,"Huisnummertoevoeging",null,null,null,null,null,null,null,"LEEG"]
[null,null,"VOLGNUM",null,null,"Volgnummer",null,null,null,null,null,null,null,"LEEG"]
[null,null,"VOORL",null,null,"Voorletters",null,null,null,null,null,null,null,"LEEG"]
[null,null,"VOORV",null,null,"Voorvoegsels",null,null,null,null,null,null,null,"LEEG"]
[null,null,"VRWRKCD",null,"ADNVRC","Verwerkingscode entiteit",null,null,null,null,null,null,null,"LEEG"]
[null,"VZ",null,null,"","VERZEKERD PERSOON",null,"O",null,null,null,null,null,"O"]
[null,null,"GESLACH",null,"ADNGES","Geslacht/rechtspersoon, code",null,"O",null,null,null,null,null,"O"]
[null,null,"GEBDAT",null,null,"Geboortedatum",null,"O",null,null,null,null,null,"O"]
["XG",null,null,null,null,"TRANSACTIE PROCES",null,null,null,null,null,null,null,"LEEG"]
[null,"STATUS",null,null,"ADNSTS","Status, code",null,null,null,null,null,null,null,"LEEG"]
[null,"STATUST",null,null,null,"Toelichting status",null,null,null,null,null,null,null,"LEEG"]
[null,"VRWRKCD",null,null,"ADNVRC","Verwerkingscode entiteit",null,null,null,null,null,null,null,"LEEG"]
[null,"XM",null,null,null,"OMSCHRIJVING STATUS",null,null,null,null,null,null,null,"LEEG","maxOccurs 1"]
[null,null,"STATTXT",null,null,"Status, tekst",null,null,null,null,null,null,null,"LEEG"]
[null,null,"VOLGNUM",null,null,"Volgnummer",null,null,null,null,null,null,null,"LEEG"]
[null,null,"VRWRKCD",null,"ADNVRC","Verwerkingscode entiteit",null,null,null,null,null,null,null,"LEEG"]

{"sheet":" Verbandscontrole","index":2,"n_rows":28,"n_cols":7,"rows_kept":28,"cut":false,"hidden":false,"merged":[[14,6,15,6],[18,6,19,6],[22,6,23,6],[26,2,27,2],[26,5,27,5],[26,6,27,6],[18,2,19,2],[22,2,23,2],[14,2,15,2],[18,5,19,5],[14,5,15,5],[22,5,23,5]]}
["Inventarisatie noodzakelijke attributen "]
["Verzekeraar:",{"$f":"Schema!C2","v":0}]
["Branche:",{"$f":"Schema!C3","v":0}]
["POR maatschappij aanduiding:",{"$f":"Schema!C4","v":0}]
["AFD Definitie naam:",{"$f":"Schema!C5","v":0}]
["AFD Definitie versie nummer:",{"$f":"Schema!C6","v":0}]
["Commerciele productnaam:",{"$f":"Schema!C7","v":0}]
["Bronnen:",{"$f":"Schema!C8","v":0}]
["Contactpersoon:",{"$f":"Schema!C9","v":0}]
["E-mail / Telefoon:",{"$f":"Schema!C10","v":0}]
["Datum:",{"$f":"Schema!C12","v":"16-11-2021"}]
[]
[]
["Conditie","Voorbeeld verbandscontrole",null,"Conditie","Voorbeeld Pseudo-code ","Voorbeeld foutmelding","Bron"]
["If","Dekkingscode is 2002","Aanroep Acceptatie\nAanroep Premieberekening\nKunnen aanleveren","If","CA_CODE = 2002","Bij dekking Casco moet het bedrag oorspronkelijek cataloguswaarde groter zijn dan '0'. ","Rekenbox"]
["Then","moet bedrag oorspronkelijke cataloguswaarde groter zijn dan '0'",null,"Then","OB_VWACA > 0"]
[]
["Conditie","Verbandscontrole 1",null,"Conditie","XPath Verbandscontrole 1","Foutmelding","Bron"]
["If","<Vul hier de conditie waaraan voldaan moet worden> ","Aanroep Acceptatie\nAanroep Premieberekening\nKunnen aanleveren","If","<Vul hier de pseudocode in waaraan voldaan moet worden>","<Vermeld hier welke foutmelding de volmacht krijgt bij een onjuiste validatie> "]
["Then","<Vul hier de validatie die moet worden uitgevoerd als de conditie waar is>",null,"Then","<Vul hier de pseudocode in die bij validatie uitgevoerd moet worden>"]
[]
["Conditie","Verbandscontrole 2",null,"Conditie","XPath Verbandscontrole 2","Foutmelding","Bron"]
["If","<Vul hier de conditie waaraan voldaan moet worden> ","Aanroep Acceptatie\nAanroep Premieberekening\nKunnen aanleveren","If","<Vul hier de pseudocode in waaraan voldaan moet worden>","<Vermeld hier welke foutmelding de volmacht krijgt bij een onjuiste validatie> "]
["Then","<Vul hier de validatie die moet worden uitgevoerd als de conditie waar is>",null,"Then","<Vul hier de pseudocode in waaraan voldaan moet worden>"]
[]
["Conditie","Verbandscontrole 3",null,"Conditie","XPath Verbandscontrole 3","Foutmelding","Bron"]
["If","<Vul hier de conditie waaraan voldaan moet worden> ","Aanroep Acceptatie\nAanroep Premieberekening\nKunnen aanleveren","If","<Vul hier de pseudocode in waaraan voldaan moet worden>","<Vermeld hier welke foutmelding de volmacht krijgt bij een onjuiste validatie> "]
["Then","<Vul hier de validatie die moet worden uitgevoerd als de conditie waar is>",null,"Then","<Vul hier de pseudocode in waaraan voldaan moet worden>"]

{"sheet":"Openstaande punten","index":3,"n_rows":9,"n_cols":3,"rows_kept":9,"cut":false,"hidden":false,"merged":[]}
[]
[null,"Openstaande punten"]
[null,1,"Controleer tab \"Schema\" (zie instructies)"]
[null,2,"Controleer tab \"Verbandscontrole\" (zie instructies)"]
[null,3]
[null,4]
[null,5]
[null,6]
[null,7]

{"sheet":"Updates","index":4,"n_rows":2,"n_cols":4,"rows_kept":2,"cut":false,"hidden":false,"merged":[]}
[]
[null,"Versie","Datum","Omschrijving aanpassing"]

{"sheet":"CSVoutput","index":5,"n_rows":541,"n_cols":15,"rows_kept":541,"cut":false,"hidden":true,"merged":[]}
["Entiteit/Attribuut","Entiteit","I1","I2","I3","Pad1","Pad2","Pad3","Pad","Attribuut",{"$f":"Schema!I14","v":"premieBerekening_aanroep"},{"$f":"Schema!J14","v":"premieBerekening_resultaat"},{"$f":"Schema!K14","v":"Acceptatie_aanroep"},{"$f":"Schema!L14","v":"Acceptatie_resultaat"},{"$f":"Schema!N14","v":"kunnenAanleveren"}]
[{"$f":"Schema!A15&Schema!B15&Schema!C15&Schema!D15","v":"AL"},{"$f":"IF(LEN(A2)=2,A2,IF(A2=\"\",\"Leeg\",B1))","v":"AL"},{"$f":"IF(A2=\"\",\"\",IF(LEN(Schema!A15)=2,1,IF(LEN(Schema!B15)=2,10,IF(LEN(Schema!C15)=2,100,0))))","v":1},{"$f":"IF(C2=0,D1,C2)","v":1},{"$f":"IF(A2=\"\",\"\",SUM(Tabel2[[#This Row],[I1]:[I2]]))","v":2},{"$f":"IF(A2=\"\",\"\",IF(C2=1,B2,F1))","v":"AL"},{"$f":"IF(C2=10,A2,IF(OR(C2=0,C2=100),G1,\"\"))","v":""},{"$f":"IF(E2=200,B2,IF(C2=0,H1,\"\"))","v":""},{"$f":"IF(C2=\"\",\"\",IF(OR(E2=1,E2=10,E2=100),I1,IF(E2=2,F2,IF(E2=20,F2&\"/\"&G2,IF(E2=200,F2&\"/\"&G2&\"/\"&H2)))))","v":"AL"},{"$f":"IF(C2=\"\",\"\",IF(LEN(Tabel2[[#This Row],[Entiteit of attribuut]])=2,\"\",Tabel2[[#This Row],[Entiteit]]&\"_\"&Tabel2[[#This Row],[Entiteit of attribuut]]))","v":""},{"$f":"IF(Schema!I15=\"\",\"\",Schema!I15)","v":""},{"$f":"IF(Schema!J15=\"\",\"\",Schema!J15)","v":""},{"$f":"IF(Schema!K15=\"\",\"\",Schema!K15)","v":""},{"$f":"IF(Schema!L15=\"\",\"\",Schema!L15)","v":""},{"$f":"IF(Schema!N15=\"\",\"\",Schema!N15)","v":"V"}]
[{"$f":"Schema!A16&Schema!B16&Schema!C16&Schema!D16","v":"ADATMSG"},{"$f":"IF(LEN(A3)=2,A3,IF(A3=\"\",\"Leeg\",B2))","v":"AL"},{"$f":"IF(A3=\"\",\"\",IF(LEN(Schema!A16)=2,1,IF(LEN(Schema!B16)=2,10,IF(LEN(Schema!C16)=2,100,0))))","v":0},{"$f":"IF(C3=0,D2,C3)","v":1},{"$f":"IF(A3=\"\",\"\",SUM(Tabel2[[#This Row],[I1]:[I2]]))","v":1},{"$f":"IF(A3=\"\",\"\",IF(C3=1,B3,F2))","v":"AL"},{"$f":"IF(C3=10,A3,IF(OR(C3=0,C3=100),G2,\"\"))","v":""},{"$f":"IF(E3=200,B3,IF(C3=0,H2,\"\"))","v":""},{"$f":"IF(C3=\"\",\"\",IF(OR(E3=1,E3=10,E3=100),I2,IF(E3=2,F3,IF(E3=20,F3&\"/\"&G3,IF(E3=200,F3&\"/\"&G3&\"/\"&H3)))))","v":"AL"},{"$f":"IF(C3=\"\",\"\",IF(LEN(Tabel2[[#This Row],[Entiteit of attribuut]])=2,\"\",Tabel2[[#This Row],[Entiteit]]&\"_\"&Tabel2[[#This Row],[Entiteit of attribuut]]))","v":"AL_ADATMSG"},{"$f":"IF(Schema!I16=\"\",\"\",Schema!I16)","v":""},{"$f":"IF(Schema!J16=\"\",\"\",Schema!J16)","v":""},{"$f":"IF(Schema!K16=\"\",\"\",Schema!K16)","v":""},{"$f":"IF(Schema!L16=\"\",\"\",Schema!L16)","v":""},{"$f":"IF(Schema!N16=\"\",\"\",Schema!N16)","v":"V"}]
[{"$f":"Schema!#REF!&Schema!#REF!&Schema!#REF!&Schema!#REF!","v":{"$error":"#REF!"}},{"$error":"#REF!"},{"$f":"IF(A4=\"\",\"\",IF(LEN(Schema!#REF!)=2,1,IF(LEN(Schema!#REF!)=2,10,IF(LEN(Schema!#REF!)=2,100,0))))","v":{"$error":"#REF!"}},{"$error":"#REF!"},{"$f":"IF(A4=\"\",\"\",SUM(Tabel2[[#This Row],[I1]:[I2]]))","v":{"$error":"#REF!"}},{"$error":"#REF!"},{"$error":"#REF!"},{"$error":"#REF!"},{"$error":"#REF!"},{"$f":"IF(C4=\"\",\"\",IF(LEN(Tabel2[[#This Row],[Entiteit of attribuut]])=2,\"\",Tabel2[[#This Row],[Entiteit]]&\"_\"&Tabel2[[#This Row],[Entiteit of attribuut]]))","v":{"$error":"#REF!"}},{"$f":"IF(Schema!#REF!=\"\",\"\",Schema!#REF!)","v":{"$error":"#REF!"}},{"$f":"IF(Schema!#REF!=\"\",\"\",Schema!#REF!)","v":{"$error":"#REF!"}},{"$f":"IF(Schema!#REF!=\"\",\"\",Schema!#REF!)","v":{"$error":"#REF!"}},{"$f":"IF(Schema!#REF!=\"\",\"\",Schema!#REF!)","v":{"$error":"#REF!"}},{"$f":"IF(Schema!#REF!=\"\",\"\",Schema!#REF!)","v":{"$error":"#REF!"}}]
[{"$f":"Schema!A17&Schema!B17&Schema!C17&Schema!D17","v":"APPCODE"},{"$error":"#REF!"},{"$f":"IF(A5=\"\",\"\",IF(LEN(Schema!A17)=2,1,IF(LEN(Schema!B17)=2,10,IF(LEN(Schema!C17)=2,100,0))))","v":0},{"$error":"#REF!"},{"$f":"IF(A5=\"\",\"\",SUM(Tabel2[[#This Row],[I1]:[I2]]))","v":{"$error":"#REF!"}},{"$error":"#REF!"},{"$error":"#REF!"},{"$error":"#REF!"},{"$error":"#REF!"},{"$f":"IF(C5=\"\",\"\",IF(LEN(Tabel2[[#This Row],[Entiteit of attribuut]])=2,\"\",Tabel2[[#This Row],[Entiteit]]&\"_\"&Tabel2[[#This Row],[Entiteit of attribuut]]))","v":{"$error":"#REF!"}},{"$f":"IF(Schema!I17=\"\",\"\",Schema!I17)","v":""},{"$f":"IF(Schema!J17=\"\",\"\",Schema!J17)","v":""},{"$f":"IF(Schema!K17=\"\",\"\",Schema!K17)","v":""},{"$f":"IF(Schema!L17=\"\",\"\",Schema!L17)","v":""},{"$f":"IF(Schema!N17=\"\",\"\",Schema!N17)","v":"LEEG"}]
[{"$f":"Schema!A18&Schema!B18&Schema!C18&Schema!D18","v":"APPLNM"},{"$error":"#REF!"},{"$f":"IF(A6=\"\",\"\",IF(LEN(Schema!A18)=2,1,IF(LEN(Schema!B18)=2,10,IF(LEN(Schema!C18)=2,100,0))))","v":0},{"$error":"#REF!"},{"$f":"IF(A6=\"\",\"\",SUM(Tabel2[[#This Row],[I1]:[I2]]))","v":{"$error":"#REF!"}},{"$error":"#REF!"},{"$error":"#REF!"},{"$error":"#REF!"},{"$error":"#REF!"},{"$f":"IF(C6=\"\",\"\",IF(LEN(Tabel2[[#This Row],[Entiteit of attribuut]])=2,\"\",Tabel2[[#This Row],[Entiteit]]&\"_\"&Tabel2[[#This Row],[Entiteit of attribuut]]))","v":{"$error":"#REF!"}},{"$f":"IF(Schema!I18=\"\",\"\",Schema!I18)","v":""},{"$f":"IF(Schema!J18=\"\",\"\",Schema!J18)","v":""},{"$f":"IF(Schema!K18=\"\",\"\",Schema!K18)","v":""},{"$f":"IF(Schema!L18=\"\",\"\",Schema!L18)","v":""},{"$f":"IF(Schema!N18=\"\",\"\",Schema!N18)","v":"O"}]
[{"$f":"Schema!#REF!&Schema!#REF!&Schema!#REF!&Schema!#REF!","v":{"$error":"#REF!"}},{"$error":"#REF!"},{"$f":"IF(A7=\"\",\"\",IF(LEN(Schema!#REF!)=2,1,IF(LEN(Schema!#REF!)=2,10,IF(LEN(Schema!#REF!)=2,100,0))))","v":{"$error":"#REF!"}},{"$error":"#REF!"},{"$f":"IF(A7=\"\",\"\",SUM(Tabel2[[#This Row],[I1]:[I2]]))","v":{"$error":"#REF!"}},{"$error":"#REF!"},{"$error":"#REF!"},{"$error":"#REF!"},{"$error":"#REF!"},{"$f":"IF(C7=\"\",\"\",IF(LEN(Tabel2[[#This Row],[Entiteit of attribuut]])=2,\"\",Tabel2[[#This Row],[Entiteit]]&\"_\"&Tabel2[[#This Row],[Entiteit of attribuut]]))","v":{"$error":"#REF!"}},{"$f":"IF(Schema!#REF!=\"\",\"\",Schema!#REF!)","v":{"$error":"#REF!"}},{"$f":"IF(Schema!#REF!=\"\",\"\",Schema!#REF!)","v":{"$error":"#REF!"}},{"$f":"IF(Schema!#REF!=\"\",\"\",Schema!#REF!)","v":{"$error":"#REF!"}},{"$f":"IF(Schema!#REF!=\"\",\"\",Schema!#REF!)","v":{"$error":"#REF!"}},{"$f":"IF(Schema!#REF!=\"\",\"\",Schema!#REF!)","v":{"$error":"#REF!"}}]
[{"$f":"Schema!A19&Schema!B19&Schema!C19&Schema!D19","v":"APPLVS"},{"$error":"#REF!"},{"$f":"IF(A8=\"\",\"\",IF(LEN(Schema!A19)=2,1,IF(LEN(Schema!B19)=2,10,IF(LEN(Schema!C19)=2,100,0))))","v":0},{"$error":"#REF!"},{"$f":"IF(A8=\"\",\"\",SUM(Tabel2[[#This Row],[I1]:[I2]]))","v":{"$error":"#REF!"}},{"$error":"#REF!"},{"$error":"#REF!"},{"$error":"#REF!"},{"$error":"#REF!"},{"$f":"IF(C8=\"\",\"\",IF(LEN(Tabel2[[#This Row],[Entiteit of attribuut]])=2,\"\",Tabel2[[#This Row],[Entiteit]]&\"_\"&Tabel2[[#This Row],[Entiteit of attribuut]]))","v":{"$error":"#REF!"}},{"$f":"IF(Schema!I19=\"\",\"\",Schema!I19)","v":""},{"$f":"IF(Schema!J19=\"\",\"\",Schema!J19)","v":""},{"$f":"IF(Schema!K19=\"\",\"\",Schema!K19)","v":""},{"$f":"IF(Schema!L19=\"\",\"\",Schema!L19)","v":""},{"$f":"IF(Schema!N19=\"\",\"\",Schema!N19)","v":"O"}]
[{"$f":"Schema!#REF!&Schema!#REF!&Schema!#REF!&Schema!#REF!","v":{"$error":"#REF!"}},{"$error":"#REF!"},{"$f":"IF(A9=\"\",\"\",IF(LEN(Schema!#REF!)=2,1,IF(LEN(Schema!#REF!)=2,10,IF(LEN(Schema!#REF!)=2,100,0))))","v":{"$error":"#REF!"}},{"$error":"#REF!"},{"$f":"IF(A9=\"\",\"\",SUM(Tabel2[[#This Row],[I1]:[I2]]))","v":{"$error":"#REF!"}},{"$error":"#REF!"},{"$error":"#REF!"},{"$error":"#REF!"},{"$error":"#REF!"},{"$f":"IF(C9=\"\",\"\",IF(LEN(Tabel2[[#This Row],[Entiteit of attribuut]])=2,\"\",Tabel2[[#This Row],[Entiteit]]&\"_\"&Tabel2[[#This Row],[Entiteit of attribuut]]))","v":{"$error":"#REF!"}},{"$f":"IF(Schema!#REF!=\"\",\"\",Schema!#REF!)","v":{"$error":"#REF!"}},{"$f":"IF(Schema!#REF!=\"\",\"\",Schema!#REF!)","v":{"$error":"#REF!"}},{"$f":"IF(Schema!#REF!=\"\",\"\",Schema!#REF!)","v":{"$error":"#REF!"}},{"$f":"IF(Schema!#REF!=\"\",\"\",Schema!#REF!)","v":{"$error":"#REF!"}},{"$f":"IF(Schema!#REF!=\"\",\"\",Schema!#REF!)","v":{"$error":"#REF!"}}]
[{"$f":"Schema!A20&Schema!B20&Schema!C20&Schema!D20","v":"APPUSER"},{"$error":"#REF!"},{"$f":"IF(A10=\"\",\"\",IF(LEN(Schema!A20)=2,1,IF(LEN(Schema!B20)=2,10,IF(LEN(Schema!C20)=2,100,0))))","v":0},{"$error":"#REF!"},{"$f":"IF(A10=\"\",\"\",SUM(Tabel2[[#This Row],[I1]:[I2]]))","v":{"$error":"#REF!"}},{"$error":"#REF!"},{"$error":"#REF!"},{"$error":"#REF!"},{"$error":"#REF!"},{"$f":"IF(C10=\"\",\"\",IF(LEN(Tabel2[[#This Row],[Entiteit of attribuut]])=2,\"\",Tabel2[[#This Row],[Entiteit]]&\"_\"&Tabel2[[#This Row],[Entiteit of attribuut]]))","v":{"$error":"#REF!"}},{"$f":"IF(Schema!I20=\"\",\"\",Schema!I20)","v":""},{"$f":"IF(Schema!J20=\"\",\"\",Schema!J20)","v":""},{"$f":"IF(Schema!K20=\"\",\"\",Schema!K20)","v":""},{"$f":"IF(Schema!L20=\"\",\"\",Schema!L20)","v":""},{"$f":"IF(Schema!N20=\"\",\"\",Schema!N20)","v":"LEEG"}]
[{"$f":"Schema!A21&Schema!B21&Schema!C21&Schema!D21","v":"BRONNM"},{"$error":"#REF!"},{"$f":"IF(A11=\"\",\"\",IF(LEN(Schema!A21)=2,1,IF(LEN(Schema!B21)=2,10,IF(LEN(Schema!C21)=2,100,0))))","v":0},{"$error":"#REF!"},{"$f":"IF(A11=\"\",\"\",SUM(Tabel2[[#This Row],[I1]:[I2]]))","v":{"$error":"#REF!"}},{"$error":"#REF!"},{"$error":"#REF!"},{"$error":"#REF!"},{"$error":"#REF!"},{"$f":"IF(C11=\"\",\"\",IF(LEN(Tabel2[[#This Row],[Entiteit of attribuut]])=2,\"\",Tabel2[[#This Row],[Entiteit]]&\"_\"&Tabel2[[#This Row],[Entiteit of attribuut]]))","v":{"$error":"#REF!"}},{"$f":"IF(Schema!I21=\"\",\"\",Schema!I21)","v":""},{"$f":"IF(Schema!J21=\"\",\"\",Schema!J21)","v":""},{"$f":"IF(Schema!K21=\"\",\"\",Schema!K21)","v":""},{"$f":"IF(Schema!L21=\"\",\"\",Schema!L21)","v":""},{"$f":"IF(Schema!N21=\"\",\"\",Schema!N21)","v":"LEEG"}]
[{"$f":"Schema!B503&Schema!C503&Schema!#REF!&Schema!D503","v":{"$error":"#REF!"}},{"$error":"#REF!"},{"$f":"IF(A12=\"\",\"\",IF(LEN(Schema!B503)=2,1,IF(LEN(Schema!C503)=2,10,IF(LEN(Schema!#REF!)=2,100,0))))","v":{"$error":"#REF!"}},{"$error":"#REF!"},{"$f":"IF(A12=\"\",\"\",SUM(Tabel2[[#This Row],[I1]:[I2]]))","v":{"$error":"#REF!"}},{"$error":"#REF!"},{"$error":"#REF!"},{"$error":"#REF!"},{"$error":"#REF!"},{"$f":"IF(C12=\"\",\"\",IF(LEN(Tabel2[[#This Row],[Entiteit of attribuut]])=2,\"\",Tabel2[[#This Row],[Entiteit]]&\"_\"&Tabel2[[#This Row],[Entiteit of attribuut]]))","v":{"$error":"#REF!"}},{"$f":"IF(Schema!I503=\"\",\"\",Schema!I503)","v":""},{"$f":"IF(Schema!J503=\"\",\"\",Schema!J503)","v":""},{"$f":"IF(Schema!K503=\"\",\"\",Schema!K503)","v":""},{"$f":"IF(Schema!L503=\"\",\"\",Schema!L503)","v":""},{"$f":"IF(Schema!N503=\"\",\"\",Schema!N503)","v":"V"}]
[{"$f":"Schema!#REF!&Schema!#REF!&Schema!#REF!&Schema!#REF!","v":{"$error":"#REF!"}},{"$error":"#REF!"},{"$f":"IF(A13=\"\",\"\",IF(LEN(Schema!#REF!)=2,1,IF(LEN(Schema!#REF!)=2,10,IF(LEN(Schema!#REF!)=2,100,0))))","v":{"$error":"#REF!"}},{"$error":"#REF!"},{"$f":"IF(A13=\"\",\"\",SUM(Tabel2[[#This Row],[I1]:[I2]]))","v":{"$error":"#REF!"}},{"$error":"#REF!"},{"$error":"#REF!"},{"$error":"#REF!"},{"$error":"#REF!"},{"$f":"IF(C13=\"\",\"\",IF(LEN(Tabel2[[#This Row],[Entiteit of attribuut]])=2,\"\",Tabel2[[#This Row],[Entiteit]]&\"_\"&Tabel2[[#This Row],[Entiteit of attribuut]]))","v":{"$error":"#REF!"}},{"$f":"IF(Schema!#REF!=\"\",\"\",Schema!#REF!)","v":{"$error":"#REF!"}},{"$f":"IF(Schema!#REF!=\"\",\"\",Schema!#REF!)","v":{"$error":"#REF!"}},{"$f":"IF(Schema!#REF!=\"\",\"\",Schema!#REF!)","v":{"$error":"#REF!"}},{"$f":"IF(Schema!#REF!=\"\",\"\",Schema!#REF!)","v":{"$error":"#REF!"}},{"$f":"IF(Schema!#REF!=\"\",\"\",Schema!#REF!)","v":{"$error":"#REF!"}}]
[{"$f":"Schema!B504&Schema!C504&Schema!#REF!&Schema!D504","v":{"$error":"#REF!"}},{"$error":"#REF!"},{"$f":"IF(A14=\"\",\"\",IF(LEN(Schema!B504)=2,1,IF(LEN(Schema!C504)=2,10,IF(LEN(Schema!#REF!)=2,100,0))))","v":{"$error":"#REF!"}},{"$error":"#REF!"},{"$f":"IF(A14=\"\",\"\",SUM(Tabel2[[#This Row],[I1]:[I2]]))","v":{"$error":"#REF!"}},{"$error":"#REF!"},{"$error":"#REF!"},{"$error":"#REF!"},{"$error":"#REF!"},{"$f":"IF(C14=\"\",\"\",IF(LEN(Tabel2[[#This Row],[Entiteit of attribuut]])=2,\"\",Tabel2[[#This Row],[Entiteit]]&\"_\"&Tabel2[[#This Row],[Entiteit of attribuut]]))","v":{"$error":"#REF!"}},{"$f":"IF(Schema!I504=\"\",\"\",Schema!I504)","v":""},{"$f":"IF(Schema!J504=\"\",\"\",Schema!J504)","v":""},{"$f":"IF(Schema!K504=\"\",\"\",Schema!K504)","v":""},{"$f":"IF(Schema!L504=\"\",\"\",Schema!L504)","v":""},{"$f":"IF(Schema!N504=\"\",\"\",Schema!N504)","v":"V"}]
[{"$f":"Schema!B505&Schema!C505&Schema!#REF!&Schema!D505","v":{"$error":"#REF!"}},{"$error":"#REF!"},{"$f":"IF(A15=\"\",\"\",IF(LEN(Schema!B505)=2,1,IF(LEN(Schema!C505)=2,10,IF(LEN(Schema!#REF!)=2,100,0))))","v":{"$error":"#REF!"}},{"$error":"#REF!"},{"$f":"IF(A15=\"\",\"\",SUM(Tabel2[[#This Row],[I1]:[I2]]))","v":{"$error":"#REF!"}},{"$error":"#REF!"},{"$error":"#REF!"},{"$error":"#REF!"},{"$error":"#REF!"},{"$f":"IF(C15=\"\",\"\",IF(LEN(Tabel2[[#This Row],[Entiteit of attribuut]])=2,\"\",Tabel2[[#This Row],[Entiteit]]&\"_\"&Tabel2[[#This Row],[Entiteit of attribuut]]))","v":{"$error":"#REF!"}},{"$f":"IF(Schema!I505=\"\",\"\",Schema!I505)","v":""},{"$f":"IF(Schema!J505=\"\",\"\",Schema!J505)","v":""},{"$f":"IF(Schema!K505=\"\",\"\",Schema!K505)","v":""},{"$f":"IF(Schema!L505=\"\",\"\",Schema!L505)","v":""},{"$f":"IF(Schema!N505=\"\",\"\",Schema!N505)","v":"O"}]
[{"$f":"Schema!B506&Schema!C506&Schema!#REF!&Schema!D506","v":{"$error":"#REF!"}},{"$error":"#REF!"},{"$f":"IF(A16=\"\",\"\",IF(LEN(Schema!B506)=2,1,IF(LEN(Schema!C506)=2,10,IF(LEN(Schema!#REF!)=2,100,0))))","v":{"$error":"#REF!"}},{"$error":"#REF!"},{"$f":"IF(A16=\"\",\"\",SUM(Tabel2[[#This Row],[I1]:[I2]]))","v":{"$error":"#REF!"}},{"$error":"#REF!"},{"$error":"#REF!"},{"$error":"#REF!"},{"$error":"#REF!"},{"$f":"IF(C16=\"\",\"\",IF(LEN(Tabel2[[#This Row],[Entiteit of attribuut]])=2,\"\",Tabel2[[#This Row],[Entiteit]]&\"_\"&Tabel2[[#This Row],[Entiteit of attribuut]]))","v":{"$error":"#REF!"}},{"$f":"IF(Schema!I506=\"\",\"\",Schema!I506)","v":""},{"$f":"IF(Schema!J506=\"\",\"\",Schema!J506)","v":""},{"$f":"IF(Schema!K506=\"\",\"\",Schema!K506)","v":""},{"$f":"IF(Schema!L506=\"\",\"\",Schema!L506)","v":""},{"$f":"IF(Schema!N506=\"\",\"\",Schema!N506)","v":"O"}]
[{"$f":"Schema!B507&Schema!C507&Schema!#REF!&Schema!D507","v":{"$error":"#REF!"}},{"$error":"#REF!"},{"$f":"IF(A17=\"\",\"\",IF(LEN(Schema!B507)=2,1,IF(LEN(Schema!C507)=2,10,IF(LEN(Schema!#REF!)=2,100,0))))","v":{"$error":"#REF!"}},{"$error":"#REF!"},{"$f":"IF(A17=\"\",\"\",SUM(Tabel2[[#This Row],[I1]:[I2]]))","v":{"$error":"#REF!"}},{"$error":"#REF!"},{"$error":"#REF!"},{"$error":"#REF!"},{"$error":"#REF!"},{"$f":"IF(C17=\"\",\"\",IF(LEN(Tabel2[[#This Row],[Entiteit of attribuut]])=2,\"\",Tabel2[[#This Row],[Entiteit]]&\"_\"&Tabel2[[#This Row],[Entiteit of attribuut]]))","v":{"$error":"#REF!"}},{"$f":"IF(Schema!I507=\"\",\"\",Schema!I507)","v":""},{"$f":"IF(Schema!J507=\"\",\"\",Schema!J507)","v":""},{"$f":"IF(Schema!K507=\"\",\"\",Schema!K507)","v":""},{"$f":"IF(Schema!L507=\"\",\"\",Schema!L507)","v":""},{"$f":"IF(Schema!N507=\"\",\"\",Schema!N507)","v":"V"}]
[{"$f":"Schema!B508&Schema!C508&Schema!#REF!&Schema!D508","v":{"$error":"#REF!"}},{"$error":"#REF!"},{"$f":"IF(A18=\"\",\"\",IF(LEN(Schema!B508)=2,1,IF(LEN(Schema!C508)=2,10,IF(LEN(Schema!#REF!)=2,100,0))))","v":{"$error":"#REF!"}},{"$error":"#REF!"},{"$f":"IF(A18=\"\",\"\",SUM(Tabel2[[#This Row],[I1]:[I2]]))","v":{"$error":"#REF!"}},{"$error":"#REF!"},{"$error":"#REF!"},{"$error":"#REF!"},{"$error":"#REF!"},{"$f":"IF(C18=\"\",\"\",IF(LEN(Tabel2[[#This Row],[Entiteit of attribuut]])=2,\"\",Tabel2[[#This Row],[Entiteit]]&\"_\"&Tabel2[[#This Row],[Entiteit of attribuut]]))","v":{"$error":"#REF!"}},{"$f":"IF(Schema!I508=\"\",\"\",Schema!I508)","v":""},{"$f":"IF(Schema!J508=\"\",\"\",Schema!J508)","v":""},{"$f":"IF(Schema!K508=\"\",\"\",Schema!K508)","v":""},{"$f":"IF(Schema!L508=\"\",\"\",Schema!L508)","v":""},{"$f":"IF(Schema!N508=\"\",\"\",Schema!N508)","v":"O"}]
[{"$f":"Schema!B511&Schema!C511&Schema!#REF!&Schema!D511","v":{"$error":"#REF!"}},{"$error":"#REF!"},{"$f":"IF(A19=\"\",\"\",IF(LEN(Schema!B511)=2,1,IF(LEN(Schema!C511)=2,10,IF(LEN(Schema!#REF!)=2,100,0))))","v":{"$error":"#REF!"}},{"$error":"#REF!"},{"$f":"IF(A19=\"\",\"\",SUM(Tabel2[[#This Row],[I1]:[I2]]))","v":{"$error":"#REF!"}},{"$error":"#REF!"},{"$error":"#REF!"},{"$error":"#REF!"},{"$error":"#REF!"},{"$f":"IF(C19=\"\",\"\",IF(LEN(Tabel2[[#This Row],[Entiteit of attribuut]])=2,\"\",Tabel2[[#This Row],[Entiteit]]&\"_\"&Tabel2[[#This Row],[Entiteit of attribuut]]))","v":{"$error":"#REF!"}},{"$f":"IF(Schema!I511=\"\",\"\",Schema!I511)","v":""},{"$f":"IF(Schema!J511=\"\",\"\",Schema!J511)","v":""},{"$f":"IF(Schema!K511=\"\",\"\",Schema!K511)","v":""},{"$f":"IF(Schema!L511=\"\",\"\",Schema!L511)","v":""},{"$f":"IF(Schema!N511=\"\",\"\",Schema!N511)","v":"V"}]
[{"$f":"Schema!B512&Schema!C512&Schema!#REF!&Schema!D512","v":{"$error":"#REF!"}},{"$error":"#REF!"},{"$f":"IF(A20=\"\",\"\",IF(LEN(Schema!B512)=2,1,IF(LEN(Schema!C512)=2,10,IF(LEN(Schema!#REF!)=2,100,0))))","v":{"$error":"#REF!"}},{"$error":"#REF!"},{"$f":"IF(A20=\"\",\"\",SUM(Tabel2[[#This Row],[I1]:[I2]]))","v":{"$error":"#REF!"}},{"$error":"#REF!"},{"$error":"#REF!"},{"$error":"#REF!"},{"$error":"#REF!"},{"$f":"IF(C20=\"\",\"\",IF(LEN(Tabel2[[#This Row],[Entiteit of attribuut]])=2,\"\",Tabel2[[#This Row],[Entiteit]]&\"_\"&Tabel2[[#This Row],[Entiteit of attribuut]]))","v":{"$error":"#REF!"}},{"$f":"IF(Schema!I512=\"\",\"\",Schema!I512)","v":""},{"$f":"IF(Schema!J512=\"\",\"\",Schema!J512)","v":""},{"$f":"IF(Schema!K512=\"\",\"\",Schema!K512)","v":""},{"$f":"IF(Schema!L512=\"\",\"\",Schema!L512)","v":""},{"$f":"IF(Schema!N512=\"\",\"\",Schema!N512)","v":"V"}]
[{"$f":"Schema!B513&Schema!C513&Schema!#REF!&Schema!D513","v":{"$error":"#REF!"}},{"$error":"#REF!"},{"$f":"IF(A21=\"\",\"\",IF(LEN(Schema!B513)=2,1,IF(LEN(Schema!C513)=2,10,IF(LEN(Schema!#REF!)=2,100,0))))","v":{"$error":"#REF!"}},{"$error":"#REF!"},{"$f":"IF(A21=\"\",\"\",SUM(Tabel2[[#This Row],[I1]:[I2]]))","v":{"$error":"#REF!"}},{"$error":"#REF!"},{"$error":"#REF!"},{"$error":"#REF!"},{"$error":"#REF!"},{"$f":"IF(C21=\"\",\"\",IF(LEN(Tabel2[[#This Row],[Entiteit of attribuut]])=2,\"\",Tabel2[[#This Row],[Entiteit]]&\"_\"&Tabel2[[#This Row],[Entiteit of attribuut]]))","v":{"$error":"#REF!"}},{"$f":"IF(Schema!I513=\"\",\"\",Schema!I513)","v":""},{"$f":"IF(Schema!J513=\"\",\"\",Schema!J513)","v":""},{"$f":"IF(Schema!K513=\"\",\"\",Schema!K513)","v":""},{"$f":"IF(Schema!L513=\"\",\"\",Schema!L513)","v":""},{"$f":"IF(Schema!N513=\"\",\"\",Schema!N513)","v":"O"}]
[{"$f":"Schema!#REF!&Schema!#REF!&Schema!#REF!&Schema!#REF!","v":{"$error":"#REF!"}},{"$error":"#REF!"},{"$f":"IF(A22=\"\",\"\",IF(LEN(Schema!#REF!)=2,1,IF(LEN(Schema!#REF!)=2,10,IF(LEN(Schema!#REF!)=2,100,0))))","v":{"$error":"#REF!"}},{"$error":"#REF!"},{"$f":"IF(A22=\"\",\"\",SUM(Tabel2[[#This Row],[I1]:[I2]]))","v":{"$error":"#REF!"}},{"$error":"#REF!"},{"$error":"#REF!"},{"$error":"#REF!"},{"$error":"#REF!"},{"$f":"IF(C22=\"\",\"\",IF(LEN(Tabel2[[#This Row],[Entiteit of attribuut]])=2,\"\",Tabel2[[#This Row],[Entiteit]]&\"_\"&Tabel2[[#This Row],[Entiteit of attribuut]]))","v":{"$error":"#REF!"}},{"$f":"IF(Schema!#REF!=\"\",\"\",Schema!#REF!)","v":{"$error":"#REF!"}},{"$f":"IF(Schema!#REF!=\"\",\"\",Schema!#REF!)","v":{"$error":"#REF!"}},{"$f":"IF(Schema!#REF!=\"\",\"\",Schema!#REF!)","v":{"$error":"#REF!"}},{"$f":"IF(Schema!#REF!=\"\",\"\",Schema!#REF!)","v":{"$error":"#REF!"}},{"$f":"IF(Schema!#REF!=\"\",\"\",Schema!#REF!)","v":{"$error":"#REF!"}}]
[{"$f":"Schema!A37&Schema!B37&Schema!C37&Schema!D37","v":"PP"},"PP",{"$f":"IF(A23=\"\",\"\",IF(LEN(Schema!A37)=2,1,IF(LEN(Schema!B37)=2,10,IF(LEN(Schema!C37)=2,100,0))))","v":1},1,{"$f":"IF(A23=\"\",\"\",SUM(Tabel2[[#This Row],[I1]:[I2]]))","v":2},"PP","","","PP",{"$f":"IF(C23=\"\",\"\",IF(LEN(Tabel2[[#This Row],[Entiteit of attribuut]])=2,\"\",Tabel2[[#This Row],[Entiteit]]&\"_\"&Tabel2[[#This Row],[Entiteit of attribuut]]))","v":""},{"$f":"IF(Schema!I37=\"\",\"\",Schema!I37)","v":""},{"$f":"IF(Schema!J37=\"\",\"\",Schema!J37)","v":""},{"$f":"IF(Schema!K37=\"\",\"\",Schema!K37)","v":""},{"$f":"IF(Schema!L37=\"\",\"\",Schema!L37)","v":""},{"$f":"IF(Schema!N37=\"\",\"\",Schema!N37)","v":"V"}]
[{"$f":"Schema!B514&Schema!C514&Schema!#REF!&Schema!D514","v":{"$error":"#REF!"}},{"$error":"#REF!"},{"$f":"IF(A24=\"\",\"\",IF(LEN(Schema!B514)=2,1,IF(LEN(Schema!C514)=2,10,IF(LEN(Schema!#REF!)=2,100,0))))","v":{"$error":"#REF!"}},{"$error":"#REF!"},{"$f":"IF(A24=\"\",\"\",SUM(Tabel2[[#This Row],[I1]:[I2]]))","v":{"$error":"#REF!"}},{"$error":"#REF!"},{"$error":"#REF!"},{"$error":"#REF!"},{"$error":"#REF!"},{"$f":"IF(C24=\"\",\"\",IF(LEN(Tabel2[[#This Row],[Entiteit of attribuut]])=2,\"\",Tabel2[[#This Row],[Entiteit]]&\"_\"&Tabel2[[#This Row],[Entiteit of attribuut]]))","v":{"$error":"#REF!"}},{"$f":"IF(Schema!I514=\"\",\"\",Schema!I514)","v":""},{"$f":"IF(Schema!J514=\"\",\"\",Schema!J514)","v":""},{"$f":"IF(Schema!K514=\"\",\"\",Schema!K514)","v":""},{"$f":"IF(Schema!L514=\"\",\"\",Schema!L514)","v":""},{"$f":"IF(Schema!N514=\"\",\"\",Schema!N514)","v":"V"}]
[{"$f":"Schema!B515&Schema!C515&Schema!#REF!&Schema!D515","v":{"$error":"#REF!"}},{"$error":"#REF!"},{"$f":"IF(A25=\"\",\"\",IF(LEN(Schema!B515)=2,1,IF(LEN(Schema!C515)=2,10,IF(LEN(Schema!#REF!)=2,100,0))))","v":{"$error":"#REF!"}},{"$error":"#REF!"},{"$f":"IF(A25=\"\",\"\",SUM(Tabel2[[#This Row],[I1]:[I2]]))","v":{"$error":"#REF!"}},{"$error":"#REF!"},{"$error":"#REF!"},{"$error":"#REF!"},{"$error":"#REF!"},{"$f":"IF(C25=\"\",\"\",IF(LEN(Tabel2[[#This Row],[Entiteit of attribuut]])=2,\"\",Tabel2[[#This Row],[Entiteit]]&\"_\"&Tabel2[[#This Row],[Entiteit of attribuut]]))","v":{"$error":"#REF!"}},{"$f":"IF(Schema!I515=\"\",\"\",Schema!I515)","v":""},{"$f":"IF(Schema!J515=\"\",\"\",Schema!J515)","v":""},{"$f":"IF(Schema!K515=\"\",\"\",Schema!K515)","v":""},{"$f":"IF(Schema!L515=\"\",\"\",Schema!L515)","v":""},{"$f":"IF(Schema!N515=\"\",\"\",Schema!N515)","v":"O"}]
[{"$f":"Schema!#REF!&Schema!#REF!&Schema!#REF!&Schema!#REF!","v":{"$error":"#REF!"}},{"$error":"#REF!"},{"$f":"IF(A26=\"\",\"\",IF(LEN(Schema!#REF!)=2,1,IF(LEN(Schema!#REF!)=2,10,IF(LEN(Schema!#REF!)=2,100,0))))","v":{"$error":"#REF!"}},{"$error":"#REF!"},{"$f":"IF(A26=\"\",\"\",SUM(Tabel2[[#This Row],[I1]:[I2]]))","v":{"$error":"#REF!"}},{"$error":"#REF!"},{"$error":"#REF!"},{"$error":"#REF!"},{"$error":"#REF!"},{"$f":"IF(C26=\"\",\"\",IF(LEN(Tabel2[[#This Row],[Entiteit of attribuut]])=2,\"\",Tabel2[[#This Row],[Entiteit]]&\"_\"&Tabel2[[#This Row],[Entiteit of attribuut]]))","v":{"$error":"#REF!"}},{"$f":"IF(Schema!#REF!=\"\",\"\",Schema!#REF!)","v":{"$error":"#REF!"}},{"$f":"IF(Schema!#REF!=\"\",\"\",Schema!#REF!)","v":{"$error":"#REF!"}},{"$f":"IF(Schema!#REF!=\"\",\"\",Schema!#REF!)","v":{"$error":"#REF!"}},{"$f":"IF(Schema!#REF!=\"\",\"\",Schema!#REF!)","v":{"$error":"#REF!"}},{"$f":"IF(Schema!#REF!=\"\",\"\",Schema!#REF!)","v":{"$error":"#REF!"}}]
[{"$f":"Schema!B516&Schema!C516&Schema!#REF!&Schema!D516","v":{"$error":"#REF!"}},{"$error":"#REF!"},{"$f":"IF(A27=\"\",\"\",IF(LEN(Schema!B516)=2,1,IF(LEN(Schema!C516)=2,10,IF(LEN(Schema!#REF!)=2,100,0))))","v":{"$error":"#REF!"}},{"$error":"#REF!"},{"$f":"IF(A27=\"\",\"\",SUM(Tabel2[[#This Row],[I1]:[I2]]))","v":{"$error":"#REF!"}},{"$error":"#REF!"},{"$error":"#REF!"},{"$error":"#REF!"},{"$error":"#REF!"},{"$f":"IF(C27=\"\",\"\",IF(LEN(Tabel2[[#This Row],[Entiteit of attribuut]])=2,\"\",Tabel2[[#This Row],[Entiteit]]&\"_\"&Tabel2[[#This Row],[Entiteit of attribuut]]))","v":{"$error":"#REF!"}},{"$f":"IF(Schema!I516=\"\",\"\",Schema!I516)","v":""},{"$f":"IF(Schema!J516=\"\",\"\",Schema!J516)","v":""},{"$f":"IF(Schema!K516=\"\",\"\",Schema!K516)","v":""},{"$f":"IF(Schema!L516=\"\",\"\",Schema!L516)","v":""},{"$f":"IF(Schema!N516=\"\",\"\",Schema!N516)","v":"O"}]
[{"$f":"Schema!A38&Schema!B38&Schema!C38&Schema!D38","v":"ADEFVRS"},{"$error":"#REF!"},{"$f":"IF(A28=\"\",\"\",IF(LEN(Schema!A38)=2,1,IF(LEN(Schema!B38)=2,10,IF(LEN(Schema!C38)=2,100,0))))","v":0},{"$error":"#REF!"},{"$f":"IF(A28=\"\",\"\",SUM(Tabel2[[#This Row],[I1]:[I2]]))","v":{"$error":"#REF!"}},{"$error":"#REF!"},{"$error":"#REF!"},{"$error":"#REF!"},{"$error":"#REF!"},{"$f":"IF(C28=\"\",\"\",IF(LEN(Tabel2[[#This Row],[Entiteit of attribuut]])=2,\"\",Tabel2[[#This Row],[Entiteit]]&\"_\"&Tabel2[[#This Row],[Entiteit of attribuut]]))","v":{"$error":"#REF!"}},{"$f":"IF(Schema!I38=\"\",\"\",Schema!I38)","v":""},{"$f":"IF(Schema!J38=\"\",\"\",Schema!J38)","v":""},{"$f":"IF(Schema!K38=\"\",\"\",Schema!K38)","v":""},{"$f":"IF(Schema!L38=\"\",\"\",Schema!L38)","v":""},{"$f":"IF(Schema!N38=\"\",\"\",Schema!N38)","v":"V"}]
[{"$f":"Schema!#REF!&Schema!#REF!&Schema!#REF!&Schema!#REF!","v":{"$error":"#REF!"}},{"$error":"#REF!"},{"$f":"IF(A29=\"\",\"\",IF(LEN(Schema!#REF!)=2,1,IF(LEN(Schema!#REF!)=2,10,IF(LEN(Schema!#REF!)=2,100,0))))","v":{"$error":"#REF!"}},{"$error":"#REF!"},{"$f":"IF(A29=\"\",\"\",SUM(Tabel2[[#This Row],[I1]:[I2]]))","v":{"$error":"#REF!"}},{"$error":"#REF!"},{"$error":"#REF!"},{"$error":"#REF!"},{"$error":"#REF!"},{"$f":"IF(C29=\"\",\"\",IF(LEN(Tabel2[[#This Row],[Entiteit of attribuut]])=2,\"\",Tabel2[[#This Row],[Entiteit]]&\"_\"&Tabel2[[#This Row],[Entiteit of attribuut]]))","v":{"$error":"#REF!"}},{"$f":"IF(Schema!#REF!=\"\",\"\",Schema!#REF!)","v":{"$error":"#REF!"}},{"$f":"IF(Schema!#REF!=\"\",\"\",Schema!#REF!)","v":{"$error":"#REF!"}},{"$f":"IF(Schema!#REF!=\"\",\"\",Schema!#REF!)","v":{"$error":"#REF!"}},{"$f":"IF(Schema!#REF!=\"\",\"\",Schema!#REF!)","v":{"$error":"#REF!"}},{"$f":"IF(Schema!#REF!=\"\",\"\",Schema!#REF!)","v":{"$error":"#REF!"}}]
[{"$f":"Schema!A39&Schema!B39&Schema!C39&Schema!D39","v":"AFDDEFN"},{"$error":"#REF!"},{"$f":"IF(A30=\"\",\"\",IF(LEN(Schema!A39)=2,1,IF(LEN(Schema!B39)=2,10,IF(LEN(Schema!C39)=2,100,0))))","v":0},{"$error":"#REF!"},{"$f":"IF(A30=\"\",\"\",SUM(Tabel2[[#This Row],[I1]:[I2]]))","v":{"$error":"#REF!"}},{"$error":"#REF!"},{"$error":"#REF!"},{"$error":"#REF!"},{"$error":"#REF!"},{"$f":"IF(C30=\"\",\"\",IF(LEN(Tabel2[[#This Row],[Entiteit of attribuut]])=2,\"\",Tabel2[[#This Row],[Entiteit]]&\"_\"&Tabel2[[#This Row],[Entiteit of attribuut]]))","v":{"$error":"#REF!"}},{"$f":"IF(Schema!I39=\"\",\"\",Schema!I39)","v":""},{"$f":"IF(Schema!J39=\"\",\"\",Schema!J39)","v":""},{"$f":"IF(Schema!K39=\"\",\"\",Schema!K39)","v":""},{"$f":"IF(Schema!L39=\"\",\"\",Schema!L39)","v":""},{"$f":"IF(Schema!N39=\"\",\"\",Schema!N39)","v":"V"}]
[{"$f":"Schema!#REF!&Schema!#REF!&Schema!#REF!&Schema!#REF!","v":{"$error":"#REF!"}},{"$error":"#REF!"},{"$f":"IF(A31=\"\",\"\",IF(LEN(Schema!#REF!)=2,1,IF(LEN(Schema!#REF!)=2,10,IF(LEN(Schema!#REF!)=2,100,0))))","v":{"$error":"#REF!"}},{"$error":"#REF!"},{"$f":"IF(A31=\"\",\"\",SUM(Tabel2[[#This Row],[I1]:[I2]]))","v":{"$error":"#REF!"}},{"$error":"#REF!"},{"$error":"#REF!"},{"$error":"#REF!"},{"$error":"#REF!"},{"$f":"IF(C31=\"\",\"\",IF(LEN(Tabel2[[#This Row],[Entiteit of attribuut]])=2,\"\",Tabel2[[#This Row],[Entiteit]]&\"_\"&Tabel2[[#This Row],[Entiteit of attribuut]]))","v":{"$error":"#REF!"}},{"$f":"IF(Schema!#REF!=\"\",\"\",Schema!#REF!)","v":{"$error":"#REF!"}},{"$f":"IF(Schema!#REF!=\"\",\"\",Schema!#REF!)","v":{"$error":"#REF!"}},{"$f":"IF(Schema!#REF!=\"\",\"\",Schema!#REF!)","v":{"$error":"#REF!"}},{"$f":"IF(Schema!#REF!=\"\",\"\",Schema!#REF!)","v":{"$error":"#REF!"}},{"$f":"IF(Schema!#REF!=\"\",\"\",Schema!#REF!)","v":{"$error":"#REF!"}}]
[{"$f":"Schema!A40&Schema!B40&Schema!C40&Schema!D40","v":"BETTERM"},{"$error":"#REF!"},{"$f":"IF(A32=\"\",\"\",IF(LEN(Schema!A40)=2,1,IF(LEN(Schema!B40)=2,10,IF(LEN(Schema!C40)=2,100,0))))","v":0},{"$error":"#REF!"},{"$f":"IF(A32=\"\",\"\",SUM(Tabel2[[#This Row],[I1]:[I2]]))","v":{"$error":"#REF!"}},{"$error":"#REF!"},{"$error":"#REF!"},{"$error":"#REF!"},{"$error":"#REF!"},{"$f":"IF(C32=\"\",\"\",IF(LEN(Tabel2[[#This Row],[Entiteit of attribuut]])=2,\"\",Tabel2[[#This Row],[Entiteit]]&\"_\"&Tabel2[[#This Row],[Entiteit of attribuut]]))","v":{"$error":"#REF!"}},{"$f":"IF(Schema!I40=\"\",\"\",Schema!I40)","v":""},{"$f":"IF(Schema!J40=\"\",\"\",Schema!J40)","v":""},{"$f":"IF(Schema!K40=\"\",\"\",Schema!K40)","v":""},{"$f":"IF(Schema!L40=\"\",\"\",Schema!L40)","v":""},{"$f":"IF(Schema!N40=\"\",\"\",Schema!N40)","v":"O"}]
[{"$f":"Schema!#REF!&Schema!#REF!&Schema!#REF!&Schema!#REF!","v":{"$error":"#REF!"}},{"$error":"#REF!"},{"$f":"IF(A33=\"\",\"\",IF(LEN(Schema!#REF!)=2,1,IF(LEN(Schema!#REF!)=2,10,IF(LEN(Schema!#REF!)=2,100,0))))","v":{"$error":"#REF!"}},{"$error":"#REF!"},{"$f":"IF(A33=\"\",\"\",SUM(Tabel2[[#This Row],[I1]:[I2]]))","v":{"$error":"#REF!"}},{"$error":"#REF!"},{"$error":"#REF!"},{"$error":"#REF!"},{"$error":"#REF!"},{"$f":"IF(C33=\"\",\"\",IF(LEN(Tabel2[[#This Row],[Entiteit of attribuut]])=2,\"\",Tabel2[[#This Row],[Entiteit]]&\"_\"&Tabel2[[#This Row],[Entiteit of attribuut]]))","v":{"$error":"#REF!"}},{"$f":"IF(Schema!#REF!=\"\",\"\",Schema!#REF!)","v":{"$error":"#REF!"}},{"$f":"IF(Schema!#REF!=\"\",\"\",Schema!#REF!)","v":{"$error":"#REF!"}},{"$f":"IF(Schema!#REF!=\"\",\"\",Schema!#REF!)","v":{"$error":"#REF!"}},{"$f":"IF(Schema!#REF!=\"\",\"\",Schema!#REF!)","v":{"$error":"#REF!"}},{"$f":"IF(Schema!#REF!=\"\",\"\",Schema!#REF!)","v":{"$error":"#REF!"}}]
[{"$f":"Schema!A41&Schema!B41&Schema!C41&Schema!D41","v":"BRANCHE"},{"$error":"#REF!"},{"$f":"IF(A34=\"\",\"\",IF(LEN(Schema!A41)=2,1,IF(LEN(Schema!B41)=2,10,IF(LEN(Schema!C41)=2,100,0))))","v":0},{"$error":"#REF!"},{"$f":"IF(A34=\"\",\"\",SUM(Tabel2[[#This Row],[I1]:[I2]]))","v":{"$error":"#REF!"}},{"$error":"#REF!"},{"$error":"#REF!"},{"$error":"#REF!"},{"$error":"#REF!"},{"$f":"IF(C34=\"\",\"\",IF(LEN(Tabel2[[#This Row],[Entiteit of attribuut]])=2,\"\",Tabel2[[#This Row],[Entiteit]]&\"_\"&Tabel2[[#This Row],[Entiteit of attribuut]]))","v":{"$error":"#REF!"}},{"$f":"IF(Schema!I41=\"\",\"\",Schema!I41)","v":""},{"$f":"IF(Schema!J41=\"\",\"\",Schema!J41)","v":""},{"$f":"IF(Schema!K41=\"\",\"\",Schema!K41)","v":""},{"$f":"IF(Schema!L41=\"\",\"\",Schema!L41)","v":""},{"$f":"IF(Schema!N41=\"\",\"\",Schema!N41)","v":"V"}]
[{"$f":"Schema!#REF!&Schema!#REF!&Schema!#REF!&Schema!#REF!","v":{"$error":"#REF!"}},{"$error":"#REF!"},{"$f":"IF(A35=\"\",\"\",IF(LEN(Schema!#REF!)=2,1,IF(LEN(Schema!#REF!)=2,10,IF(LEN(Schema!#REF!)=2,100,0))))","v":{"$error":"#REF!"}},{"$error":"#REF!"},{"$f":"IF(A35=\"\",\"\",SUM(Tabel2[[#This Row],[I1]:[I2]]))","v":{"$error":"#REF!"}},{"$error":"#REF!"},{"$error":"#REF!"},{"$error":"#REF!"},{"$error":"#REF!"},{"$f":"IF(C35=\"\",\"\",IF(LEN(Tabel2[[#This Row],[Entiteit of attribuut]])=2,\"\",Tabel2[[#This Row],[Entiteit]]&\"_\"&Tabel2[[#This Row],[Entiteit of attribuut]]))","v":{"$error":"#REF!"}},{"$f":"IF(Schema!#REF!=\"\",\"\",Schema!#REF!)","v":{"$error":"#REF!"}},{"$f":"IF(Schema!#REF!=\"\",\"\",Schema!#REF!)","v":{"$error":"#REF!"}},{"$f":"IF(Schema!#REF!=\"\",\"\",Schema!#REF!)","v":{"$error":"#REF!"}},{"$f":"IF(Schema!#REF!=\"\",\"\",Schema!#REF!)","v":{"$error":"#REF!"}},{"$f":"IF(Schema!#REF!=\"\",\"\",Schema!#REF!)","v":{"$error":"#REF!"}}]
[{"$f":"Schema!A42&Schema!B42&Schema!C42&Schema!D42","v":"BTP"},{"$error":"#REF!"},{"$f":"IF(A36=\"\",\"\",IF(LEN(Schema!A42)=2,1,IF(LEN(Schema!B42)=2,10,IF(LEN(Schema!C42)=2,100,0))))","v":0},{"$error":"#REF!"},{"$f":"IF(A36=\"\",\"\",SUM(Tabel2[[#This Row],[I1]:[I2]]))","v":{"$error":"#REF!"}},{"$error":"#REF!"},{"$error":"#REF!"},{"$error":"#REF!"},{"$error":"#REF!"},{"$f":"IF(C36=\"\",\"\",IF(LEN(Tabel2[[#This Row],[Entiteit of attribuut]])=2,\"\",Tabel2[[#This Row],[Entiteit]]&\"_\"&Tabel2[[#This Row],[Entiteit of attribuut]]))","v":{"$error":"#REF!"}},{"$f":"IF(Schema!I42=\"\",\"\",Schema!I42)","v":""},{"$f":"IF(Schema!J42=\"\",\"\",Schema!J42)","v":""},{"$f":"IF(Schema!K42=\"\",\"\",Schema!K42)","v":""},{"$f":"IF(Schema!L42=\"\",\"\",Schema!L42)","v":""},{"$f":"IF(Schema!N42=\"\",\"\",Schema!N42)","v":"LEEG"}]
[{"$f":"Schema!A43&Schema!B43&Schema!C43&Schema!D43","v":"CDUUMND"},{"$error":"#REF!"},{"$f":"IF(A37=\"\",\"\",IF(LEN(Schema!A43)=2,1,IF(LEN(Schema!B43)=2,10,IF(LEN(Schema!C43)=2,100,0))))","v":0},{"$error":"#REF!"},{"$f":"IF(A37=\"\",\"\",SUM(Tabel2[[#This Row],[I1]:[I2]]))","v":{"$error":"#REF!"}},{"$error":"#REF!"},{"$error":"#REF!"},{"$error":"#REF!"},{"$error":"#REF!"},{"$f":"IF(C37=\"\",\"\",IF(LEN(Tabel2[[#This Row],[Entiteit of attribuut]])=2,\"\",Tabel2[[#This Row],[Entiteit]]&\"_\"&Tabel2[[#This Row],[Entiteit of attribuut]]))","v":{"$error":"#REF!"}},{"$f":"IF(Schema!I43=\"\",\"\",Schema!I43)","v":""},{"$f":"IF(Schema!J43=\"\",\"\",Schema!J43)","v":""},{"$f":"IF(Schema!K43=\"\",\"\",Schema!K43)","v":""},{"$f":"IF(Schema!L43=\"\",\"\",Schema!L43)","v":""},{"$f":"IF(Schema!N43=\"\",\"\",Schema!N43)","v":"O"}]
[{"$f":"Schema!#REF!&Schema!#REF!&Schema!#REF!&Schema!#REF!","v":{"$error":"#REF!"}},{"$error":"#REF!"},{"$f":"IF(A38=\"\",\"\",IF(LEN(Schema!#REF!)=2,1,IF(LEN(Schema!#REF!)=2,10,IF(LEN(Schema!#REF!)=2,100,0))))","v":{"$error":"#REF!"}},{"$error":"#REF!"},{"$f":"IF(A38=\"\",\"\",SUM(Tabel2[[#This Row],[I1]:[I2]]))","v":{"$error":"#REF!"}},{"$error":"#REF!"},{"$error":"#REF!"},{"$error":"#REF!"},{"$error":"#REF!"},{"$f":"IF(C38=\"\",\"\",IF(LEN(Tabel2[[#This Row],[Entiteit of attribuut]])=2,\"\",Tabel2[[#This Row],[Entiteit]]&\"_\"&Tabel2[[#This Row],[Entiteit of attribuut]]))","v":{"$error":"#REF!"}},{"$f":"IF(Schema!#REF!=\"\",\"\",Schema!#REF!)","v":{"$error":"#REF!"}},{"$f":"IF(Schema!#REF!=\"\",\"\",Schema!#REF!)","v":{"$error":"#REF!"}},{"$f":"IF(Schema!#REF!=\"\",\"\",Schema!#REF!)","v":{"$error":"#REF!"}},{"$f":"IF(Schema!#REF!=\"\",\"\",Schema!#REF!)","v":{"$error":"#REF!"}},{"$f":"IF(Schema!#REF!=\"\",\"\",Schema!#REF!)","v":{"$error":"#REF!"}}]
[{"$f":"Schema!A44&Schema!B44&Schema!C44&Schema!D44","v":"COASSJN"},{"$error":"#REF!"},{"$f":"IF(A39=\"\",\"\",IF(LEN(Schema!A44)=2,1,IF(LEN(Schema!B44)=2,10,IF(LEN(Schema!C44)=2,100,0))))","v":0},{"$error":"#REF!"},{"$f":"IF(A39=\"\",\"\",SUM(Tabel2[[#This Row],[I1]:[I2]]))","v":{"$error":"#REF!"}},{"$error":"#REF!"},{"$error":"#REF!"},{"$error":"#REF!"},{"$error":"#REF!"},{"$f":"IF(C39=\"\",\"\",IF(LEN(Tabel2[[#This Row],[Entiteit of attribuut]])=2,\"\",Tabel2[[#This Row],[Entiteit]]&\"_\"&Tabel2[[#This Row],[Entiteit of attribuut]]))","v":{"$error":"#REF!"}},{"$f":"IF(Schema!I44=\"\",\"\",Schema!I44)","v":""},{"$f":"IF(Schema!J44=\"\",\"\",Schema!J44)","v":""},{"$f":"IF(Schema!K44=\"\",\"\",Schema!K44)","v":""},{"$f":"IF(Schema!L44=\"\",\"\",Schema!L44)","v":""},{"$f":"IF(Schema!N44=\"\",\"\",Schema!N44)","v":"V"}]
[{"$f":"Schema!#REF!&Schema!#REF!&Schema!#REF!&Schema!#REF!","v":{"$error":"#REF!"}},{"$error":"#REF!"},{"$f":"IF(A40=\"\",\"\",IF(LEN(Schema!#REF!)=2,1,IF(LEN(Schema!#REF!)=2,10,IF(LEN(Schema!#REF!)=2,100,0))))","v":{"$error":"#REF!"}},{"$error":"#REF!"},{"$f":"IF(A40=\"\",\"\",SUM(Tabel2[[#This Row],[I1]:[I2]]))","v":{"$error":"#REF!"}},{"$error":"#REF!"},{"$error":"#REF!"},{"$error":"#REF!"},{"$error":"#REF!"},{"$f":"IF(C40=\"\",\"\",IF(LEN(Tabel2[[#This Row],[Entiteit of attribuut]])=2,\"\",Tabel2[[#This Row],[Entiteit]]&\"_\"&Tabel2[[#This Row],[Entiteit of attribuut]]))","v":{"$error":"#REF!"}},{"$f":"IF(Schema!#REF!=\"\",\"\",Schema!#REF!)","v":{"$error":"#REF!"}},{"$f":"IF(Schema!#REF!=\"\",\"\",Schema!#REF!)","v":{"$error":"#REF!"}},{"$f":"IF(Schema!#REF!=\"\",\"\",Schema!#REF!)","v":{"$error":"#REF!"}},{"$f":"IF(Schema!#REF!=\"\",\"\",Schema!#REF!)","v":{"$error":"#REF!"}},{"$f":"IF(Schema!#REF!=\"\",\"\",Schema!#REF!)","v":{"$error":"#REF!"}}]
[{"$f":"Schema!#REF!&Schema!#REF!&Schema!#REF!&Schema!#REF!","v":{"$error":"#REF!"}},{"$error":"#REF!"},{"$f":"IF(A41=\"\",\"\",IF(LEN(Schema!#REF!)=2,1,IF(LEN(Schema!#REF!)=2,10,IF(LEN(Schema!#REF!)=2,100,0))))","v":{"$error":"#REF!"}},{"$error":"#REF!"},{"$f":"IF(A41=\"\",\"\",SUM(Tabel2[[#This Row],[I1]:[I2]]))","v":{"$error":"#REF!"}},{"$error":"#REF!"},{"$error":"#REF!"},{"$error":"#REF!"},{"$error":"#REF!"},{"$f":"IF(C41=\"\",\"\",IF(LEN(Tabel2[[#This Row],[Entiteit of attribuut]])=2,\"\",Tabel2[[#This Row],[Entiteit]]&\"_\"&Tabel2[[#This Row],[Entiteit of attribuut]]))","v":{"$error":"#REF!"}},{"$f":"IF(Schema!#REF!=\"\",\"\",Schema!#REF!)","v":{"$error":"#REF!"}},{"$f":"IF(Schema!#REF!=\"\",\"\",Schema!#REF!)","v":{"$error":"#REF!"}},{"$f":"IF(Schema!#REF!=\"\",\"\",Schema!#REF!)","v":{"$error":"#REF!"}},{"$f":"IF(Schema!#REF!=\"\",\"\",Schema!#REF!)","v":{"$error":"#REF!"}},{"$f":"IF(Schema!#REF!=\"\",\"\",Schema!#REF!)","v":{"$error":"#REF!"}}]
[{"$f":"Schema!A45&Schema!B45&Schema!C45&Schema!D45","v":"ENDDATC"},{"$error":"#REF!"},{"$f":"IF(A42=\"\",\"\",IF(LEN(Schema!A45)=2,1,IF(LEN(Schema!B45)=2,10,IF(LEN(Schema!C45)=2,100,0))))","v":0},{"$error":"#REF!"},{"$f":"IF(A42=\"\",\"\",SUM(Tabel2[[#This Row],[I1]:[I2]]))","v":{"$error":"#REF!"}},{"$error":"#REF!"},{"$error":"#REF!"},{"$error":"#REF!"},{"$error":"#REF!"},{"$f":"IF(C42=\"\",\"\",IF(LEN(Tabel2[[#This Row],[Entiteit of attribuut]])=2,\"\",Tabel2[[#This Row],[Entiteit]]&\"_\"&Tabel2[[#This Row],[Entiteit of attribuut]]))","v":{"$error":"#REF!"}},{"$f":"IF(Schema!I45=\"\",\"\",Schema!I45)","v":""},{"$f":"IF(Schema!J45=\"\",\"\",Schema!J45)","v":""},{"$f":"IF(Schema!K45=\"\",\"\",Schema!K45)","v":""},{"$f":"IF(Schema!L45=\"\",\"\",Schema!L45)","v":""},{"$f":"IF(Schema!N45=\"\",\"\",Schema!N45)","v":"O"}]
[{"$f":"Schema!#REF!&Schema!#REF!&Schema!#REF!&Schema!#REF!","v":{"$error":"#REF!"}},{"$error":"#REF!"},{"$f":"IF(A43=\"\",\"\",IF(LEN(Schema!#REF!)=2,1,IF(LEN(Schema!#REF!)=2,10,IF(LEN(Schema!#REF!)=2,100,0))))","v":{"$error":"#REF!"}},{"$error":"#REF!"},{"$f":"IF(A43=\"\",\"\",SUM(Tabel2[[#This Row],[I1]:[I2]]))","v":{"$error":"#REF!"}},{"$error":"#REF!"},{"$error":"#REF!"},{"$error":"#REF!"},{"$error":"#REF!"},{"$f":"IF(C43=\"\",\"\",IF(LEN(Tabel2[[#This Row],[Entiteit of attribuut]])=2,\"\",Tabel2[[#This Row],[Entiteit]]&\"_\"&Tabel2[[#This Row],[Entiteit of attribuut]]))","v":{"$error":"#REF!"}},{"$f":"IF(Schema!#REF!=\"\",\"\",Schema!#REF!)","v":{"$error":"#REF!"}},{"$f":"IF(Schema!#REF!=\"\",\"\",Schema!#REF!)","v":{"$error":"#REF!"}},{"$f":"IF(Schema!#REF!=\"\",\"\",Schema!#REF!)","v":{"$error":"#REF!"}},{"$f":"IF(Schema!#REF!=\"\",\"\",Schema!#REF!)","v":{"$error":"#REF!"}},{"$f":"IF(Schema!#REF!=\"\",\"\",Schema!#REF!)","v":{"$error":"#REF!"}}]
[{"$f":"Schema!#REF!&Schema!#REF!&Schema!#REF!&Schema!#REF!","v":{"$error":"#REF!"}},{"$error":"#REF!"},{"$f":"IF(A44=\"\",\"\",IF(LEN(Schema!#REF!)=2,1,IF(LEN(Schema!#REF!)=2,10,IF(LEN(Schema!#REF!)=2,100,0))))","v":{"$error":"#REF!"}},{"$error":"#REF!"},{"$f":"IF(A44=\"\",\"\",SUM(Tabel2[[#This Row],[I1]:[I2]]))","v":{"$error":"#REF!"}},{"$error":"#REF!"},{"$error":"#REF!"},{"$error":"#REF!"},{"$error":"#REF!"},{"$f":"IF(C44=\"\",\"\",IF(LEN(Tabel2[[#This Row],[Entiteit of attribuut]])=2,\"\",Tabel2[[#This Row],[Entiteit]]&\"_\"&Tabel2[[#This Row],[Entiteit of attribuut]]))","v":{"$error":"#REF!"}},{"$f":"IF(Schema!#REF!=\"\",\"\",Schema!#REF!)","v":{"$error":"#REF!"}},{"$f":"IF(Schema!#REF!=\"\",\"\",Schema!#REF!)","v":{"$error":"#REF!"}},{"$f":"IF(Schema!#REF!=\"\",\"\",Schema!#REF!)","v":{"$error":"#REF!"}},{"$f":"IF(Schema!#REF!=\"\",\"\",Schema!#REF!)","v":{"$error":"#REF!"}},{"$f":"IF(Schema!#REF!=\"\",\"\",Schema!#REF!)","v":{"$error":"#REF!"}}]
[{"$f":"Schema!A46&Schema!B46&Schema!C46&Schema!D46","v":"EXTERN"},{"$error":"#REF!"},{"$f":"IF(A45=\"\",\"\",IF(LEN(Schema!A46)=2,1,IF(LEN(Schema!B46)=2,10,IF(LEN(Schema!C46)=2,100,0))))","v":0},{"$error":"#REF!"},{"$f":"IF(A45=\"\",\"\",SUM(Tabel2[[#This Row],[I1]:[I2]]))","v":{"$error":"#REF!"}},{"$error":"#REF!"},{"$error":"#REF!"},{"$error":"#REF!"},{"$error":"#REF!"},{"$f":"IF(C45=\"\",\"\",IF(LEN(Tabel2[[#This Row],[Entiteit of attribuut]])=2,\"\",Tabel2[[#This Row],[Entiteit]]&\"_\"&Tabel2[[#This Row],[Entiteit of attribuut]]))","v":{"$error":"#REF!"}},{"$f":"IF(Schema!I46=\"\",\"\",Schema!I46)","v":""},{"$f":"IF(Schema!J46=\"\",\"\",Schema!J46)","v":""},{"$f":"IF(Schema!K46=\"\",\"\",Schema!K46)","v":""},{"$f":"IF(Schema!L46=\"\",\"\",Schema!L46)","v":""},{"$f":"IF(Schema!N46=\"\",\"\",Schema!N46)","v":"LEEG"}]
[{"$f":"Schema!#REF!&Schema!#REF!&Schema!#REF!&Schema!#REF!","v":{"$error":"#REF!"}},{"$error":"#REF!"},{"$f":"IF(A46=\"\",\"\",IF(LEN(Schema!#REF!)=2,1,IF(LEN(Schema!#REF!)=2,10,IF(LEN(Schema!#REF!)=2,100,0))))","v":{"$error":"#REF!"}},{"$error":"#REF!"},{"$f":"IF(A46=\"\",\"\",SUM(Tabel2[[#This Row],[I1]:[I2]]))","v":{"$error":"#REF!"}},{"$error":"#REF!"},{"$error":"#REF!"},{"$error":"#REF!"},{"$error":"#REF!"},{"$f":"IF(C46=\"\",\"\",IF(LEN(Tabel2[[#This Row],[Entiteit of attribuut]])=2,\"\",Tabel2[[#This Row],[Entiteit]]&\"_\"&Tabel2[[#This Row],[Entiteit of attribuut]]))","v":{"$error":"#REF!"}},{"$f":"IF(Schema!#REF!=\"\",\"\",Schema!#REF!)","v":{"$error":"#REF!"}},{"$f":"IF(Schema!#REF!=\"\",\"\",Schema!#REF!)","v":{"$error":"#REF!"}},{"$f":"IF(Schema!#REF!=\"\",\"\",Schema!#REF!)","v":{"$error":"#REF!"}},{"$f":"IF(Schema!#REF!=\"\",\"\",Schema!#REF!)","v":{"$error":"#REF!"}},{"$f":"IF(Schema!#REF!=\"\",\"\",Schema!#REF!)","v":{"$error":"#REF!"}}]
[{"$f":"Schema!A47&Schema!B47&Schema!C47&Schema!D47","v":"GABRA"},{"$error":"#REF!"},{"$f":"IF(A47=\"\",\"\",IF(LEN(Schema!A47)=2,1,IF(LEN(Schema!B47)=2,10,IF(LEN(Schema!C47)=2,100,0))))","v":0},{"$error":"#REF!"},{"$f":"IF(A47=\"\",\"\",SUM(Tabel2[[#This Row],[I1]:[I2]]))","v":{"$error":"#REF!"}},{"$error":"#REF!"},{"$error":"#REF!"},{"$error":"#REF!"},{"$error":"#REF!"},{"$f":"IF(C47=\"\",\"\",IF(LEN(Tabel2[[#This Row],[Entiteit of attribuut]])=2,\"\",Tabel2[[#This Row],[Entiteit]]&\"_\"&Tabel2[[#This Row],[Entiteit of attribuut]]))","v":{"$error":"#REF!"}},{"$f":"IF(Schema!I47=\"\",\"\",Schema!I47)","v":""},{"$f":"IF(Schema!J47=\"\",\"\",Schema!J47)","v":""},{"$f":"IF(Schema!K47=\"\",\"\",Schema!K47)","v":""},{"$f":"IF(Schema!L47=\"\",\"\",Schema!L47)","v":""},{"$f":"IF(Schema!N47=\"\",\"\",Schema!N47)","v":"V"}]
[{"$f":"Schema!#REF!&Schema!#REF!&Schema!#REF!&Schema!#REF!","v":{"$error":"#REF!"}},{"$error":"#REF!"},{"$f":"IF(A48=\"\",\"\",IF(LEN(Schema!#REF!)=2,1,IF(LEN(Schema!#REF!)=2,10,IF(LEN(Schema!#REF!)=2,100,0))))","v":{"$error":"#REF!"}},{"$error":"#REF!"},{"$f":"IF(A48=\"\",\"\",SUM(Tabel2[[#This Row],[I1]:[I2]]))","v":{"$error":"#REF!"}},{"$error":"#REF!"},{"$error":"#REF!"},{"$error":"#REF!"},{"$error":"#REF!"},{"$f":"IF(C48=\"\",\"\",IF(LEN(Tabel2[[#This Row],[Entiteit of attribuut]])=2,\"\",Tabel2[[#This Row],[Entiteit]]&\"_\"&Tabel2[[#This Row],[Entiteit of attribuut]]))","v":{"$error":"#REF!"}},{"$f":"IF(Schema!#REF!=\"\",\"\",Schema!#REF!)","v":{"$error":"#REF!"}},{"$f":"IF(Schema!#REF!=\"\",\"\",Schema!#REF!)","v":{"$error":"#REF!"}},{"$f":"IF(Schema!#REF!=\"\",\"\",Schema!#REF!)","v":{"$error":"#REF!"}},{"$f":"IF(Schema!#REF!=\"\",\"\",Schema!#REF!)","v":{"$error":"#REF!"}},{"$f":"IF(Schema!#REF!=\"\",\"\",Schema!#REF!)","v":{"$error":"#REF!"}}]
[{"$f":"Schema!A48&Schema!B48&Schema!C48&Schema!D48","v":"GABRAO"},{"$error":"#REF!"},{"$f":"IF(A49=\"\",\"\",IF(LEN(Schema!A48)=2,1,IF(LEN(Schema!B48)=2,10,IF(LEN(Schema!C48)=2,100,0))))","v":0},{"$error":"#REF!"},{"$f":"IF(A49=\"\",\"\",SUM(Tabel2[[#This Row],[I1]:[I2]]))","v":{"$error":"#REF!"}},{"$error":"#REF!"},{"$error":"#REF!"},{"$error":"#REF!"},{"$error":"#REF!"},{"$f":"IF(C49=\"\",\"\",IF(LEN(Tabel2[[#This Row],[Entiteit of attribuut]])=2,\"\",Tabel2[[#This Row],[Entiteit]]&\"_\"&Tabel2[[#This Row],[Entiteit of attribuut]]))","v":{"$error":"#REF!"}},{"$f":"IF(Schema!I48=\"\",\"\",Schema!I48)","v":""},{"$f":"IF(Schema!J48=\"\",\"\",Schema!J48)","v":""},{"$f":"IF(Schema!K48=\"\",\"\",Schema!K48)","v":""},{"$f":"IF(Schema!L48=\"\",\"\",Schema!L48)","v":""},{"$f":"IF(Schema!N48=\"\",\"\",Schema!N48)","v":"V"}]
[{"$f":"Schema!#REF!&Schema!#REF!&Schema!#REF!&Schema!#REF!","v":{"$error":"#REF!"}},{"$error":"#REF!"},{"$f":"IF(A50=\"\",\"\",IF(LEN(Schema!#REF!)=2,1,IF(LEN(Schema!#REF!)=2,10,IF(LEN(Schema!#REF!)=2,100,0))))","v":{"$error":"#REF!"}},{"$error":"#REF!"},{"$f":"IF(A50=\"\",\"\",SUM(Tabel2[[#This Row],[I1]:[I2]]))","v":{"$error":"#REF!"}},{"$error":"#REF!"},{"$error":"#REF!"},{"$error":"#REF!"},{"$error":"#REF!"},{"$f":"IF(C50=\"\",\"\",IF(LEN(Tabel2[[#This Row],[Entiteit of attribuut]])=2,\"\",Tabel2[[#This Row],[Entiteit]]&\"_\"&Tabel2[[#This Row],[Entiteit of attribuut]]))","v":{"$error":"#REF!"}},{"$f":"IF(Schema!#REF!=\"\",\"\",Schema!#REF!)","v":{"$error":"#REF!"}},{"$f":"IF(Schema!#REF!=\"\",\"\",Schema!#REF!)","v":{"$error":"#REF!"}},{"$f":"IF(Schema!#REF!=\"\",\"\",Schema!#REF!)","v":{"$error":"#REF!"}},{"$f":"IF(Schema!#REF!=\"\",\"\",Schema!#REF!)","v":{"$error":"#REF!"}},{"$f":"IF(Schema!#REF!=\"\",\"\",Schema!#REF!)","v":{"$error":"#REF!"}}]
[{"$f":"Schema!A49&Schema!B49&Schema!C49&Schema!D49","v":"GASBRA"},{"$error":"#REF!"},{"$f":"IF(A51=\"\",\"\",IF(LEN(Schema!A49)=2,1,IF(LEN(Schema!B49)=2,10,IF(LEN(Schema!C49)=2,100,0))))","v":0},{"$error":"#REF!"},{"$f":"IF(A51=\"\",\"\",SUM(Tabel2[[#This Row],[I1]:[I2]]))","v":{"$error":"#REF!"}},{"$error":"#REF!"},{"$error":"#REF!"},{"$error":"#REF!"},{"$error":"#REF!"},{"$f":"IF(C51=\"\",\"\",IF(LEN(Tabel2[[#This Row],[Entiteit of attribuut]])=2,\"\",Tabel2[[#This Row],[Entiteit]]&\"_\"&Tabel2[[#This Row],[Entiteit of attribuut]]))","v":{"$error":"#REF!"}},{"$f":"IF(Schema!I49=\"\",\"\",Schema!I49)","v":""},{"$f":"IF(Schema!J49=\"\",\"\",Schema!J49)","v":""},{"$f":"IF(Schema!K49=\"\",\"\",Schema!K49)","v":""},{"$f":"IF(Schema!L49=\"\",\"\",Schema!L49)","v":""},{"$f":"IF(Schema!N49=\"\",\"\",Schema!N49)","v":"V"}]
[{"$f":"Schema!#REF!&Schema!#REF!&Schema!#REF!&Schema!#REF!","v":{"$error":"#REF!"}},{"$error":"#REF!"},{"$f":"IF(A52=\"\",\"\",IF(LEN(Schema!#REF!)=2,1,IF(LEN(Schema!#REF!)=2,10,IF(LEN(Schema!#REF!)=2,100,0))))","v":{"$error":"#REF!"}},{"$error":"#REF!"},{"$f":"IF(A52=\"\",\"\",SUM(Tabel2[[#This Row],[I1]:[I2]]))","v":{"$error":"#REF!"}},{"$error":"#REF!"},{"$error":"#REF!"},{"$error":"#REF!"},{"$error":"#REF!"},{"$f":"IF(C52=\"\",\"\",IF(LEN(Tabel2[[#This Row],[Entiteit of attribuut]])=2,\"\",Tabel2[[#This Row],[Entiteit]]&\"_\"&Tabel2[[#This Row],[Entiteit of attribuut]]))","v":{"$error":"#REF!"}},{"$f":"IF(Schema!#REF!=\"\",\"\",Schema!#REF!)","v":{"$error":"#REF!"}},{"$f":"IF(Schema!#REF!=\"\",\"\",Schema!#REF!)","v":{"$error":"#REF!"}},{"$f":"IF(Schema!#REF!=\"\",\"\",Schema!#REF!)","v":{"$error":"#REF!"}},{"$f":"IF(Schema!#REF!=\"\",\"\",Schema!#REF!)","v":{"$error":"#REF!"}},{"$f":"IF(Schema!#REF!=\"\",\"\",Schema!#REF!)","v":{"$error":"#REF!"}}]
[{"$f":"Schema!#REF!&Schema!#REF!&Schema!#REF!&Schema!#REF!","v":{"$error":"#REF!"}},{"$error":"#REF!"},{"$f":"IF(A53=\"\",\"\",IF(LEN(Schema!#REF!)=2,1,IF(LEN(Schema!#REF!)=2,10,IF(LEN(Schema!#REF!)=2,100,0))))","v":{"$error":"#REF!"}},{"$error":"#REF!"},{"$f":"IF(A53=\"\",\"\",SUM(Tabel2[[#This Row],[I1]:[I2]]))","v":{"$error":"#REF!"}},{"$error":"#REF!"},{"$error":"#REF!"},{"$error":"#REF!"},{"$error":"#REF!"},{"$f":"IF(C53=\"\",\"\",IF(LEN(Tabel2[[#This Row],[Entiteit of attribuut]])=2,\"\",Tabel2[[#This Row],[Entiteit]]&\"_\"&Tabel2[[#This Row],[Entiteit of attribuut]]))","v":{"$error":"#REF!"}},{"$f":"IF(Schema!#REF!=\"\",\"\",Schema!#REF!)","v":{"$error":"#REF!"}},{"$f":"IF(Schema!#REF!=\"\",\"\",Schema!#REF!)","v":{"$error":"#REF!"}},{"$f":"IF(Schema!#REF!=\"\",\"\",Schema!#REF!)","v":{"$error":"#REF!"}},{"$f":"IF(Schema!#REF!=\"\",\"\",Schema!#REF!)","v":{"$error":"#REF!"}},{"$f":"IF(Schema!#REF!=\"\",\"\",Schema!#REF!)","v":{"$error":"#REF!"}}]
[{"$f":"Schema!#REF!&Schema!A32&Schema!B32&Schema!D32","v":{"$error":"#REF!"}},{"$error":"#REF!"},{"$f":"IF(A54=\"\",\"\",IF(LEN(Schema!#REF!)=2,1,IF(LEN(Schema!A32)=2,10,IF(LEN(Schema!B32)=2,100,0))))","v":{"$error":"#REF!"}},{"$error":"#REF!"},{"$f":"IF(A54=\"\",\"\",SUM(Tabel2[[#This Row],[I1]:[I2]]))","v":{"$error":"#REF!"}},{"$error":"#REF!"},{"$error":"#REF!"},{"$error":"#REF!"},{"$error":"#REF!"},{"$f":"IF(C54=\"\",\"\",IF(LEN(Tabel2[[#This Row],[Entiteit of attribuut]])=2,\"\",Tabel2[[#This Row],[Entiteit]]&\"_\"&Tabel2[[#This Row],[Entiteit of attribuut]]))","v":{"$error":"#REF!"}},{"$f":"IF(Schema!I32=\"\",\"\",Schema!I32)","v":""},{"$f":"IF(Schema!J32=\"\",\"\",Schema!J32)","v":""},{"$f":"IF(Schema!K32=\"\",\"\",Schema!K32)","v":""},{"$f":"IF(Schema!L32=\"\",\"\",Schema!L32)","v":""},{"$f":"IF(Schema!N32=\"\",\"\",Schema!N32)","v":"O"}]
[{"$f":"Schema!#REF!&Schema!A33&Schema!B33&Schema!D33","v":{"$error":"#REF!"}},{"$error":"#REF!"},{"$f":"IF(A55=\"\",\"\",IF(LEN(Schema!#REF!)=2,1,IF(LEN(Schema!A33)=2,10,IF(LEN(Schema!B33)=2,100,0))))","v":{"$error":"#REF!"}},{"$error":"#REF!"},{"$f":"IF(A55=\"\",\"\",SUM(Tabel2[[#This Row],[I1]:[I2]]))","v":{"$error":"#REF!"}},{"$error":"#REF!"},{"$error":"#REF!"},{"$error":"#REF!"},{"$error":"#REF!"},{"$f":"IF(C55=\"\",\"\",IF(LEN(Tabel2[[#This Row],[Entiteit of attribuut]])=2,\"\",Tabel2[[#This Row],[Entiteit]]&\"_\"&Tabel2[[#This Row],[Entiteit of attribuut]]))","v":{"$error":"#REF!"}},{"$f":"IF(Schema!I33=\"\",\"\",Schema!I33)","v":""},{"$f":"IF(Schema!J33=\"\",\"\",Schema!J33)","v":""},{"$f":"IF(Schema!K33=\"\",\"\",Schema!K33)","v":""},{"$f":"IF(Schema!L33=\"\",\"\",Schema!L33)","v":""},{"$f":"IF(Schema!N33=\"\",\"\",Schema!N33)","v":"V"}]
[{"$f":"Schema!#REF!&Schema!A34&Schema!B34&Schema!D34","v":{"$error":"#REF!"}},{"$error":"#REF!"},{"$f":"IF(A56=\"\",\"\",IF(LEN(Schema!#REF!)=2,1,IF(LEN(Schema!A34)=2,10,IF(LEN(Schema!B34)=2,100,0))))","v":{"$error":"#REF!"}},{"$error":"#REF!"},{"$f":"IF(A56=\"\",\"\",SUM(Tabel2[[#This Row],[I1]:[I2]]))","v":{"$error":"#REF!"}},{"$error":"#REF!"},{"$error":"#REF!"},{"$error":"#REF!"},{"$error":"#REF!"},{"$f":"IF(C56=\"\",\"\",IF(LEN(Tabel2[[#This Row],[Entiteit of attribuut]])=2,\"\",Tabel2[[#This Row],[Entiteit]]&\"_\"&Tabel2[[#This Row],[Entiteit of attribuut]]))","v":{"$error":"#REF!"}},{"$f":"IF(Schema!I34=\"\",\"\",Schema!I34)","v":""},{"$f":"IF(Schema!J34=\"\",\"\",Schema!J34)","v":""},{"$f":"IF(Schema!K34=\"\",\"\",Schema!K34)","v":""},{"$f":"IF(Schema!L34=\"\",\"\",Schema!L34)","v":""},{"$f":"IF(Schema!N34=\"\",\"\",Schema!N34)","v":"O"}]
[{"$f":"Schema!#REF!&Schema!A35&Schema!B35&Schema!D35","v":{"$error":"#REF!"}},{"$error":"#REF!"},{"$f":"IF(A57=\"\",\"\",IF(LEN(Schema!#REF!)=2,1,IF(LEN(Schema!A35)=2,10,IF(LEN(Schema!B35)=2,100,0))))","v":{"$error":"#REF!"}},{"$error":"#REF!"},{"$f":"IF(A57=\"\",\"\",SUM(Tabel2[[#This Row],[I1]:[I2]]))","v":{"$error":"#REF!"}},{"$error":"#REF!"},{"$error":"#REF!"},{"$error":"#REF!"},{"$error":"#REF!"},{"$f":"IF(C57=\"\",\"\",IF(LEN(Tabel2[[#This Row],[Entiteit of attribuut]])=2,\"\",Tabel2[[#This Row],[Entiteit]]&\"_\"&Tabel2[[#This Row],[Entiteit of attribuut]]))","v":{"$error":"#REF!"}},{"$f":"IF(Schema!I35=\"\",\"\",Schema!I35)","v":""},{"$f":"IF(Schema!J35=\"\",\"\",Schema!J35)","v":""},{"$f":"IF(Schema!K35=\"\",\"\",Schema!K35)","v":""},{"$f":"IF(Schema!L35=\"\",\"\",Schema!L35)","v":""},{"$f":"IF(Schema!N35=\"\",\"\",Schema!N35)","v":"V"}]
[{"$f":"Schema!A500&Schema!B500&Schema!C500&Schema!D500","v":"TP"},"TP",{"$f":"IF(A58=\"\",\"\",IF(LEN(Schema!A500)=2,1,IF(LEN(Schema!B500)=2,10,IF(LEN(Schema!C500)=2,100,0))))","v":10},10,{"$f":"IF(A58=\"\",\"\",SUM(Tabel2[[#This Row],[I1]:[I2]]))","v":20},{"$error":"#REF!"},"TP","",{"$error":"#REF!"},{"$f":"IF(C58=\"\",\"\",IF(LEN(Tabel2[[#This Row],[Entiteit of attribuut]])=2,\"\",Tabel2[[#This Row],[Entiteit]]&\"_\"&Tabel2[[#This Row],[Entiteit of attribuut]]))","v":""},{"$f":"IF(Schema!I500=\"\",\"\",Schema!I500)","v":""},{"$f":"IF(Schema!J500=\"\",\"\",Schema!J500)","v":""},{"$f":"IF(Schema!K500=\"\",\"\",Schema!K500)","v":""},{"$f":"IF(Schema!L500=\"\",\"\",Schema!L500)","v":""},{"$f":"IF(Schema!N500=\"\",\"\",Schema!N500)","v":"O"}]
[{"$f":"Schema!A501&Schema!B501&Schema!C501&Schema!D501","v":"AFMVRGN"},"TP",{"$f":"IF(A59=\"\",\"\",IF(LEN(Schema!A501)=2,1,IF(LEN(Schema!B501)=2,10,IF(LEN(Schema!C501)=2,100,0))))","v":0},10,{"$f":"IF(A59=\"\",\"\",SUM(Tabel2[[#This Row],[I1]:[I2]]))","v":10},{"$error":"#REF!"},"TP","",{"$error":"#REF!"},{"$f":"IF(C59=\"\",\"\",IF(LEN(Tabel2[[#This Row],[Entiteit of attribuut]])=2,\"\",Tabel2[[#This Row],[Entiteit]]&\"_\"&Tabel2[[#This Row],[Entiteit of attribuut]]))","v":"TP_AFMVRGN"},{"$f":"IF(Schema!I501=\"\",\"\",Schema!I501)","v":""},{"$f":"IF(Schema!J501=\"\",\"\",Schema!J501)","v":""},{"$f":"IF(Schema!K501=\"\",\"\",Schema!K501)","v":""},{"$f":"IF(Schema!L501=\"\",\"\",Schema!L501)","v":""},{"$f":"IF(Schema!N501=\"\",\"\",Schema!N501)","v":"O"}]
[{"$f":"Schema!A502&Schema!B502&Schema!C502&Schema!D502","v":"IDNR"},"TP",{"$f":"IF(A60=\"\",\"\",IF(LEN(Schema!A502)=2,1,IF(LEN(Schema!B502)=2,10,IF(LEN(Schema!C502)=2,100,0))))","v":0},10,{"$f":"IF(A60=\"\",\"\",SUM(Tabel2[[#This Row],[I1]:[I2]]))","v":10},{"$error":"#REF!"},"TP","",{"$error":"#REF!"},{"$f":"IF(C60=\"\",\"\",IF(LEN(Tabel2[[#This Row],[Entiteit of attribuut]])=2,\"\",Tabel2[[#This Row],[Entiteit]]&\"_\"&Tabel2[[#This Row],[Entiteit of attribuut]]))","v":"TP_IDNR"},{"$f":"IF(Schema!I502=\"\",\"\",Schema!I502)","v":""},{"$f":"IF(Schema!J502=\"\",\"\",Schema!J502)","v":""},{"$f":"IF(Schema!K502=\"\",\"\",Schema!K502)","v":""},{"$f":"IF(Schema!L502=\"\",\"\",Schema!L502)","v":""},{"$f":"IF(Schema!N502=\"\",\"\",Schema!N502)","v":"O"}]
[{"$f":"Schema!A520&Schema!B520&Schema!C520&Schema!D520","v":"VP"},"VP",{"$f":"IF(A61=\"\",\"\",IF(LEN(Schema!A520)=2,1,IF(LEN(Schema!B520)=2,10,IF(LEN(Schema!C520)=2,100,0))))","v":10},10,{"$f":"IF(A61=\"\",\"\",SUM(Tabel2[[#This Row],[I1]:[I2]]))","v":20},{"$error":"#REF!"},"VP","",{"$error":"#REF!"},{"$f":"IF(C61=\"\",\"\",IF(LEN(Tabel2[[#This Row],[Entiteit of attribuut]])=2,\"\",Tabel2[[#This Row],[Entiteit]]&\"_\"&Tabel2[[#This Row],[Entiteit of attribuut]]))","v":""},{"$f":"IF(Schema!I520=\"\",\"\",Schema!I520)","v":""},{"$f":"IF(Schema!J520=\"\",\"\",Schema!J520)","v":""},{"$f":"IF(Schema!K520=\"\",\"\",Schema!K520)","v":""},{"$f":"IF(Schema!L520=\"\",\"\",Schema!L520)","v":""},{"$f":"IF(Schema!N520=\"\",\"\",Schema!N520)","v":"V"}]
[{"$f":"Schema!A521&Schema!B521&Schema!C521&Schema!D521","v":"ANAAM"},"VP",{"$f":"IF(A62=\"\",\"\",IF(LEN(Schema!A521)=2,1,IF(LEN(Schema!B521)=2,10,IF(LEN(Schema!C521)=2,100,0))))","v":0},10,{"$f":"IF(A62=\"\",\"\",SUM(Tabel2[[#This Row],[I1]:[I2]]))","v":10},{"$error":"#REF!"},"VP","",{"$error":"#REF!"},{"$f":"IF(C62=\"\",\"\",IF(LEN(Tabel2[[#This Row],[Entiteit of attribuut]])=2,\"\",Tabel2[[#This Row],[Entiteit]]&\"_\"&Tabel2[[#This Row],[Entiteit of attribuut]]))","v":"VP_ANAAM"},{"$f":"IF(Schema!I521=\"\",\"\",Schema!I521)","v":""},{"$f":"IF(Schema!J521=\"\",\"\",Schema!J521)","v":""},{"$f":"IF(Schema!K521=\"\",\"\",Schema!K521)","v":""},{"$f":"IF(Schema!L521=\"\",\"\",Schema!L521)","v":""},{"$f":"IF(Schema!N521=\"\",\"\",Schema!N521)","v":"LEEG"}]
[{"$f":"Schema!A522&Schema!B522&Schema!C522&Schema!D522","v":"GEBDAT"},"VP",{"$f":"IF(A63=\"\",\"\",IF(LEN(Schema!A522)=2,1,IF(LEN(Schema!B522)=2,10,IF(LEN(Schema!C522)=2,100,0))))","v":0},10,{"$f":"IF(A63=\"\",\"\",SUM(Tabel2[[#This Row],[I1]:[I2]]))","v":10},{"$error":"#REF!"},"VP","",{"$error":"#REF!"},{"$f":"IF(C63=\"\",\"\",IF(LEN(Tabel2[[#This Row],[Entiteit of attribuut]])=2,\"\",Tabel2[[#This Row],[Entiteit]]&\"_\"&Tabel2[[#This Row],[Entiteit of attribuut]]))","v":"VP_GEBDAT"},{"$f":"IF(Schema!I522=\"\",\"\",Schema!I522)","v":""},{"$f":"IF(Schema!J522=\"\",\"\",Schema!J522)","v":""},{"$f":"IF(Schema!K522=\"\",\"\",Schema!K522)","v":""},{"$f":"IF(Schema!L522=\"\",\"\",Schema!L522)","v":""},{"$f":"IF(Schema!N522=\"\",\"\",Schema!N522)","v":"O"}]
[{"$f":"Schema!#REF!&Schema!#REF!&Schema!#REF!&Schema!#REF!","v":{"$error":"#REF!"}},{"$error":"#REF!"},{"$f":"IF(A64=\"\",\"\",IF(LEN(Schema!#REF!)=2,1,IF(LEN(Schema!#REF!)=2,10,IF(LEN(Schema!#REF!)=2,100,0))))","v":{"$error":"#REF!"}},{"$error":"#REF!"},{"$f":"IF(A64=\"\",\"\",SUM(Tabel2[[#This Row],[I1]:[I2]]))","v":{"$error":"#REF!"}},{"$error":"#REF!"},{"$error":"#REF!"},{"$error":"#REF!"},{"$error":"#REF!"},{"$f":"IF(C64=\"\",\"\",IF(LEN(Tabel2[[#This Row],[Entiteit of attribuut]])=2,\"\",Tabel2[[#This Row],[Entiteit]]&\"_\"&Tabel2[[#This Row],[Entiteit of attribuut]]))","v":{"$error":"#REF!"}},{"$f":"IF(Schema!#REF!=\"\",\"\",Schema!#REF!)","v":{"$error":"#REF!"}},{"$f":"IF(Schema!#REF!=\"\",\"\",Schema!#REF!)","v":{"$error":"#REF!"}},{"$f":"IF(Schema!#REF!=\"\",\"\",Schema!#REF!)","v":{"$error":"#REF!"}},{"$f":"IF(Schema!#REF!=\"\",\"\",Schema!#REF!)","v":{"$error":"#REF!"}},{"$f":"IF(Schema!#REF!=\"\",\"\",Schema!#REF!)","v":{"$error":"#REF!"}}]
[{"$f":"Schema!A523&Schema!B523&Schema!C523&Schema!D523","v":"GESLACH"},{"$error":"#REF!"},{"$f":"IF(A65=\"\",\"\",IF(LEN(Schema!A523)=2,1,IF(LEN(Schema!B523)=2,10,IF(LEN(Schema!C523)=2,100,0))))","v":0},{"$error":"#REF!"},{"$f":"IF(A65=\"\",\"\",SUM(Tabel2[[#This Row],[I1]:[I2]]))","v":{"$error":"#REF!"}},{"$error":"#REF!"},{"$error":"#REF!"},{"$error":"#REF!"},{"$error":"#REF!"},{"$f":"IF(C65=\"\",\"\",IF(LEN(Tabel2[[#This Row],[Entiteit of attribuut]])=2,\"\",Tabel2[[#This Row],[Entiteit]]&\"_\"&Tabel2[[#This Row],[Entiteit of attribuut]]))","v":{"$error":"#REF!"}},{"$f":"IF(Schema!I523=\"\",\"\",Schema!I523)","v":""},{"$f":"IF(Schema!J523=\"\",\"\",Schema!J523)","v":""},{"$f":"IF(Schema!K523=\"\",\"\",Schema!K523)","v":""},{"$f":"IF(Schema!L523=\"\",\"\",Schema!L523)","v":""},{"$f":"IF(Schema!N523=\"\",\"\",Schema!N523)","v":"O"}]
[{"$f":"Schema!#REF!&Schema!#REF!&Schema!#REF!&Schema!#REF!","v":{"$error":"#REF!"}},{"$error":"#REF!"},{"$f":"IF(A66=\"\",\"\",IF(LEN(Schema!#REF!)=2,1,IF(LEN(Schema!#REF!)=2,10,IF(LEN(Schema!#REF!)=2,100,0))))","v":{"$error":"#REF!"}},{"$error":"#REF!"},{"$f":"IF(A66=\"\",\"\",SUM(Tabel2[[#This Row],[I1]:[I2]]))","v":{"$error":"#REF!"}},{"$error":"#REF!"},{"$error":"#REF!"},{"$error":"#REF!"},{"$error":"#REF!"},{"$f":"IF(C66=\"\",\"\",IF(LEN(Tabel2[[#This Row],[Entiteit of attribuut]])=2,\"\",Tabel2[[#This Row],[Entiteit]]&\"_\"&Tabel2[[#This Row],[Entiteit of attribuut]]))","v":{"$error":"#REF!"}},{"$f":"IF(Schema!#REF!=\"\",\"\",Schema!#REF!)","v":{"$error":"#REF!"}},{"$f":"IF(Schema!#REF!=\"\",\"\",Schema!#REF!)","v":{"$error":"#REF!"}},{"$f":"IF(Schema!#REF!=\"\",\"\",Schema!#REF!)","v":{"$error":"#REF!"}},{"$f":"IF(Schema!#REF!=\"\",\"\",Schema!#REF!)","v":{"$error":"#REF!"}},{"$f":"IF(Schema!#REF!=\"\",\"\",Schema!#REF!)","v":{"$error":"#REF!"}}]
[{"$f":"Schema!#REF!&Schema!#REF!&Schema!#REF!&Schema!#REF!","v":{"$error":"#REF!"}},{"$f":"IF(LEN(A67)=2,A67,IF(A67=\"\",\"Leeg\",B66))","v":{"$error":"#REF!"}},{"$f":"IF(A67=\"\",\"\",IF(LEN(Schema!#REF!)=2,1,IF(LEN(Schema!#REF!)=2,10,IF(LEN(Schema!#REF!)=2,100,0))))","v":{"$error":"#REF!"}},{"$f":"IF(C67=0,D66,C67)","v":{"$error":"#REF!"}},{"$f":"IF(A67=\"\",\"\",SUM(Tabel2[[#This Row],[I1]:[I2]]))","v":{"$error":"#REF!"}},{"$f":"IF(A67=\"\",\"\",IF(C67=1,B67,F66))","v":{"$error":"#REF!"}},{"$f":"IF(C67=10,A67,IF(OR(C67=0,C67=100),G66,\"\"))","v":{"$error":"#REF!"}},{"$f":"IF(E67=200,B67,IF(C67=0,H66,\"\"))","v":{"$error":"#REF!"}},{"$f":"IF(C67=\"\",\"\",IF(OR(E67=1,E67=10,E67=100),I66,IF(E67=2,F67,IF(E67=20,F67&\"/\"&G67,IF(E67=200,F67&\"/\"&G67&\"/\"&H67)))))","v":{"$error":"#REF!"}},{"$f":"IF(C67=\"\",\"\",IF(LEN(Tabel2[[#This Row],[Entiteit of attribuut]])=2,\"\",Tabel2[[#This Row],[Entiteit]]&\"_\"&Tabel2[[#This Row],[Entiteit of attribuut]]))","v":{"$error":"#REF!"}},{"$f":"IF(Schema!#REF!=\"\",\"\",Schema!#REF!)","v":{"$error":"#REF!"}},{"$f":"IF(Schema!#REF!=\"\",\"\",Schema!#REF!)","v":{"$error":"#REF!"}},{"$f":"IF(Schema!#REF!=\"\",\"\",Schema!#REF!)","v":{"$error":"#REF!"}},{"$f":"IF(Schema!#REF!=\"\",\"\",Schema!#REF!)","v":{"$error":"#REF!"}},{"$f":"IF(Schema!#REF!=\"\",\"\",Schema!#REF!)","v":{"$error":"#REF!"}}]
[{"$f":"Schema!#REF!&Schema!#REF!&Schema!#REF!&Schema!#REF!","v":{"$error":"#REF!"}},{"$error":"#REF!"},{"$f":"IF(A68=\"\",\"\",IF(LEN(Schema!#REF!)=2,1,IF(LEN(Schema!#REF!)=2,10,IF(LEN(Schema!#REF!)=2,100,0))))","v":{"$error":"#REF!"}},{"$error":"#REF!"},{"$f":"IF(A68=\"\",\"\",SUM(Tabel2[[#This Row],[I1]:[I2]]))","v":{"$error":"#REF!"}},{"$error":"#REF!"},{"$error":"#REF!"},{"$error":"#REF!"},{"$error":"#REF!"},{"$f":"IF(C68=\"\",\"\",IF(LEN(Tabel2[[#This Row],[Entiteit of attribuut]])=2,\"\",Tabel2[[#This Row],[Entiteit]]&\"_\"&Tabel2[[#This Row],[Entiteit of attribuut]]))","v":{"$error":"#REF!"}},{"$f":"IF(Schema!#REF!=\"\",\"\",Schema!#REF!)","v":{"$error":"#REF!"}},{"$f":"IF(Schema!#REF!=\"\",\"\",Schema!#REF!)","v":{"$error":"#REF!"}},{"$f":"IF(Schema!#REF!=\"\",\"\",Schema!#REF!)","v":{"$error":"#REF!"}},{"$f":"IF(Schema!#REF!=\"\",\"\",Schema!#REF!)","v":{"$error":"#REF!"}},{"$f":"IF(Schema!#REF!=\"\",\"\",Schema!#REF!)","v":{"$error":"#REF!"}}]
[{"$f":"Schema!#REF!&Schema!#REF!&Schema!#REF!&Schema!#REF!","v":{"$error":"#REF!"}},{"$error":"#REF!"},{"$f":"IF(A69=\"\",\"\",IF(LEN(Schema!#REF!)=2,1,IF(LEN(Schema!#REF!)=2,10,IF(LEN(Schema!#REF!)=2,100,0))))","v":{"$error":"#REF!"}},{"$error":"#REF!"},{"$f":"IF(A69=\"\",\"\",SUM(Tabel2[[#This Row],[I1]:[I2]]))","v":{"$error":"#REF!"}},{"$error":"#REF!"},{"$error":"#REF!"},{"$error":"#REF!"},{"$error":"#REF!"},{"$f":"IF(C69=\"\",\"\",IF(LEN(Tabel2[[#This Row],[Entiteit of attribuut]])=2,\"\",Tabel2[[#This Row],[Entiteit]]&\"_\"&Tabel2[[#This Row],[Entiteit of attribuut]]))","v":{"$error":"#REF!"}},{"$f":"IF(Schema!#REF!=\"\",\"\",Schema!#REF!)","v":{"$error":"#REF!"}},{"$f":"IF(Schema!#REF!=\"\",\"\",Schema!#REF!)","v":{"$error":"#REF!"}},{"$f":"IF(Schema!#REF!=\"\",\"\",Schema!#REF!)","v":{"$error":"#REF!"}},{"$f":"IF(Schema!#REF!=\"\",\"\",Schema!#REF!)","v":{"$error":"#REF!"}},{"$f":"IF(Schema!#REF!=\"\",\"\",Schema!#REF!)","v":{"$error":"#REF!"}}]
[{"$f":"Schema!#REF!&Schema!#REF!&Schema!#REF!&Schema!#REF!","v":{"$error":"#REF!"}},{"$error":"#REF!"},{"$f":"IF(A70=\"\",\"\",IF(LEN(Schema!#REF!)=2,1,IF(LEN(Schema!#REF!)=2,10,IF(LEN(Schema!#REF!)=2,100,0))))","v":{"$error":"#REF!"}},{"$error":"#REF!"},{"$f":"IF(A70=\"\",\"\",SUM(Tabel2[[#This Row],[I1]:[I2]]))","v":{"$error":"#REF!"}},{"$error":"#REF!"},{"$error":"#REF!"},{"$error":"#REF!"},{"$error":"#REF!"},{"$f":"IF(C70=\"\",\"\",IF(LEN(Tabel2[[#This Row],[Entiteit of attribuut]])=2,\"\",Tabel2[[#This Row],[Entiteit]]&\"_\"&Tabel2[[#This Row],[Entiteit of attribuut]]))","v":{"$error":"#REF!"}},{"$f":"IF(Schema!#REF!=\"\",\"\",Schema!#REF!)","v":{"$error":"#REF!"}},{"$f":"IF(Schema!#REF!=\"\",\"\",Schema!#REF!)","v":{"$error":"#REF!"}},{"$f":"IF(Schema!#REF!=\"\",\"\",Schema!#REF!)","v":{"$error":"#REF!"}},{"$f":"IF(Schema!#REF!=\"\",\"\",Schema!#REF!)","v":{"$error":"#REF!"}},{"$f":"IF(Schema!#REF!=\"\",\"\",Schema!#REF!)","v":{"$error":"#REF!"}}]
[{"$f":"Schema!#REF!&Schema!#REF!&Schema!#REF!&Schema!#REF!","v":{"$error":"#REF!"}},{"$error":"#REF!"},{"$f":"IF(A71=\"\",\"\",IF(LEN(Schema!#REF!)=2,1,IF(LEN(Schema!#REF!)=2,10,IF(LEN(Schema!#REF!)=2,100,0))))","v":{"$error":"#REF!"}},{"$error":"#REF!"},{"$f":"IF(A71=\"\",\"\",SUM(Tabel2[[#This Row],[I1]:[I2]]))","v":{"$error":"#REF!"}},{"$error":"#REF!"},{"$error":"#REF!"},{"$error":"#REF!"},{"$error":"#REF!"},{"$f":"IF(C71=\"\",\"\",IF(LEN(Tabel2[[#This Row],[Entiteit of attribuut]])=2,\"\",Tabel2[[#This Row],[Entiteit]]&\"_\"&Tabel2[[#This Row],[Entiteit of attribuut]]))","v":{"$error":"#REF!"}},{"$f":"IF(Schema!#REF!=\"\",\"\",Schema!#REF!)","v":{"$error":"#REF!"}},{"$f":"IF(Schema!#REF!=\"\",\"\",Schema!#REF!)","v":{"$error":"#REF!"}},{"$f":"IF(Schema!#REF!=\"\",\"\",Schema!#REF!)","v":{"$error":"#REF!"}},{"$f":"IF(Schema!#REF!=\"\",\"\",Schema!#REF!)","v":{"$error":"#REF!"}},{"$f":"IF(Schema!#REF!=\"\",\"\",Schema!#REF!)","v":{"$error":"#REF!"}}]
[{"$f":"Schema!#REF!&Schema!#REF!&Schema!#REF!&Schema!#REF!","v":{"$error":"#REF!"}},{"$error":"#REF!"},{"$f":"IF(A72=\"\",\"\",IF(LEN(Schema!#REF!)=2,1,IF(LEN(Schema!#REF!)=2,10,IF(LEN(Schema!#REF!)=2,100,0))))","v":{"$error":"#REF!"}},{"$error":"#REF!"},{"$f":"IF(A72=\"\",\"\",SUM(Tabel2[[#This Row],[I1]:[I2]]))","v":{"$error":"#REF!"}},{"$error":"#REF!"},{"$error":"#REF!"},{"$error":"#REF!"},{"$error":"#REF!"},{"$f":"IF(C72=\"\",\"\",IF(LEN(Tabel2[[#This Row],[Entiteit of attribuut]])=2,\"\",Tabel2[[#This Row],[Entiteit]]&\"_\"&Tabel2[[#This Row],[Entiteit of attribuut]]))","v":{"$error":"#REF!"}},{"$f":"IF(Schema!#REF!=\"\",\"\",Schema!#REF!)","v":{"$error":"#REF!"}},{"$f":"IF(Schema!#REF!=\"\",\"\",Schema!#REF!)","v":{"$error":"#REF!"}},{"$f":"IF(Schema!#REF!=\"\",\"\",Schema!#REF!)","v":{"$error":"#REF!"}},{"$f":"IF(Schema!#REF!=\"\",\"\",Schema!#REF!)","v":{"$error":"#REF!"}},{"$f":"IF(Schema!#REF!=\"\",\"\",Schema!#REF!)","v":{"$error":"#REF!"}}]
[{"$f":"Schema!#REF!&Schema!#REF!&Schema!#REF!&Schema!#REF!","v":{"$error":"#REF!"}},{"$error":"#REF!"},{"$f":"IF(A73=\"\",\"\",IF(LEN(Schema!#REF!)=2,1,IF(LEN(Schema!#REF!)=2,10,IF(LEN(Schema!#REF!)=2,100,0))))","v":{"$error":"#REF!"}},{"$error":"#REF!"},{"$f":"IF(A73=\"\",\"\",SUM(Tabel2[[#This Row],[I1]:[I2]]))","v":{"$error":"#REF!"}},{"$error":"#REF!"},{"$error":"#REF!"},{"$error":"#REF!"},{"$error":"#REF!"},{"$f":"IF(C73=\"\",\"\",IF(LEN(Tabel2[[#This Row],[Entiteit of attribuut]])=2,\"\",Tabel2[[#This Row],[Entiteit]]&\"_\"&Tabel2[[#This Row],[Entiteit of attribuut]]))","v":{"$error":"#REF!"}},{"$f":"IF(Schema!#REF!=\"\",\"\",Schema!#REF!)","v":{"$error":"#REF!"}},{"$f":"IF(Schema!#REF!=\"\",\"\",Schema!#REF!)","v":{"$error":"#REF!"}},{"$f":"IF(Schema!#REF!=\"\",\"\",Schema!#REF!)","v":{"$error":"#REF!"}},{"$f":"IF(Schema!#REF!=\"\",\"\",Schema!#REF!)","v":{"$error":"#REF!"}},{"$f":"IF(Schema!#REF!=\"\",\"\",Schema!#REF!)","v":{"$error":"#REF!"}}]
[{"$f":"Schema!#REF!&Schema!#REF!&Schema!#REF!&Schema!#REF!","v":{"$error":"#REF!"}},{"$error":"#REF!"},{"$f":"IF(A74=\"\",\"\",IF(LEN(Schema!#REF!)=2,1,IF(LEN(Schema!#REF!)=2,10,IF(LEN(Schema!#REF!)=2,100,0))))","v":{"$error":"#REF!"}},{"$error":"#REF!"},{"$f":"IF(A74=\"\",\"\",SUM(Tabel2[[#This Row],[I1]:[I2]]))","v":{"$error":"#REF!"}},{"$error":"#REF!"},{"$error":"#REF!"},{"$error":"#REF!"},{"$error":"#REF!"},{"$f":"IF(C74=\"\",\"\",IF(LEN(Tabel2[[#This Row],[Entiteit of attribuut]])=2,\"\",Tabel2[[#This Row],[Entiteit]]&\"_\"&Tabel2[[#This Row],[Entiteit of attribuut]]))","v":{"$error":"#REF!"}},{"$f":"IF(Schema!#REF!=\"\",\"\",Schema!#REF!)","v":{"$error":"#REF!"}},{"$f":"IF(Schema!#REF!=\"\",\"\",Schema!#REF!)","v":{"$error":"#REF!"}},{"$f":"IF(Schema!#REF!=\"\",\"\",Schema!#REF!)","v":{"$error":"#REF!"}},{"$f":"IF(Schema!#REF!=\"\",\"\",Schema!#REF!)","v":{"$error":"#REF!"}},{"$f":"IF(Schema!#REF!=\"\",\"\",Schema!#REF!)","v":{"$error":"#REF!"}}]
[{"$f":"Schema!#REF!&Schema!#REF!&Schema!#REF!&Schema!#REF!","v":{"$error":"#REF!"}},{"$error":"#REF!"},{"$f":"IF(A75=\"\",\"\",IF(LEN(Schema!#REF!)=2,1,IF(LEN(Schema!#REF!)=2,10,IF(LEN(Schema!#REF!)=2,100,0))))","v":{"$error":"#REF!"}},{"$error":"#REF!"},{"$f":"IF(A75=\"\",\"\",SUM(Tabel2[[#This Row],[I1]:[I2]]))","v":{"$error":"#REF!"}},{"$error":"#REF!"},{"$error":"#REF!"},{"$error":"#REF!"},{"$error":"#REF!"},{"$f":"IF(C75=\"\",\"\",IF(LEN(Tabel2[[#This Row],[Entiteit of attribuut]])=2,\"\",Tabel2[[#This Row],[Entiteit]]&\"_\"&Tabel2[[#This Row],[Entiteit of attribuut]]))","v":{"$error":"#REF!"}},{"$f":"IF(Schema!#REF!=\"\",\"\",Schema!#REF!)","v":{"$error":"#REF!"}},{"$f":"IF(Schema!#REF!=\"\",\"\",Schema!#REF!)","v":{"$error":"#REF!"}},{"$f":"IF(Schema!#REF!=\"\",\"\",Schema!#REF!)","v":{"$error":"#REF!"}},{"$f":"IF(Schema!#REF!=\"\",\"\",Schema!#REF!)","v":{"$error":"#REF!"}},{"$f":"IF(Schema!#REF!=\"\",\"\",Schema!#REF!)","v":{"$error":"#REF!"}}]
[{"$f":"Schema!#REF!&Schema!#REF!&Schema!#REF!&Schema!#REF!","v":{"$error":"#REF!"}},{"$error":"#REF!"},{"$f":"IF(A76=\"\",\"\",IF(LEN(Schema!#REF!)=2,1,IF(LEN(Schema!#REF!)=2,10,IF(LEN(Schema!#REF!)=2,100,0))))","v":{"$error":"#REF!"}},{"$error":"#REF!"},{"$f":"IF(A76=\"\",\"\",SUM(Tabel2[[#This Row],[I1]:[I2]]))","v":{"$error":"#REF!"}},{"$error":"#REF!"},{"$error":"#REF!"},{"$error":"#REF!"},{"$error":"#REF!"},{"$f":"IF(C76=\"\",\"\",IF(LEN(Tabel2[[#This Row],[Entiteit of attribuut]])=2,\"\",Tabel2[[#This Row],[Entiteit]]&\"_\"&Tabel2[[#This Row],[Entiteit of attribuut]]))","v":{"$error":"#REF!"}},{"$f":"IF(Schema!#REF!=\"\",\"\",Schema!#REF!)","v":{"$error":"#REF!"}},{"$f":"IF(Schema!#REF!=\"\",\"\",Schema!#REF!)","v":{"$error":"#REF!"}},{"$f":"IF(Schema!#REF!=\"\",\"\",Schema!#REF!)","v":{"$error":"#REF!"}},{"$f":"IF(Schema!#REF!=\"\",\"\",Schema!#REF!)","v":{"$error":"#REF!"}},{"$f":"IF(Schema!#REF!=\"\",\"\",Schema!#REF!)","v":{"$error":"#REF!"}}]
[{"$f":"Schema!#REF!&Schema!#REF!&Schema!#REF!&Schema!#REF!","v":{"$error":"#REF!"}},{"$error":"#REF!"},{"$f":"IF(A77=\"\",\"\",IF(LEN(Schema!#REF!)=2,1,IF(LEN(Schema!#REF!)=2,10,IF(LEN(Schema!#REF!)=2,100,0))))","v":{"$error":"#REF!"}},{"$error":"#REF!"},{"$f":"IF(A77=\"\",\"\",SUM(Tabel2[[#This Row],[I1]:[I2]]))","v":{"$error":"#REF!"}},{"$error":"#REF!"},{"$error":"#REF!"},{"$error":"#REF!"},{"$error":"#REF!"},{"$f":"IF(C77=\"\",\"\",IF(LEN(Tabel2[[#This Row],[Entiteit of attribuut]])=2,\"\",Tabel2[[#This Row],[Entiteit]]&\"_\"&Tabel2[[#This Row],[Entiteit of attribuut]]))","v":{"$error":"#REF!"}},{"$f":"IF(Schema!#REF!=\"\",\"\",Schema!#REF!)","v":{"$error":"#REF!"}},{"$f":"IF(Schema!#REF!=\"\",\"\",Schema!#REF!)","v":{"$error":"#REF!"}},{"$f":"IF(Schema!#REF!=\"\",\"\",Schema!#REF!)","v":{"$error":"#REF!"}},{"$f":"IF(Schema!#REF!=\"\",\"\",Schema!#REF!)","v":{"$error":"#REF!"}},{"$f":"IF(Schema!#REF!=\"\",\"\",Schema!#REF!)","v":{"$error":"#REF!"}}]
[{"$f":"Schema!#REF!&Schema!#REF!&Schema!#REF!&Schema!#REF!","v":{"$error":"#REF!"}},{"$error":"#REF!"},{"$f":"IF(A78=\"\",\"\",IF(LEN(Schema!#REF!)=2,1,IF(LEN(Schema!#REF!)=2,10,IF(LEN(Schema!#REF!)=2,100,0))))","v":{"$error":"#REF!"}},{"$error":"#REF!"},{"$f":"IF(A78=\"\",\"\",SUM(Tabel2[[#This Row],[I1]:[I2]]))","v":{"$error":"#REF!"}},{"$error":"#REF!"},{"$error":"#REF!"},{"$error":"#REF!"},{"$error":"#REF!"},{"$f":"IF(C78=\"\",\"\",IF(LEN(Tabel2[[#This Row],[Entiteit of attribuut]])=2,\"\",Tabel2[[#This Row],[Entiteit]]&\"_\"&Tabel2[[#This Row],[Entiteit of attribuut]]))","v":{"$error":"#REF!"}},{"$f":"IF(Schema!#REF!=\"\",\"\",Schema!#REF!)","v":{"$error":"#REF!"}},{"$f":"IF(Schema!#REF!=\"\",\"\",Schema!#REF!)","v":{"$error":"#REF!"}},{"$f":"IF(Schema!#REF!=\"\",\"\",Schema!#REF!)","v":{"$error":"#REF!"}},{"$f":"IF(Schema!#REF!=\"\",\"\",Schema!#REF!)","v":{"$error":"#REF!"}},{"$f":"IF(Schema!#REF!=\"\",\"\",Schema!#REF!)","v":{"$error":"#REF!"}}]
[{"$f":"Schema!#REF!&Schema!#REF!&Schema!#REF!&Schema!#REF!","v":{"$error":"#REF!"}},{"$error":"#REF!"},{"$f":"IF(A79=\"\",\"\",IF(LEN(Schema!#REF!)=2,1,IF(LEN(Schema!#REF!)=2,10,IF(LEN(Schema!#REF!)=2,100,0))))","v":{"$error":"#REF!"}},{"$error":"#REF!"},{"$f":"IF(A79=\"\",\"\",SUM(Tabel2[[#This Row],[I1]:[I2]]))","v":{"$error":"#REF!"}},{"$error":"#REF!"},{"$error":"#REF!"},{"$error":"#REF!"},{"$error":"#REF!"},{"$f":"IF(C79=\"\",\"\",IF(LEN(Tabel2[[#This Row],[Entiteit of attribuut]])=2,\"\",Tabel2[[#This Row],[Entiteit]]&\"_\"&Tabel2[[#This Row],[Entiteit of attribuut]]))","v":{"$error":"#REF!"}},{"$f":"IF(Schema!#REF!=\"\",\"\",Schema!#REF!)","v":{"$error":"#REF!"}},{"$f":"IF(Schema!#REF!=\"\",\"\",Schema!#REF!)","v":{"$error":"#REF!"}},{"$f":"IF(Schema!#REF!=\"\",\"\",Schema!#REF!)","v":{"$error":"#REF!"}},{"$f":"IF(Schema!#REF!=\"\",\"\",Schema!#REF!)","v":{"$error":"#REF!"}},{"$f":"IF(Schema!#REF!=\"\",\"\",Schema!#REF!)","v":{"$error":"#REF!"}}]
[{"$f":"Schema!#REF!&Schema!#REF!&Schema!#REF!&Schema!#REF!","v":{"$error":"#REF!"}},{"$error":"#REF!"},{"$f":"IF(A80=\"\",\"\",IF(LEN(Schema!#REF!)=2,1,IF(LEN(Schema!#REF!)=2,10,IF(LEN(Schema!#REF!)=2,100,0))))","v":{"$error":"#REF!"}},{"$error":"#REF!"},{"$f":"IF(A80=\"\",\"\",SUM(Tabel2[[#This Row],[I1]:[I2]]))","v":{"$error":"#REF!"}},{"$error":"#REF!"},{"$error":"#REF!"},{"$error":"#REF!"},{"$error":"#REF!"},{"$f":"IF(C80=\"\",\"\",IF(LEN(Tabel2[[#This Row],[Entiteit of attribuut]])=2,\"\",Tabel2[[#This Row],[Entiteit]]&\"_\"&Tabel2[[#This Row],[Entiteit of attribuut]]))","v":{"$error":"#REF!"}},{"$f":"IF(Schema!#REF!=\"\",\"\",Schema!#REF!)","v":{"$error":"#REF!"}},{"$f":"IF(Schema!#REF!=\"\",\"\",Schema!#REF!)","v":{"$error":"#REF!"}},{"$f":"IF(Schema!#REF!=\"\",\"\",Schema!#REF!)","v":{"$error":"#REF!"}},{"$f":"IF(Schema!#REF!=\"\",\"\",Schema!#REF!)","v":{"$error":"#REF!"}},{"$f":"IF(Schema!#REF!=\"\",\"\",Schema!#REF!)","v":{"$error":"#REF!"}}]
[{"$f":"Schema!#REF!&Schema!#REF!&Schema!#REF!&Schema!#REF!","v":{"$error":"#REF!"}},{"$error":"#REF!"},{"$f":"IF(A81=\"\",\"\",IF(LEN(Schema!#REF!)=2,1,IF(LEN(Schema!#REF!)=2,10,IF(LEN(Schema!#REF!)=2,100,0))))","v":{"$error":"#REF!"}},{"$error":"#REF!"},{"$f":"IF(A81=\"\",\"\",SUM(Tabel2[[#This Row],[I1]:[I2]]))","v":{"$error":"#REF!"}},{"$error":"#REF!"},{"$error":"#REF!"},{"$error":"#REF!"},{"$error":"#REF!"},{"$f":"IF(C81=\"\",\"\",IF(LEN(Tabel2[[#This Row],[Entiteit of attribuut]])=2,\"\",Tabel2[[#This Row],[Entiteit]]&\"_\"&Tabel2[[#This Row],[Entiteit of attribuut]]))","v":{"$error":"#REF!"}},{"$f":"IF(Schema!#REF!=\"\",\"\",Schema!#REF!)","v":{"$error":"#REF!"}},{"$f":"IF(Schema!#REF!=\"\",\"\",Schema!#REF!)","v":{"$error":"#REF!"}},{"$f":"IF(Schema!#REF!=\"\",\"\",Schema!#REF!)","v":{"$error":"#REF!"}},{"$f":"IF(Schema!#REF!=\"\",\"\",Schema!#REF!)","v":{"$error":"#REF!"}},{"$f":"IF(Schema!#REF!=\"\",\"\",Schema!#REF!)","v":{"$error":"#REF!"}}]
[{"$f":"Schema!#REF!&Schema!#REF!&Schema!#REF!&Schema!#REF!","v":{"$error":"#REF!"}},{"$error":"#REF!"},{"$f":"IF(A82=\"\",\"\",IF(LEN(Schema!#REF!)=2,1,IF(LEN(Schema!#REF!)=2,10,IF(LEN(Schema!#REF!)=2,100,0))))","v":{"$error":"#REF!"}},{"$error":"#REF!"},{"$f":"IF(A82=\"\",\"\",SUM(Tabel2[[#This Row],[I1]:[I2]]))","v":{"$error":"#REF!"}},{"$error":"#REF!"},{"$error":"#REF!"},{"$error":"#REF!"},{"$error":"#REF!"},{"$f":"IF(C82=\"\",\"\",IF(LEN(Tabel2[[#This Row],[Entiteit of attribuut]])=2,\"\",Tabel2[[#This Row],[Entiteit]]&\"_\"&Tabel2[[#This Row],[Entiteit of attribuut]]))","v":{"$error":"#REF!"}},{"$f":"IF(Schema!#REF!=\"\",\"\",Schema!#REF!)","v":{"$error":"#REF!"}},{"$f":"IF(Schema!#REF!=\"\",\"\",Schema!#REF!)","v":{"$error":"#REF!"}},{"$f":"IF(Schema!#REF!=\"\",\"\",Schema!#REF!)","v":{"$error":"#REF!"}},{"$f":"IF(Schema!#REF!=\"\",\"\",Schema!#REF!)","v":{"$error":"#REF!"}},{"$f":"IF(Schema!#REF!=\"\",\"\",Schema!#REF!)","v":{"$error":"#REF!"}}]
[{"$f":"Schema!#REF!&Schema!#REF!&Schema!#REF!&Schema!#REF!","v":{"$error":"#REF!"}},{"$error":"#REF!"},{"$f":"IF(A83=\"\",\"\",IF(LEN(Schema!#REF!)=2,1,IF(LEN(Schema!#REF!)=2,10,IF(LEN(Schema!#REF!)=2,100,0))))","v":{"$error":"#REF!"}},{"$error":"#REF!"},{"$f":"IF(A83=\"\",\"\",SUM(Tabel2[[#This Row],[I1]:[I2]]))","v":{"$error":"#REF!"}},{"$error":"#REF!"},{"$error":"#REF!"},{"$error":"#REF!"},{"$error":"#REF!"},{"$f":"IF(C83=\"\",\"\",IF(LEN(Tabel2[[#This Row],[Entiteit of attribuut]])=2,\"\",Tabel2[[#This Row],[Entiteit]]&\"_\"&Tabel2[[#This Row],[Entiteit of attribuut]]))","v":{"$error":"#REF!"}},{"$f":"IF(Schema!#REF!=\"\",\"\",Schema!#REF!)","v":{"$error":"#REF!"}},{"$f":"IF(Schema!#REF!=\"\",\"\",Schema!#REF!)","v":{"$error":"#REF!"}},{"$f":"IF(Schema!#REF!=\"\",\"\",Schema!#REF!)","v":{"$error":"#REF!"}},{"$f":"IF(Schema!#REF!=\"\",\"\",Schema!#REF!)","v":{"$error":"#REF!"}},{"$f":"IF(Schema!#REF!=\"\",\"\",Schema!#REF!)","v":{"$error":"#REF!"}}]
[{"$f":"Schema!#REF!&Schema!#REF!&Schema!#REF!&Schema!#REF!","v":{"$error":"#REF!"}},{"$error":"#REF!"},{"$f":"IF(A84=\"\",\"\",IF(LEN(Schema!#REF!)=2,1,IF(LEN(Schema!#REF!)=2,10,IF(LEN(Schema!#REF!)=2,100,0))))","v":{"$error":"#REF!"}},{"$error":"#REF!"},{"$f":"IF(A84=\"\",\"\",SUM(Tabel2[[#This Row],[I1]:[I2]]))","v":{"$error":"#REF!"}},{"$error":"#REF!"},{"$error":"#REF!"},{"$error":"#REF!"},{"$error":"#REF!"},{"$f":"IF(C84=\"\",\"\",IF(LEN(Tabel2[[#This Row],[Entiteit of attribuut]])=2,\"\",Tabel2[[#This Row],[Entiteit]]&\"_\"&Tabel2[[#This Row],[Entiteit of attribuut]]))","v":{"$error":"#REF!"}},{"$f":"IF(Schema!#REF!=\"\",\"\",Schema!#REF!)","v":{"$error":"#REF!"}},{"$f":"IF(Schema!#REF!=\"\",\"\",Schema!#REF!)","v":{"$error":"#REF!"}},{"$f":"IF(Schema!#REF!=\"\",\"\",Schema!#REF!)","v":{"$error":"#REF!"}},{"$f":"IF(Schema!#REF!=\"\",\"\",Schema!#REF!)","v":{"$error":"#REF!"}},{"$f":"IF(Schema!#REF!=\"\",\"\",Schema!#REF!)","v":{"$error":"#REF!"}}]
[{"$f":"Schema!#REF!&Schema!#REF!&Schema!#REF!&Schema!#REF!","v":{"$error":"#REF!"}},{"$error":"#REF!"},{"$f":"IF(A85=\"\",\"\",IF(LEN(Schema!#REF!)=2,1,IF(LEN(Schema!#REF!)=2,10,IF(LEN(Schema!#REF!)=2,100,0))))","v":{"$error":"#REF!"}},{"$error":"#REF!"},{"$f":"IF(A85=\"\",\"\",SUM(Tabel2[[#This Row],[I1]:[I2]]))","v":{"$error":"#REF!"}},{"$error":"#REF!"},{"$error":"#REF!"},{"$error":"#REF!"},{"$error":"#REF!"},{"$f":"IF(C85=\"\",\"\",IF(LEN(Tabel2[[#This Row],[Entiteit of attribuut]])=2,\"\",Tabel2[[#This Row],[Entiteit]]&\"_\"&Tabel2[[#This Row],[Entiteit of attribuut]]))","v":{"$error":"#REF!"}},{"$f":"IF(Schema!#REF!=\"\",\"\",Schema!#REF!)","v":{"$error":"#REF!"}},{"$f":"IF(Schema!#REF!=\"\",\"\",Schema!#REF!)","v":{"$error":"#REF!"}},{"$f":"IF(Schema!#REF!=\"\",\"\",Schema!#REF!)","v":{"$error":"#REF!"}},{"$f":"IF(Schema!#REF!=\"\",\"\",Schema!#REF!)","v":{"$error":"#REF!"}},{"$f":"IF(Schema!#REF!=\"\",\"\",Schema!#REF!)","v":{"$error":"#REF!"}}]
[{"$f":"Schema!#REF!&Schema!#REF!&Schema!#REF!&Schema!#REF!","v":{"$error":"#REF!"}},{"$error":"#REF!"},{"$f":"IF(A86=\"\",\"\",IF(LEN(Schema!#REF!)=2,1,IF(LEN(Schema!#REF!)=2,10,IF(LEN(Schema!#REF!)=2,100,0))))","v":{"$error":"#REF!"}},{"$error":"#REF!"},{"$f":"IF(A86=\"\",\"\",SUM(Tabel2[[#This Row],[I1]:[I2]]))","v":{"$error":"#REF!"}},{"$error":"#REF!"},{"$error":"#REF!"},{"$error":"#REF!"},{"$error":"#REF!"},{"$f":"IF(C86=\"\",\"\",IF(LEN(Tabel2[[#This Row],[Entiteit of attribuut]])=2,\"\",Tabel2[[#This Row],[Entiteit]]&\"_\"&Tabel2[[#This Row],[Entiteit of attribuut]]))","v":{"$error":"#REF!"}},{"$f":"IF(Schema!#REF!=\"\",\"\",Schema!#REF!)","v":{"$error":"#REF!"}},{"$f":"IF(Schema!#REF!=\"\",\"\",Schema!#REF!)","v":{"$error":"#REF!"}},{"$f":"IF(Schema!#REF!=\"\",\"\",Schema!#REF!)","v":{"$error":"#REF!"}},{"$f":"IF(Schema!#REF!=\"\",\"\",Schema!#REF!)","v":{"$error":"#REF!"}},{"$f":"IF(Schema!#REF!=\"\",\"\",Schema!#REF!)","v":{"$error":"#REF!"}}]
[{"$f":"Schema!#REF!&Schema!#REF!&Schema!#REF!&Schema!#REF!","v":{"$error":"#REF!"}},{"$error":"#REF!"},{"$f":"IF(A87=\"\",\"\",IF(LEN(Schema!#REF!)=2,1,IF(LEN(Schema!#REF!)=2,10,IF(LEN(Schema!#REF!)=2,100,0))))","v":{"$error":"#REF!"}},{"$error":"#REF!"},{"$f":"IF(A87=\"\",\"\",SUM(Tabel2[[#This Row],[I1]:[I2]]))","v":{"$error":"#REF!"}},{"$error":"#REF!"},{"$error":"#REF!"},{"$error":"#REF!"},{"$error":"#REF!"},{"$f":"IF(C87=\"\",\"\",IF(LEN(Tabel2[[#This Row],[Entiteit of attribuut]])=2,\"\",Tabel2[[#This Row],[Entiteit]]&\"_\"&Tabel2[[#This Row],[Entiteit of attribuut]]))","v":{"$error":"#REF!"}},{"$f":"IF(Schema!#REF!=\"\",\"\",Schema!#REF!)","v":{"$error":"#REF!"}},{"$f":"IF(Schema!#REF!=\"\",\"\",Schema!#REF!)","v":{"$error":"#REF!"}},{"$f":"IF(Schema!#REF!=\"\",\"\",Schema!#REF!)","v":{"$error":"#REF!"}},{"$f":"IF(Schema!#REF!=\"\",\"\",Schema!#REF!)","v":{"$error":"#REF!"}},{"$f":"IF(Schema!#REF!=\"\",\"\",Schema!#REF!)","v":{"$error":"#REF!"}}]
[{"$f":"Schema!#REF!&Schema!#REF!&Schema!#REF!&Schema!#REF!","v":{"$error":"#REF!"}},{"$error":"#REF!"},{"$f":"IF(A88=\"\",\"\",IF(LEN(Schema!#REF!)=2,1,IF(LEN(Schema!#REF!)=2,10,IF(LEN(Schema!#REF!)=2,100,0))))","v":{"$error":"#REF!"}},{"$error":"#REF!"},{"$f":"IF(A88=\"\",\"\",SUM(Tabel2[[#This Row],[I1]:[I2]]))","v":{"$error":"#REF!"}},{"$error":"#REF!"},{"$error":"#REF!"},{"$error":"#REF!"},{"$error":"#REF!"},{"$f":"IF(C88=\"\",\"\",IF(LEN(Tabel2[[#This Row],[Entiteit of attribuut]])=2,\"\",Tabel2[[#This Row],[Entiteit]]&\"_\"&Tabel2[[#This Row],[Entiteit of attribuut]]))","v":{"$error":"#REF!"}},{"$f":"IF(Schema!#REF!=\"\",\"\",Schema!#REF!)","v":{"$error":"#REF!"}},{"$f":"IF(Schema!#REF!=\"\",\"\",Schema!#REF!)","v":{"$error":"#REF!"}},{"$f":"IF(Schema!#REF!=\"\",\"\",Schema!#REF!)","v":{"$error":"#REF!"}},{"$f":"IF(Schema!#REF!=\"\",\"\",Schema!#REF!)","v":{"$error":"#REF!"}},{"$f":"IF(Schema!#REF!=\"\",\"\",Schema!#REF!)","v":{"$error":"#REF!"}}]
[{"$f":"Schema!#REF!&Schema!#REF!&Schema!#REF!&Schema!#REF!","v":{"$error":"#REF!"}},{"$error":"#REF!"},{"$f":"IF(A89=\"\",\"\",IF(LEN(Schema!#REF!)=2,1,IF(LEN(Schema!#REF!)=2,10,IF(LEN(Schema!#REF!)=2,100,0))))","v":{"$error":"#REF!"}},{"$error":"#REF!"},{"$f":"IF(A89=\"\",\"\",SUM(Tabel2[[#This Row],[I1]:[I2]]))","v":{"$error":"#REF!"}},{"$error":"#REF!"},{"$error":"#REF!"},{"$error":"#REF!"},{"$error":"#REF!"},{"$f":"IF(C89=\"\",\"\",IF(LEN(Tabel2[[#This Row],[Entiteit of attribuut]])=2,\"\",Tabel2[[#This Row],[Entiteit]]&\"_\"&Tabel2[[#This Row],[Entiteit of attribuut]]))","v":{"$error":"#REF!"}},{"$f":"IF(Schema!#REF!=\"\",\"\",Schema!#REF!)","v":{"$error":"#REF!"}},{"$f":"IF(Schema!#REF!=\"\",\"\",Schema!#REF!)","v":{"$error":"#REF!"}},{"$f":"IF(Schema!#REF!=\"\",\"\",Schema!#REF!)","v":{"$error":"#REF!"}},{"$f":"IF(Schema!#REF!=\"\",\"\",Schema!#REF!)","v":{"$error":"#REF!"}},{"$f":"IF(Schema!#REF!=\"\",\"\",Schema!#REF!)","v":{"$error":"#REF!"}}]
[{"$f":"Schema!#REF!&Schema!#REF!&Schema!#REF!&Schema!#REF!","v":{"$error":"#REF!"}},{"$error":"#REF!"},{"$f":"IF(A90=\"\",\"\",IF(LEN(Schema!#REF!)=2,1,IF(LEN(Schema!#REF!)=2,10,IF(LEN(Schema!#REF!)=2,100,0))))","v":{"$error":"#REF!"}},{"$error":"#REF!"},{"$f":"IF(A90=\"\",\"\",SUM(Tabel2[[#This Row],[I1]:[I2]]))","v":{"$error":"#REF!"}},{"$error":"#REF!"},{"$error":"#REF!"},{"$error":"#REF!"},{"$error":"#REF!"},{"$f":"IF(C90=\"\",\"\",IF(LEN(Tabel2[[#This Row],[Entiteit of attribuut]])=2,\"\",Tabel2[[#This Row],[Entiteit]]&\"_\"&Tabel2[[#This Row],[Entiteit of attribuut]]))","v":{"$error":"#REF!"}},{"$f":"IF(Schema!#REF!=\"\",\"\",Schema!#REF!)","v":{"$error":"#REF!"}},{"$f":"IF(Schema!#REF!=\"\",\"\",Schema!#REF!)","v":{"$error":"#REF!"}},{"$f":"IF(Schema!#REF!=\"\",\"\",Schema!#REF!)","v":{"$error":"#REF!"}},{"$f":"IF(Schema!#REF!=\"\",\"\",Schema!#REF!)","v":{"$error":"#REF!"}},{"$f":"IF(Schema!#REF!=\"\",\"\",Schema!#REF!)","v":{"$error":"#REF!"}}]
[{"$f":"Schema!#REF!&Schema!#REF!&Schema!#REF!&Schema!#REF!","v":{"$error":"#REF!"}},{"$error":"#REF!"},{"$f":"IF(A91=\"\",\"\",IF(LEN(Schema!#REF!)=2,1,IF(LEN(Schema!#REF!)=2,10,IF(LEN(Schema!#REF!)=2,100,0))))","v":{"$error":"#REF!"}},{"$error":"#REF!"},{"$f":"IF(A91=\"\",\"\",SUM(Tabel2[[#This Row],[I1]:[I2]]))","v":{"$error":"#REF!"}},{"$error":"#REF!"},{"$error":"#REF!"},{"$error":"#REF!"},{"$error":"#REF!"},{"$f":"IF(C91=\"\",\"\",IF(LEN(Tabel2[[#This Row],[Entiteit of attribuut]])=2,\"\",Tabel2[[#This Row],[Entiteit]]&\"_\"&Tabel2[[#This Row],[Entiteit of attribuut]]))","v":{"$error":"#REF!"}},{"$f":"IF(Schema!#REF!=\"\",\"\",Schema!#REF!)","v":{"$error":"#REF!"}},{"$f":"IF(Schema!#REF!=\"\",\"\",Schema!#REF!)","v":{"$error":"#REF!"}},{"$f":"IF(Schema!#REF!=\"\",\"\",Schema!#REF!)","v":{"$error":"#REF!"}},{"$f":"IF(Schema!#REF!=\"\",\"\",Schema!#REF!)","v":{"$error":"#REF!"}},{"$f":"IF(Schema!#REF!=\"\",\"\",Schema!#REF!)","v":{"$error":"#REF!"}}]
[{"$f":"Schema!#REF!&Schema!#REF!&Schema!#REF!&Schema!#REF!","v":{"$error":"#REF!"}},{"$error":"#REF!"},{"$f":"IF(A92=\"\",\"\",IF(LEN(Schema!#REF!)=2,1,IF(LEN(Schema!#REF!)=2,10,IF(LEN(Schema!#REF!)=2,100,0))))","v":{"$error":"#REF!"}},{"$error":"#REF!"},{"$f":"IF(A92=\"\",\"\",SUM(Tabel2[[#This Row],[I1]:[I2]]))","v":{"$error":"#REF!"}},{"$error":"#REF!"},{"$error":"#REF!"},{"$error":"#REF!"},{"$error":"#REF!"},{"$f":"IF(C92=\"\",\"\",IF(LEN(Tabel2[[#This Row],[Entiteit of attribuut]])=2,\"\",Tabel2[[#This Row],[Entiteit]]&\"_\"&Tabel2[[#This Row],[Entiteit of attribuut]]))","v":{"$error":"#REF!"}},{"$f":"IF(Schema!#REF!=\"\",\"\",Schema!#REF!)","v":{"$error":"#REF!"}},{"$f":"IF(Schema!#REF!=\"\",\"\",Schema!#REF!)","v":{"$error":"#REF!"}},{"$f":"IF(Schema!#REF!=\"\",\"\",Schema!#REF!)","v":{"$error":"#REF!"}},{"$f":"IF(Schema!#REF!=\"\",\"\",Schema!#REF!)","v":{"$error":"#REF!"}},{"$f":"IF(Schema!#REF!=\"\",\"\",Schema!#REF!)","v":{"$error":"#REF!"}}]
[{"$f":"Schema!#REF!&Schema!#REF!&Schema!#REF!&Schema!#REF!","v":{"$error":"#REF!"}},{"$error":"#REF!"},{"$f":"IF(A93=\"\",\"\",IF(LEN(Schema!#REF!)=2,1,IF(LEN(Schema!#REF!)=2,10,IF(LEN(Schema!#REF!)=2,100,0))))","v":{"$error":"#REF!"}},{"$error":"#REF!"},{"$f":"IF(A93=\"\",\"\",SUM(Tabel2[[#This Row],[I1]:[I2]]))","v":{"$error":"#REF!"}},{"$error":"#REF!"},{"$error":"#REF!"},{"$error":"#REF!"},{"$error":"#REF!"},{"$f":"IF(C93=\"\",\"\",IF(LEN(Tabel2[[#This Row],[Entiteit of attribuut]])=2,\"\",Tabel2[[#This Row],[Entiteit]]&\"_\"&Tabel2[[#This Row],[Entiteit of attribuut]]))","v":{"$error":"#REF!"}},{"$f":"IF(Schema!#REF!=\"\",\"\",Schema!#REF!)","v":{"$error":"#REF!"}},{"$f":"IF(Schema!#REF!=\"\",\"\",Schema!#REF!)","v":{"$error":"#REF!"}},{"$f":"IF(Schema!#REF!=\"\",\"\",Schema!#REF!)","v":{"$error":"#REF!"}},{"$f":"IF(Schema!#REF!=\"\",\"\",Schema!#REF!)","v":{"$error":"#REF!"}},{"$f":"IF(Schema!#REF!=\"\",\"\",Schema!#REF!)","v":{"$error":"#REF!"}}]
[{"$f":"Schema!#REF!&Schema!#REF!&Schema!#REF!&Schema!#REF!","v":{"$error":"#REF!"}},{"$error":"#REF!"},{"$f":"IF(A94=\"\",\"\",IF(LEN(Schema!#REF!)=2,1,IF(LEN(Schema!#REF!)=2,10,IF(LEN(Schema!#REF!)=2,100,0))))","v":{"$error":"#REF!"}},{"$error":"#REF!"},{"$f":"IF(A94=\"\",\"\",SUM(Tabel2[[#This Row],[I1]:[I2]]))","v":{"$error":"#REF!"}},{"$error":"#REF!"},{"$error":"#REF!"},{"$error":"#REF!"},{"$error":"#REF!"},{"$f":"IF(C94=\"\",\"\",IF(LEN(Tabel2[[#This Row],[Entiteit of attribuut]])=2,\"\",Tabel2[[#This Row],[Entiteit]]&\"_\"&Tabel2[[#This Row],[Entiteit of attribuut]]))","v":{"$error":"#REF!"}},{"$f":"IF(Schema!#REF!=\"\",\"\",Schema!#REF!)","v":{"$error":"#REF!"}},{"$f":"IF(Schema!#REF!=\"\",\"\",Schema!#REF!)","v":{"$error":"#REF!"}},{"$f":"IF(Schema!#REF!=\"\",\"\",Schema!#REF!)","v":{"$error":"#REF!"}},{"$f":"IF(Schema!#REF!=\"\",\"\",Schema!#REF!)","v":{"$error":"#REF!"}},{"$f":"IF(Schema!#REF!=\"\",\"\",Schema!#REF!)","v":{"$error":"#REF!"}}]
[{"$f":"Schema!#REF!&Schema!#REF!&Schema!#REF!&Schema!#REF!","v":{"$error":"#REF!"}},{"$error":"#REF!"},{"$f":"IF(A95=\"\",\"\",IF(LEN(Schema!#REF!)=2,1,IF(LEN(Schema!#REF!)=2,10,IF(LEN(Schema!#REF!)=2,100,0))))","v":{"$error":"#REF!"}},{"$error":"#REF!"},{"$f":"IF(A95=\"\",\"\",SUM(Tabel2[[#This Row],[I1]:[I2]]))","v":{"$error":"#REF!"}},{"$error":"#REF!"},{"$error":"#REF!"},{"$error":"#REF!"},{"$error":"#REF!"},{"$f":"IF(C95=\"\",\"\",IF(LEN(Tabel2[[#This Row],[Entiteit of attribuut]])=2,\"\",Tabel2[[#This Row],[Entiteit]]&\"_\"&Tabel2[[#This Row],[Entiteit of attribuut]]))","v":{"$error":"#REF!"}},{"$f":"IF(Schema!#REF!=\"\",\"\",Schema!#REF!)","v":{"$error":"#REF!"}},{"$f":"IF(Schema!#REF!=\"\",\"\",Schema!#REF!)","v":{"$error":"#REF!"}},{"$f":"IF(Schema!#REF!=\"\",\"\",Schema!#REF!)","v":{"$error":"#REF!"}},{"$f":"IF(Schema!#REF!=\"\",\"\",Schema!#REF!)","v":{"$error":"#REF!"}},{"$f":"IF(Schema!#REF!=\"\",\"\",Schema!#REF!)","v":{"$error":"#REF!"}}]
[{"$f":"Schema!#REF!&Schema!#REF!&Schema!#REF!&Schema!#REF!","v":{"$error":"#REF!"}},{"$error":"#REF!"},{"$f":"IF(A96=\"\",\"\",IF(LEN(Schema!#REF!)=2,1,IF(LEN(Schema!#REF!)=2,10,IF(LEN(Schema!#REF!)=2,100,0))))","v":{"$error":"#REF!"}},{"$error":"#REF!"},{"$f":"IF(A96=\"\",\"\",SUM(Tabel2[[#This Row],[I1]:[I2]]))","v":{"$error":"#REF!"}},{"$error":"#REF!"},{"$error":"#REF!"},{"$error":"#REF!"},{"$error":"#REF!"},{"$f":"IF(C96=\"\",\"\",IF(LEN(Tabel2[[#This Row],[Entiteit of attribuut]])=2,\"\",Tabel2[[#This Row],[Entiteit]]&\"_\"&Tabel2[[#This Row],[Entiteit of attribuut]]))","v":{"$error":"#REF!"}},{"$f":"IF(Schema!#REF!=\"\",\"\",Schema!#REF!)","v":{"$error":"#REF!"}},{"$f":"IF(Schema!#REF!=\"\",\"\",Schema!#REF!)","v":{"$error":"#REF!"}},{"$f":"IF(Schema!#REF!=\"\",\"\",Schema!#REF!)","v":{"$error":"#REF!"}},{"$f":"IF(Schema!#REF!=\"\",\"\",Schema!#REF!)","v":{"$error":"#REF!"}},{"$f":"IF(Schema!#REF!=\"\",\"\",Schema!#REF!)","v":{"$error":"#REF!"}}]
[{"$f":"Schema!#REF!&Schema!#REF!&Schema!#REF!&Schema!#REF!","v":{"$error":"#REF!"}},{"$error":"#REF!"},{"$f":"IF(A97=\"\",\"\",IF(LEN(Schema!#REF!)=2,1,IF(LEN(Schema!#REF!)=2,10,IF(LEN(Schema!#REF!)=2,100,0))))","v":{"$error":"#REF!"}},{"$error":"#REF!"},{"$f":"IF(A97=\"\",\"\",SUM(Tabel2[[#This Row],[I1]:[I2]]))","v":{"$error":"#REF!"}},{"$error":"#REF!"},{"$error":"#REF!"},{"$error":"#REF!"},{"$error":"#REF!"},{"$f":"IF(C97=\"\",\"\",IF(LEN(Tabel2[[#This Row],[Entiteit of attribuut]])=2,\"\",Tabel2[[#This Row],[Entiteit]]&\"_\"&Tabel2[[#This Row],[Entiteit of attribuut]]))","v":{"$error":"#REF!"}},{"$f":"IF(Schema!#REF!=\"\",\"\",Schema!#REF!)","v":{"$error":"#REF!"}},{"$f":"IF(Schema!#REF!=\"\",\"\",Schema!#REF!)","v":{"$error":"#REF!"}},{"$f":"IF(Schema!#REF!=\"\",\"\",Schema!#REF!)","v":{"$error":"#REF!"}},{"$f":"IF(Schema!#REF!=\"\",\"\",Schema!#REF!)","v":{"$error":"#REF!"}},{"$f":"IF(Schema!#REF!=\"\",\"\",Schema!#REF!)","v":{"$error":"#REF!"}}]
[{"$f":"Schema!#REF!&Schema!#REF!&Schema!#REF!&Schema!#REF!","v":{"$error":"#REF!"}},{"$error":"#REF!"},{"$f":"IF(A98=\"\",\"\",IF(LEN(Schema!#REF!)=2,1,IF(LEN(Schema!#REF!)=2,10,IF(LEN(Schema!#REF!)=2,100,0))))","v":{"$error":"#REF!"}},{"$error":"#REF!"},{"$f":"IF(A98=\"\",\"\",SUM(Tabel2[[#This Row],[I1]:[I2]]))","v":{"$error":"#REF!"}},{"$error":"#REF!"},{"$error":"#REF!"},{"$error":"#REF!"},{"$error":"#REF!"},{"$f":"IF(C98=\"\",\"\",IF(LEN(Tabel2[[#This Row],[Entiteit of attribuut]])=2,\"\",Tabel2[[#This Row],[Entiteit]]&\"_\"&Tabel2[[#This Row],[Entiteit of attribuut]]))","v":{"$error":"#REF!"}},{"$f":"IF(Schema!#REF!=\"\",\"\",Schema!#REF!)","v":{"$error":"#REF!"}},{"$f":"IF(Schema!#REF!=\"\",\"\",Schema!#REF!)","v":{"$error":"#REF!"}},{"$f":"IF(Schema!#REF!=\"\",\"\",Schema!#REF!)","v":{"$error":"#REF!"}},{"$f":"IF(Schema!#REF!=\"\",\"\",Schema!#REF!)","v":{"$error":"#REF!"}},{"$f":"IF(Schema!#REF!=\"\",\"\",Schema!#REF!)","v":{"$error":"#REF!"}}]
[{"$f":"Schema!#REF!&Schema!#REF!&Schema!#REF!&Schema!#REF!","v":{"$error":"#REF!"}},{"$error":"#REF!"},{"$f":"IF(A99=\"\",\"\",IF(LEN(Schema!#REF!)=2,1,IF(LEN(Schema!#REF!)=2,10,IF(LEN(Schema!#REF!)=2,100,0))))","v":{"$error":"#REF!"}},{"$error":"#REF!"},{"$f":"IF(A99=\"\",\"\",SUM(Tabel2[[#This Row],[I1]:[I2]]))","v":{"$error":"#REF!"}},{"$error":"#REF!"},{"$error":"#REF!"},{"$error":"#REF!"},{"$error":"#REF!"},{"$f":"IF(C99=\"\",\"\",IF(LEN(Tabel2[[#This Row],[Entiteit of attribuut]])=2,\"\",Tabel2[[#This Row],[Entiteit]]&\"_\"&Tabel2[[#This Row],[Entiteit of attribuut]]))","v":{"$error":"#REF!"}},{"$f":"IF(Schema!#REF!=\"\",\"\",Schema!#REF!)","v":{"$error":"#REF!"}},{"$f":"IF(Schema!#REF!=\"\",\"\",Schema!#REF!)","v":{"$error":"#REF!"}},{"$f":"IF(Schema!#REF!=\"\",\"\",Schema!#REF!)","v":{"$error":"#REF!"}},{"$f":"IF(Schema!#REF!=\"\",\"\",Schema!#REF!)","v":{"$error":"#REF!"}},{"$f":"IF(Schema!#REF!=\"\",\"\",Schema!#REF!)","v":{"$error":"#REF!"}}]
[{"$f":"Schema!#REF!&Schema!#REF!&Schema!#REF!&Schema!#REF!","v":{"$error":"#REF!"}},{"$error":"#REF!"},{"$f":"IF(A100=\"\",\"\",IF(LEN(Schema!#REF!)=2,1,IF(LEN(Schema!#REF!)=2,10,IF(LEN(Schema!#REF!)=2,100,0))))","v":{"$error":"#REF!"}},{"$error":"#REF!"},{"$f":"IF(A100=\"\",\"\",SUM(Tabel2[[#This Row],[I1]:[I2]]))","v":{"$error":"#REF!"}},{"$error":"#REF!"},{"$error":"#REF!"},{"$error":"#REF!"},{"$error":"#REF!"},{"$f":"IF(C100=\"\",\"\",IF(LEN(Tabel2[[#This Row],[Entiteit of attribuut]])=2,\"\",Tabel2[[#This Row],[Entiteit]]&\"_\"&Tabel2[[#This Row],[Entiteit of attribuut]]))","v":{"$error":"#REF!"}},{"$f":"IF(Schema!#REF!=\"\",\"\",Schema!#REF!)","v":{"$error":"#REF!"}},{"$f":"IF(Schema!#REF!=\"\",\"\",Schema!#REF!)","v":{"$error":"#REF!"}},{"$f":"IF(Schema!#REF!=\"\",\"\",Schema!#REF!)","v":{"$error":"#REF!"}},{"$f":"IF(Schema!#REF!=\"\",\"\",Schema!#REF!)","v":{"$error":"#REF!"}},{"$f":"IF(Schema!#REF!=\"\",\"\",Schema!#REF!)","v":{"$error":"#REF!"}}]
[{"$f":"Schema!#REF!&Schema!#REF!&Schema!#REF!&Schema!#REF!","v":{"$error":"#REF!"}},{"$error":"#REF!"},{"$f":"IF(A101=\"\",\"\",IF(LEN(Schema!#REF!)=2,1,IF(LEN(Schema!#REF!)=2,10,IF(LEN(Schema!#REF!)=2,100,0))))","v":{"$error":"#REF!"}},{"$error":"#REF!"},{"$f":"IF(A101=\"\",\"\",SUM(Tabel2[[#This Row],[I1]:[I2]]))","v":{"$error":"#REF!"}},{"$error":"#REF!"},{"$error":"#REF!"},{"$error":"#REF!"},{"$error":"#REF!"},{"$f":"IF(C101=\"\",\"\",IF(LEN(Tabel2[[#This Row],[Entiteit of attribuut]])=2,\"\",Tabel2[[#This Row],[Entiteit]]&\"_\"&Tabel2[[#This Row],[Entiteit of attribuut]]))","v":{"$error":"#REF!"}},{"$f":"IF(Schema!#REF!=\"\",\"\",Schema!#REF!)","v":{"$error":"#REF!"}},{"$f":"IF(Schema!#REF!=\"\",\"\",Schema!#REF!)","v":{"$error":"#REF!"}},{"$f":"IF(Schema!#REF!=\"\",\"\",Schema!#REF!)","v":{"$error":"#REF!"}},{"$f":"IF(Schema!#REF!=\"\",\"\",Schema!#REF!)","v":{"$error":"#REF!"}},{"$f":"IF(Schema!#REF!=\"\",\"\",Schema!#REF!)","v":{"$error":"#REF!"}}]
[{"$f":"Schema!#REF!&Schema!#REF!&Schema!#REF!&Schema!#REF!","v":{"$error":"#REF!"}},{"$error":"#REF!"},{"$f":"IF(A102=\"\",\"\",IF(LEN(Schema!#REF!)=2,1,IF(LEN(Schema!#REF!)=2,10,IF(LEN(Schema!#REF!)=2,100,0))))","v":{"$error":"#REF!"}},{"$error":"#REF!"},{"$f":"IF(A102=\"\",\"\",SUM(Tabel2[[#This Row],[I1]:[I2]]))","v":{"$error":"#REF!"}},{"$error":"#REF!"},{"$error":"#REF!"},{"$error":"#REF!"},{"$error":"#REF!"},{"$f":"IF(C102=\"\",\"\",IF(LEN(Tabel2[[#This Row],[Entiteit of attribuut]])=2,\"\",Tabel2[[#This Row],[Entiteit]]&\"_\"&Tabel2[[#This Row],[Entiteit of attribuut]]))","v":{"$error":"#REF!"}},{"$f":"IF(Schema!#REF!=\"\",\"\",Schema!#REF!)","v":{"$error":"#REF!"}},{"$f":"IF(Schema!#REF!=\"\",\"\",Schema!#REF!)","v":{"$error":"#REF!"}},{"$f":"IF(Schema!#REF!=\"\",\"\",Schema!#REF!)","v":{"$error":"#REF!"}},{"$f":"IF(Schema!#REF!=\"\",\"\",Schema!#REF!)","v":{"$error":"#REF!"}},{"$f":"IF(Schema!#REF!=\"\",\"\",Schema!#REF!)","v":{"$error":"#REF!"}}]
[{"$f":"Schema!#REF!&Schema!#REF!&Schema!#REF!&Schema!#REF!","v":{"$error":"#REF!"}},{"$error":"#REF!"},{"$f":"IF(A103=\"\",\"\",IF(LEN(Schema!#REF!)=2,1,IF(LEN(Schema!#REF!)=2,10,IF(LEN(Schema!#REF!)=2,100,0))))","v":{"$error":"#REF!"}},{"$error":"#REF!"},{"$f":"IF(A103=\"\",\"\",SUM(Tabel2[[#This Row],[I1]:[I2]]))","v":{"$error":"#REF!"}},{"$error":"#REF!"},{"$error":"#REF!"},{"$error":"#REF!"},{"$error":"#REF!"},{"$f":"IF(C103=\"\",\"\",IF(LEN(Tabel2[[#This Row],[Entiteit of attribuut]])=2,\"\",Tabel2[[#This Row],[Entiteit]]&\"_\"&Tabel2[[#This Row],[Entiteit of attribuut]]))","v":{"$error":"#REF!"}},{"$f":"IF(Schema!#REF!=\"\",\"\",Schema!#REF!)","v":{"$error":"#REF!"}},{"$f":"IF(Schema!#REF!=\"\",\"\",Schema!#REF!)","v":{"$error":"#REF!"}},{"$f":"IF(Schema!#REF!=\"\",\"\",Schema!#REF!)","v":{"$error":"#REF!"}},{"$f":"IF(Schema!#REF!=\"\",\"\",Schema!#REF!)","v":{"$error":"#REF!"}},{"$f":"IF(Schema!#REF!=\"\",\"\",Schema!#REF!)","v":{"$error":"#REF!"}}]
[{"$f":"Schema!#REF!&Schema!#REF!&Schema!#REF!&Schema!#REF!","v":{"$error":"#REF!"}},{"$error":"#REF!"},{"$f":"IF(A104=\"\",\"\",IF(LEN(Schema!#REF!)=2,1,IF(LEN(Schema!#REF!)=2,10,IF(LEN(Schema!#REF!)=2,100,0))))","v":{"$error":"#REF!"}},{"$error":"#REF!"},{"$f":"IF(A104=\"\",\"\",SUM(Tabel2[[#This Row],[I1]:[I2]]))","v":{"$error":"#REF!"}},{"$error":"#REF!"},{"$error":"#REF!"},{"$error":"#REF!"},{"$error":"#REF!"},{"$f":"IF(C104=\"\",\"\",IF(LEN(Tabel2[[#This Row],[Entiteit of attribuut]])=2,\"\",Tabel2[[#This Row],[Entiteit]]&\"_\"&Tabel2[[#This Row],[Entiteit of attribuut]]))","v":{"$error":"#REF!"}},{"$f":"IF(Schema!#REF!=\"\",\"\",Schema!#REF!)","v":{"$error":"#REF!"}},{"$f":"IF(Schema!#REF!=\"\",\"\",Schema!#REF!)","v":{"$error":"#REF!"}},{"$f":"IF(Schema!#REF!=\"\",\"\",Schema!#REF!)","v":{"$error":"#REF!"}},{"$f":"IF(Schema!#REF!=\"\",\"\",Schema!#REF!)","v":{"$error":"#REF!"}},{"$f":"IF(Schema!#REF!=\"\",\"\",Schema!#REF!)","v":{"$error":"#REF!"}}]
[{"$f":"Schema!#REF!&Schema!#REF!&Schema!#REF!&Schema!#REF!","v":{"$error":"#REF!"}},{"$error":"#REF!"},{"$f":"IF(A105=\"\",\"\",IF(LEN(Schema!#REF!)=2,1,IF(LEN(Schema!#REF!)=2,10,IF(LEN(Schema!#REF!)=2,100,0))))","v":{"$error":"#REF!"}},{"$error":"#REF!"},{"$f":"IF(A105=\"\",\"\",SUM(Tabel2[[#This Row],[I1]:[I2]]))","v":{"$error":"#REF!"}},{"$error":"#REF!"},{"$error":"#REF!"},{"$error":"#REF!"},{"$error":"#REF!"},{"$f":"IF(C105=\"\",\"\",IF(LEN(Tabel2[[#This Row],[Entiteit of attribuut]])=2,\"\",Tabel2[[#This Row],[Entiteit]]&\"_\"&Tabel2[[#This Row],[Entiteit of attribuut]]))","v":{"$error":"#REF!"}},{"$f":"IF(Schema!#REF!=\"\",\"\",Schema!#REF!)","v":{"$error":"#REF!"}},{"$f":"IF(Schema!#REF!=\"\",\"\",Schema!#REF!)","v":{"$error":"#REF!"}},{"$f":"IF(Schema!#REF!=\"\",\"\",Schema!#REF!)","v":{"$error":"#REF!"}},{"$f":"IF(Schema!#REF!=\"\",\"\",Schema!#REF!)","v":{"$error":"#REF!"}},{"$f":"IF(Schema!#REF!=\"\",\"\",Schema!#REF!)","v":{"$error":"#REF!"}}]
[{"$f":"Schema!#REF!&Schema!#REF!&Schema!#REF!&Schema!#REF!","v":{"$error":"#REF!"}},{"$error":"#REF!"},{"$f":"IF(A106=\"\",\"\",IF(LEN(Schema!#REF!)=2,1,IF(LEN(Schema!#REF!)=2,10,IF(LEN(Schema!#REF!)=2,100,0))))","v":{"$error":"#REF!"}},{"$error":"#REF!"},{"$f":"IF(A106=\"\",\"\",SUM(Tabel2[[#This Row],[I1]:[I2]]))","v":{"$error":"#REF!"}},{"$error":"#REF!"},{"$error":"#REF!"},{"$error":"#REF!"},{"$error":"#REF!"},{"$f":"IF(C106=\"\",\"\",IF(LEN(Tabel2[[#This Row],[Entiteit of attribuut]])=2,\"\",Tabel2[[#This Row],[Entiteit]]&\"_\"&Tabel2[[#This Row],[Entiteit of attribuut]]))","v":{"$error":"#REF!"}},{"$f":"IF(Schema!#REF!=\"\",\"\",Schema!#REF!)","v":{"$error":"#REF!"}},{"$f":"IF(Schema!#REF!=\"\",\"\",Schema!#REF!)","v":{"$error":"#REF!"}},{"$f":"IF(Schema!#REF!=\"\",\"\",Schema!#REF!)","v":{"$error":"#REF!"}},{"$f":"IF(Schema!#REF!=\"\",\"\",Schema!#REF!)","v":{"$error":"#REF!"}},{"$f":"IF(Schema!#REF!=\"\",\"\",Schema!#REF!)","v":{"$error":"#REF!"}}]
[{"$f":"Schema!#REF!&Schema!#REF!&Schema!#REF!&Schema!#REF!","v":{"$error":"#REF!"}},{"$error":"#REF!"},{"$f":"IF(A107=\"\",\"\",IF(LEN(Schema!#REF!)=2,1,IF(LEN(Schema!#REF!)=2,10,IF(LEN(Schema!#REF!)=2,100,0))))","v":{"$error":"#REF!"}},{"$error":"#REF!"},{"$f":"IF(A107=\"\",\"\",SUM(Tabel2[[#This Row],[I1]:[I2]]))","v":{"$error":"#REF!"}},{"$error":"#REF!"},{"$error":"#REF!"},{"$error":"#REF!"},{"$error":"#REF!"},{"$f":"IF(C107=\"\",\"\",IF(LEN(Tabel2[[#This Row],[Entiteit of attribuut]])=2,\"\",Tabel2[[#This Row],[Entiteit]]&\"_\"&Tabel2[[#This Row],[Entiteit of attribuut]]))","v":{"$error":"#REF!"}},{"$f":"IF(Schema!#REF!=\"\",\"\",Schema!#REF!)","v":{"$error":"#REF!"}},{"$f":"IF(Schema!#REF!=\"\",\"\",Schema!#REF!)","v":{"$error":"#REF!"}},{"$f":"IF(Schema!#REF!=\"\",\"\",Schema!#REF!)","v":{"$error":"#REF!"}},{"$f":"IF(Schema!#REF!=\"\",\"\",Schema!#REF!)","v":{"$error":"#REF!"}},{"$f":"IF(Schema!#REF!=\"\",\"\",Schema!#REF!)","v":{"$error":"#REF!"}}]
[{"$f":"Schema!#REF!&Schema!#REF!&Schema!#REF!&Schema!#REF!","v":{"$error":"#REF!"}},{"$error":"#REF!"},{"$f":"IF(A108=\"\",\"\",IF(LEN(Schema!#REF!)=2,1,IF(LEN(Schema!#REF!)=2,10,IF(LEN(Schema!#REF!)=2,100,0))))","v":{"$error":"#REF!"}},{"$error":"#REF!"},{"$f":"IF(A108=\"\",\"\",SUM(Tabel2[[#This Row],[I1]:[I2]]))","v":{"$error":"#REF!"}},{"$error":"#REF!"},{"$error":"#REF!"},{"$error":"#REF!"},{"$error":"#REF!"},{"$f":"IF(C108=\"\",\"\",IF(LEN(Tabel2[[#This Row],[Entiteit of attribuut]])=2,\"\",Tabel2[[#This Row],[Entiteit]]&\"_\"&Tabel2[[#This Row],[Entiteit of attribuut]]))","v":{"$error":"#REF!"}},{"$f":"IF(Schema!#REF!=\"\",\"\",Schema!#REF!)","v":{"$error":"#REF!"}},{"$f":"IF(Schema!#REF!=\"\",\"\",Schema!#REF!)","v":{"$error":"#REF!"}},{"$f":"IF(Schema!#REF!=\"\",\"\",Schema!#REF!)","v":{"$error":"#REF!"}},{"$f":"IF(Schema!#REF!=\"\",\"\",Schema!#REF!)","v":{"$error":"#REF!"}},{"$f":"IF(Schema!#REF!=\"\",\"\",Schema!#REF!)","v":{"$error":"#REF!"}}]
[{"$f":"Schema!#REF!&Schema!#REF!&Schema!#REF!&Schema!#REF!","v":{"$error":"#REF!"}},{"$error":"#REF!"},{"$f":"IF(A109=\"\",\"\",IF(LEN(Schema!#REF!)=2,1,IF(LEN(Schema!#REF!)=2,10,IF(LEN(Schema!#REF!)=2,100,0))))","v":{"$error":"#REF!"}},{"$error":"#REF!"},{"$f":"IF(A109=\"\",\"\",SUM(Tabel2[[#This Row],[I1]:[I2]]))","v":{"$error":"#REF!"}},{"$error":"#REF!"},{"$error":"#REF!"},{"$error":"#REF!"},{"$error":"#REF!"},{"$f":"IF(C109=\"\",\"\",IF(LEN(Tabel2[[#This Row],[Entiteit of attribuut]])=2,\"\",Tabel2[[#This Row],[Entiteit]]&\"_\"&Tabel2[[#This Row],[Entiteit of attribuut]]))","v":{"$error":"#REF!"}},{"$f":"IF(Schema!#REF!=\"\",\"\",Schema!#REF!)","v":{"$error":"#REF!"}},{"$f":"IF(Schema!#REF!=\"\",\"\",Schema!#REF!)","v":{"$error":"#REF!"}},{"$f":"IF(Schema!#REF!=\"\",\"\",Schema!#REF!)","v":{"$error":"#REF!"}},{"$f":"IF(Schema!#REF!=\"\",\"\",Schema!#REF!)","v":{"$error":"#REF!"}},{"$f":"IF(Schema!#REF!=\"\",\"\",Schema!#REF!)","v":{"$error":"#REF!"}}]
[{"$f":"Schema!#REF!&Schema!#REF!&Schema!#REF!&Schema!#REF!","v":{"$error":"#REF!"}},{"$error":"#REF!"},{"$f":"IF(A110=\"\",\"\",IF(LEN(Schema!#REF!)=2,1,IF(LEN(Schema!#REF!)=2,10,IF(LEN(Schema!#REF!)=2,100,0))))","v":{"$error":"#REF!"}},{"$error":"#REF!"},{"$f":"IF(A110=\"\",\"\",SUM(Tabel2[[#This Row],[I1]:[I2]]))","v":{"$error":"#REF!"}},{"$error":"#REF!"},{"$error":"#REF!"},{"$error":"#REF!"},{"$error":"#REF!"},{"$f":"IF(C110=\"\",\"\",IF(LEN(Tabel2[[#This Row],[Entiteit of attribuut]])=2,\"\",Tabel2[[#This Row],[Entiteit]]&\"_\"&Tabel2[[#This Row],[Entiteit of attribuut]]))","v":{"$error":"#REF!"}},{"$f":"IF(Schema!#REF!=\"\",\"\",Schema!#REF!)","v":{"$error":"#REF!"}},{"$f":"IF(Schema!#REF!=\"\",\"\",Schema!#REF!)","v":{"$error":"#REF!"}},{"$f":"IF(Schema!#REF!=\"\",\"\",Schema!#REF!)","v":{"$error":"#REF!"}},{"$f":"IF(Schema!#REF!=\"\",\"\",Schema!#REF!)","v":{"$error":"#REF!"}},{"$f":"IF(Schema!#REF!=\"\",\"\",Schema!#REF!)","v":{"$error":"#REF!"}}]
[{"$f":"Schema!#REF!&Schema!#REF!&Schema!#REF!&Schema!#REF!","v":{"$error":"#REF!"}},{"$error":"#REF!"},{"$f":"IF(A111=\"\",\"\",IF(LEN(Schema!#REF!)=2,1,IF(LEN(Schema!#REF!)=2,10,IF(LEN(Schema!#REF!)=2,100,0))))","v":{"$error":"#REF!"}},{"$error":"#REF!"},{"$f":"IF(A111=\"\",\"\",SUM(Tabel2[[#This Row],[I1]:[I2]]))","v":{"$error":"#REF!"}},{"$error":"#REF!"},{"$error":"#REF!"},{"$error":"#REF!"},{"$error":"#REF!"},{"$f":"IF(C111=\"\",\"\",IF(LEN(Tabel2[[#This Row],[Entiteit of attribuut]])=2,\"\",Tabel2[[#This Row],[Entiteit]]&\"_\"&Tabel2[[#This Row],[Entiteit of attribuut]]))","v":{"$error":"#REF!"}},{"$f":"IF(Schema!#REF!=\"\",\"\",Schema!#REF!)","v":{"$error":"#REF!"}},{"$f":"IF(Schema!#REF!=\"\",\"\",Schema!#REF!)","v":{"$error":"#REF!"}},{"$f":"IF(Schema!#REF!=\"\",\"\",Schema!#REF!)","v":{"$error":"#REF!"}},{"$f":"IF(Schema!#REF!=\"\",\"\",Schema!#REF!)","v":{"$error":"#REF!"}},{"$f":"IF(Schema!#REF!=\"\",\"\",Schema!#REF!)","v":{"$error":"#REF!"}}]
[{"$f":"Schema!#REF!&Schema!#REF!&Schema!#REF!&Schema!#REF!","v":{"$error":"#REF!"}},{"$error":"#REF!"},{"$f":"IF(A112=\"\",\"\",IF(LEN(Schema!#REF!)=2,1,IF(LEN(Schema!#REF!)=2,10,IF(LEN(Schema!#REF!)=2,100,0))))","v":{"$error":"#REF!"}},{"$error":"#REF!"},{"$f":"IF(A112=\"\",\"\",SUM(Tabel2[[#This Row],[I1]:[I2]]))","v":{"$error":"#REF!"}},{"$error":"#REF!"},{"$error":"#REF!"},{"$error":"#REF!"},{"$error":"#REF!"},{"$f":"IF(C112=\"\",\"\",IF(LEN(Tabel2[[#This Row],[Entiteit of attribuut]])=2,\"\",Tabel2[[#This Row],[Entiteit]]&\"_\"&Tabel2[[#This Row],[Entiteit of attribuut]]))","v":{"$error":"#REF!"}},{"$f":"IF(Schema!#REF!=\"\",\"\",Schema!#REF!)","v":{"$error":"#REF!"}},{"$f":"IF(Schema!#REF!=\"\",\"\",Schema!#REF!)","v":{"$error":"#REF!"}},{"$f":"IF(Schema!#REF!=\"\",\"\",Schema!#REF!)","v":{"$error":"#REF!"}},{"$f":"IF(Schema!#REF!=\"\",\"\",Schema!#REF!)","v":{"$error":"#REF!"}},{"$f":"IF(Schema!#REF!=\"\",\"\",Schema!#REF!)","v":{"$error":"#REF!"}}]
[{"$f":"Schema!#REF!&Schema!#REF!&Schema!#REF!&Schema!#REF!","v":{"$error":"#REF!"}},{"$error":"#REF!"},{"$f":"IF(A113=\"\",\"\",IF(LEN(Schema!#REF!)=2,1,IF(LEN(Schema!#REF!)=2,10,IF(LEN(Schema!#REF!)=2,100,0))))","v":{"$error":"#REF!"}},{"$error":"#REF!"},{"$f":"IF(A113=\"\",\"\",SUM(Tabel2[[#This Row],[I1]:[I2]]))","v":{"$error":"#REF!"}},{"$error":"#REF!"},{"$error":"#REF!"},{"$error":"#REF!"},{"$error":"#REF!"},{"$f":"IF(C113=\"\",\"\",IF(LEN(Tabel2[[#This Row],[Entiteit of attribuut]])=2,\"\",Tabel2[[#This Row],[Entiteit]]&\"_\"&Tabel2[[#This Row],[Entiteit of attribuut]]))","v":{"$error":"#REF!"}},{"$f":"IF(Schema!#REF!=\"\",\"\",Schema!#REF!)","v":{"$error":"#REF!"}},{"$f":"IF(Schema!#REF!=\"\",\"\",Schema!#REF!)","v":{"$error":"#REF!"}},{"$f":"IF(Schema!#REF!=\"\",\"\",Schema!#REF!)","v":{"$error":"#REF!"}},{"$f":"IF(Schema!#REF!=\"\",\"\",Schema!#REF!)","v":{"$error":"#REF!"}},{"$f":"IF(Schema!#REF!=\"\",\"\",Schema!#REF!)","v":{"$error":"#REF!"}}]
[{"$f":"Schema!#REF!&Schema!#REF!&Schema!#REF!&Schema!#REF!","v":{"$error":"#REF!"}},{"$error":"#REF!"},{"$f":"IF(A114=\"\",\"\",IF(LEN(Schema!#REF!)=2,1,IF(LEN(Schema!#REF!)=2,10,IF(LEN(Schema!#REF!)=2,100,0))))","v":{"$error":"#REF!"}},{"$error":"#REF!"},{"$f":"IF(A114=\"\",\"\",SUM(Tabel2[[#This Row],[I1]:[I2]]))","v":{"$error":"#REF!"}},{"$error":"#REF!"},{"$error":"#REF!"},{"$error":"#REF!"},{"$error":"#REF!"},{"$f":"IF(C114=\"\",\"\",IF(LEN(Tabel2[[#This Row],[Entiteit of attribuut]])=2,\"\",Tabel2[[#This Row],[Entiteit]]&\"_\"&Tabel2[[#This Row],[Entiteit of attribuut]]))","v":{"$error":"#REF!"}},{"$f":"IF(Schema!#REF!=\"\",\"\",Schema!#REF!)","v":{"$error":"#REF!"}},{"$f":"IF(Schema!#REF!=\"\",\"\",Schema!#REF!)","v":{"$error":"#REF!"}},{"$f":"IF(Schema!#REF!=\"\",\"\",Schema!#REF!)","v":{"$error":"#REF!"}},{"$f":"IF(Schema!#REF!=\"\",\"\",Schema!#REF!)","v":{"$error":"#REF!"}},{"$f":"IF(Schema!#REF!=\"\",\"\",Schema!#REF!)","v":{"$error":"#REF!"}}]
[{"$f":"Schema!#REF!&Schema!#REF!&Schema!#REF!&Schema!#REF!","v":{"$error":"#REF!"}},{"$error":"#REF!"},{"$f":"IF(A115=\"\",\"\",IF(LEN(Schema!#REF!)=2,1,IF(LEN(Schema!#REF!)=2,10,IF(LEN(Schema!#REF!)=2,100,0))))","v":{"$error":"#REF!"}},{"$error":"#REF!"},{"$f":"IF(A115=\"\",\"\",SUM(Tabel2[[#This Row],[I1]:[I2]]))","v":{"$error":"#REF!"}},{"$error":"#REF!"},{"$error":"#REF!"},{"$error":"#REF!"},{"$error":"#REF!"},{"$f":"IF(C115=\"\",\"\",IF(LEN(Tabel2[[#This Row],[Entiteit of attribuut]])=2,\"\",Tabel2[[#This Row],[Entiteit]]&\"_\"&Tabel2[[#This Row],[Entiteit of attribuut]]))","v":{"$error":"#REF!"}},{"$f":"IF(Schema!#REF!=\"\",\"\",Schema!#REF!)","v":{"$error":"#REF!"}},{"$f":"IF(Schema!#REF!=\"\",\"\",Schema!#REF!)","v":{"$error":"#REF!"}},{"$f":"IF(Schema!#REF!=\"\",\"\",Schema!#REF!)","v":{"$error":"#REF!"}},{"$f":"IF(Schema!#REF!=\"\",\"\",Schema!#REF!)","v":{"$error":"#REF!"}},{"$f":"IF(Schema!#REF!=\"\",\"\",Schema!#REF!)","v":{"$error":"#REF!"}}]
[{"$f":"Schema!#REF!&Schema!#REF!&Schema!#REF!&Schema!#REF!","v":{"$error":"#REF!"}},{"$error":"#REF!"},{"$f":"IF(A116=\"\",\"\",IF(LEN(Schema!#REF!)=2,1,IF(LEN(Schema!#REF!)=2,10,IF(LEN(Schema!#REF!)=2,100,0))))","v":{"$error":"#REF!"}},{"$error":"#REF!"},{"$f":"IF(A116=\"\",\"\",SUM(Tabel2[[#This Row],[I1]:[I2]]))","v":{"$error":"#REF!"}},{"$error":"#REF!"},{"$error":"#REF!"},{"$error":"#REF!"},{"$error":"#REF!"},{"$f":"IF(C116=\"\",\"\",IF(LEN(Tabel2[[#This Row],[Entiteit of attribuut]])=2,\"\",Tabel2[[#This Row],[Entiteit]]&\"_\"&Tabel2[[#This Row],[Entiteit of attribuut]]))","v":{"$error":"#REF!"}},{"$f":"IF(Schema!#REF!=\"\",\"\",Schema!#REF!)","v":{"$error":"#REF!"}},{"$f":"IF(Schema!#REF!=\"\",\"\",Schema!#REF!)","v":{"$error":"#REF!"}},{"$f":"IF(Schema!#REF!=\"\",\"\",Schema!#REF!)","v":{"$error":"#REF!"}},{"$f":"IF(Schema!#REF!=\"\",\"\",Schema!#REF!)","v":{"$error":"#REF!"}},{"$f":"IF(Schema!#REF!=\"\",\"\",Schema!#REF!)","v":{"$error":"#REF!"}}]
[{"$f":"Schema!#REF!&Schema!#REF!&Schema!#REF!&Schema!#REF!","v":{"$error":"#REF!"}},{"$error":"#REF!"},{"$f":"IF(A117=\"\",\"\",IF(LEN(Schema!#REF!)=2,1,IF(LEN(Schema!#REF!)=2,10,IF(LEN(Schema!#REF!)=2,100,0))))","v":{"$error":"#REF!"}},{"$error":"#REF!"},{"$f":"IF(A117=\"\",\"\",SUM(Tabel2[[#This Row],[I1]:[I2]]))","v":{"$error":"#REF!"}},{"$error":"#REF!"},{"$error":"#REF!"},{"$error":"#REF!"},{"$error":"#REF!"},{"$f":"IF(C117=\"\",\"\",IF(LEN(Tabel2[[#This Row],[Entiteit of attribuut]])=2,\"\",Tabel2[[#This Row],[Entiteit]]&\"_\"&Tabel2[[#This Row],[Entiteit of attribuut]]))","v":{"$error":"#REF!"}},{"$f":"IF(Schema!#REF!=\"\",\"\",Schema!#REF!)","v":{"$error":"#REF!"}},{"$f":"IF(Schema!#REF!=\"\",\"\",Schema!#REF!)","v":{"$error":"#REF!"}},{"$f":"IF(Schema!#REF!=\"\",\"\",Schema!#REF!)","v":{"$error":"#REF!"}},{"$f":"IF(Schema!#REF!=\"\",\"\",Schema!#REF!)","v":{"$error":"#REF!"}},{"$f":"IF(Schema!#REF!=\"\",\"\",Schema!#REF!)","v":{"$error":"#REF!"}}]
[{"$f":"Schema!#REF!&Schema!#REF!&Schema!#REF!&Schema!#REF!","v":{"$error":"#REF!"}},{"$error":"#REF!"},{"$f":"IF(A118=\"\",\"\",IF(LEN(Schema!#REF!)=2,1,IF(LEN(Schema!#REF!)=2,10,IF(LEN(Schema!#REF!)=2,100,0))))","v":{"$error":"#REF!"}},{"$error":"#REF!"},{"$f":"IF(A118=\"\",\"\",SUM(Tabel2[[#This Row],[I1]:[I2]]))","v":{"$error":"#REF!"}},{"$error":"#REF!"},{"$error":"#REF!"},{"$error":"#REF!"},{"$error":"#REF!"},{"$f":"IF(C118=\"\",\"\",IF(LEN(Tabel2[[#This Row],[Entiteit of attribuut]])=2,\"\",Tabel2[[#This Row],[Entiteit]]&\"_\"&Tabel2[[#This Row],[Entiteit of attribuut]]))","v":{"$error":"#REF!"}},{"$f":"IF(Schema!#REF!=\"\",\"\",Schema!#REF!)","v":{"$error":"#REF!"}},{"$f":"IF(Schema!#REF!=\"\",\"\",Schema!#REF!)","v":{"$error":"#REF!"}},{"$f":"IF(Schema!#REF!=\"\",\"\",Schema!#REF!)","v":{"$error":"#REF!"}},{"$f":"IF(Schema!#REF!=\"\",\"\",Schema!#REF!)","v":{"$error":"#REF!"}},{"$f":"IF(Schema!#REF!=\"\",\"\",Schema!#REF!)","v":{"$error":"#REF!"}}]
[{"$f":"Schema!#REF!&Schema!#REF!&Schema!#REF!&Schema!#REF!","v":{"$error":"#REF!"}},{"$error":"#REF!"},{"$f":"IF(A119=\"\",\"\",IF(LEN(Schema!#REF!)=2,1,IF(LEN(Schema!#REF!)=2,10,IF(LEN(Schema!#REF!)=2,100,0))))","v":{"$error":"#REF!"}},{"$error":"#REF!"},{"$f":"IF(A119=\"\",\"\",SUM(Tabel2[[#This Row],[I1]:[I2]]))","v":{"$error":"#REF!"}},{"$error":"#REF!"},{"$error":"#REF!"},{"$error":"#REF!"},{"$error":"#REF!"},{"$f":"IF(C119=\"\",\"\",IF(LEN(Tabel2[[#This Row],[Entiteit of attribuut]])=2,\"\",Tabel2[[#This Row],[Entiteit]]&\"_\"&Tabel2[[#This Row],[Entiteit of attribuut]]))","v":{"$error":"#REF!"}},{"$f":"IF(Schema!#REF!=\"\",\"\",Schema!#REF!)","v":{"$error":"#REF!"}},{"$f":"IF(Schema!#REF!=\"\",\"\",Schema!#REF!)","v":{"$error":"#REF!"}},{"$f":"IF(Schema!#REF!=\"\",\"\",Schema!#REF!)","v":{"$error":"#REF!"}},{"$f":"IF(Schema!#REF!=\"\",\"\",Schema!#REF!)","v":{"$error":"#REF!"}},{"$f":"IF(Schema!#REF!=\"\",\"\",Schema!#REF!)","v":{"$error":"#REF!"}}]
[{"$f":"Schema!#REF!&Schema!#REF!&Schema!#REF!&Schema!#REF!","v":{"$error":"#REF!"}},{"$error":"#REF!"},{"$f":"IF(A120=\"\",\"\",IF(LEN(Schema!#REF!)=2,1,IF(LEN(Schema!#REF!)=2,10,IF(LEN(Schema!#REF!)=2,100,0))))","v":{"$error":"#REF!"}},{"$error":"#REF!"},{"$f":"IF(A120=\"\",\"\",SUM(Tabel2[[#This Row],[I1]:[I2]]))","v":{"$error":"#REF!"}},{"$error":"#REF!"},{"$error":"#REF!"},{"$error":"#REF!"},{"$error":"#REF!"},{"$f":"IF(C120=\"\",\"\",IF(LEN(Tabel2[[#This Row],[Entiteit of attribuut]])=2,\"\",Tabel2[[#This Row],[Entiteit]]&\"_\"&Tabel2[[#This Row],[Entiteit of attribuut]]))","v":{"$error":"#REF!"}},{"$f":"IF(Schema!#REF!=\"\",\"\",Schema!#REF!)","v":{"$error":"#REF!"}},{"$f":"IF(Schema!#REF!=\"\",\"\",Schema!#REF!)","v":{"$error":"#REF!"}},{"$f":"IF(Schema!#REF!=\"\",\"\",Schema!#REF!)","v":{"$error":"#REF!"}},{"$f":"IF(Schema!#REF!=\"\",\"\",Schema!#REF!)","v":{"$error":"#REF!"}},{"$f":"IF(Schema!#REF!=\"\",\"\",Schema!#REF!)","v":{"$error":"#REF!"}}]
[{"$f":"Schema!#REF!&Schema!#REF!&Schema!#REF!&Schema!#REF!","v":{"$error":"#REF!"}},{"$error":"#REF!"},{"$f":"IF(A121=\"\",\"\",IF(LEN(Schema!#REF!)=2,1,IF(LEN(Schema!#REF!)=2,10,IF(LEN(Schema!#REF!)=2,100,0))))","v":{"$error":"#REF!"}},{"$error":"#REF!"},{"$f":"IF(A121=\"\",\"\",SUM(Tabel2[[#This Row],[I1]:[I2]]))","v":{"$error":"#REF!"}},{"$error":"#REF!"},{"$error":"#REF!"},{"$error":"#REF!"},{"$error":"#REF!"},{"$f":"IF(C121=\"\",\"\",IF(LEN(Tabel2[[#This Row],[Entiteit of attribuut]])=2,\"\",Tabel2[[#This Row],[Entiteit]]&\"_\"&Tabel2[[#This Row],[Entiteit of attribuut]]))","v":{"$error":"#REF!"}},{"$f":"IF(Schema!#REF!=\"\",\"\",Schema!#REF!)","v":{"$error":"#REF!"}},{"$f":"IF(Schema!#REF!=\"\",\"\",Schema!#REF!)","v":{"$error":"#REF!"}},{"$f":"IF(Schema!#REF!=\"\",\"\",Schema!#REF!)","v":{"$error":"#REF!"}},{"$f":"IF(Schema!#REF!=\"\",\"\",Schema!#REF!)","v":{"$error":"#REF!"}},{"$f":"IF(Schema!#REF!=\"\",\"\",Schema!#REF!)","v":{"$error":"#REF!"}}]
[{"$f":"Schema!#REF!&Schema!#REF!&Schema!#REF!&Schema!#REF!","v":{"$error":"#REF!"}},{"$error":"#REF!"},{"$f":"IF(A122=\"\",\"\",IF(LEN(Schema!#REF!)=2,1,IF(LEN(Schema!#REF!)=2,10,IF(LEN(Schema!#REF!)=2,100,0))))","v":{"$error":"#REF!"}},{"$error":"#REF!"},{"$f":"IF(A122=\"\",\"\",SUM(Tabel2[[#This Row],[I1]:[I2]]))","v":{"$error":"#REF!"}},{"$error":"#REF!"},{"$error":"#REF!"},{"$error":"#REF!"},{"$error":"#REF!"},{"$f":"IF(C122=\"\",\"\",IF(LEN(Tabel2[[#This Row],[Entiteit of attribuut]])=2,\"\",Tabel2[[#This Row],[Entiteit]]&\"_\"&Tabel2[[#This Row],[Entiteit of attribuut]]))","v":{"$error":"#REF!"}},{"$f":"IF(Schema!#REF!=\"\",\"\",Schema!#REF!)","v":{"$error":"#REF!"}},{"$f":"IF(Schema!#REF!=\"\",\"\",Schema!#REF!)","v":{"$error":"#REF!"}},{"$f":"IF(Schema!#REF!=\"\",\"\",Schema!#REF!)","v":{"$error":"#REF!"}},{"$f":"IF(Schema!#REF!=\"\",\"\",Schema!#REF!)","v":{"$error":"#REF!"}},{"$f":"IF(Schema!#REF!=\"\",\"\",Schema!#REF!)","v":{"$error":"#REF!"}}]
[{"$f":"Schema!#REF!&Schema!#REF!&Schema!#REF!&Schema!#REF!","v":{"$error":"#REF!"}},{"$error":"#REF!"},{"$f":"IF(A123=\"\",\"\",IF(LEN(Schema!#REF!)=2,1,IF(LEN(Schema!#REF!)=2,10,IF(LEN(Schema!#REF!)=2,100,0))))","v":{"$error":"#REF!"}},{"$error":"#REF!"},{"$f":"IF(A123=\"\",\"\",SUM(Tabel2[[#This Row],[I1]:[I2]]))","v":{"$error":"#REF!"}},{"$error":"#REF!"},{"$error":"#REF!"},{"$error":"#REF!"},{"$error":"#REF!"},{"$f":"IF(C123=\"\",\"\",IF(LEN(Tabel2[[#This Row],[Entiteit of attribuut]])=2,\"\",Tabel2[[#This Row],[Entiteit]]&\"_\"&Tabel2[[#This Row],[Entiteit of attribuut]]))","v":{"$error":"#REF!"}},{"$f":"IF(Schema!#REF!=\"\",\"\",Schema!#REF!)","v":{"$error":"#REF!"}},{"$f":"IF(Schema!#REF!=\"\",\"\",Schema!#REF!)","v":{"$error":"#REF!"}},{"$f":"IF(Schema!#REF!=\"\",\"\",Schema!#REF!)","v":{"$error":"#REF!"}},{"$f":"IF(Schema!#REF!=\"\",\"\",Schema!#REF!)","v":{"$error":"#REF!"}},{"$f":"IF(Schema!#REF!=\"\",\"\",Schema!#REF!)","v":{"$error":"#REF!"}}]
[{"$f":"Schema!#REF!&Schema!#REF!&Schema!#REF!&Schema!#REF!","v":{"$error":"#REF!"}},{"$error":"#REF!"},{"$f":"IF(A124=\"\",\"\",IF(LEN(Schema!#REF!)=2,1,IF(LEN(Schema!#REF!)=2,10,IF(LEN(Schema!#REF!)=2,100,0))))","v":{"$error":"#REF!"}},{"$error":"#REF!"},{"$f":"IF(A124=\"\",\"\",SUM(Tabel2[[#This Row],[I1]:[I2]]))","v":{"$error":"#REF!"}},{"$error":"#REF!"},{"$error":"#REF!"},{"$error":"#REF!"},{"$error":"#REF!"},{"$f":"IF(C124=\"\",\"\",IF(LEN(Tabel2[[#This Row],[Entiteit of attribuut]])=2,\"\",Tabel2[[#This Row],[Entiteit]]&\"_\"&Tabel2[[#This Row],[Entiteit of attribuut]]))","v":{"$error":"#REF!"}},{"$f":"IF(Schema!#REF!=\"\",\"\",Schema!#REF!)","v":{"$error":"#REF!"}},{"$f":"IF(Schema!#REF!=\"\",\"\",Schema!#REF!)","v":{"$error":"#REF!"}},{"$f":"IF(Schema!#REF!=\"\",\"\",Schema!#REF!)","v":{"$error":"#REF!"}},{"$f":"IF(Schema!#REF!=\"\",\"\",Schema!#REF!)","v":{"$error":"#REF!"}},{"$f":"IF(Schema!#REF!=\"\",\"\",Schema!#REF!)","v":{"$error":"#REF!"}}]
[{"$f":"Schema!#REF!&Schema!#REF!&Schema!#REF!&Schema!#REF!","v":{"$error":"#REF!"}},{"$error":"#REF!"},{"$f":"IF(A125=\"\",\"\",IF(LEN(Schema!#REF!)=2,1,IF(LEN(Schema!#REF!)=2,10,IF(LEN(Schema!#REF!)=2,100,0))))","v":{"$error":"#REF!"}},{"$error":"#REF!"},{"$f":"IF(A125=\"\",\"\",SUM(Tabel2[[#This Row],[I1]:[I2]]))","v":{"$error":"#REF!"}},{"$error":"#REF!"},{"$error":"#REF!"},{"$error":"#REF!"},{"$error":"#REF!"},{"$f":"IF(C125=\"\",\"\",IF(LEN(Tabel2[[#This Row],[Entiteit of attribuut]])=2,\"\",Tabel2[[#This Row],[Entiteit]]&\"_\"&Tabel2[[#This Row],[Entiteit of attribuut]]))","v":{"$error":"#REF!"}},{"$f":"IF(Schema!#REF!=\"\",\"\",Schema!#REF!)","v":{"$error":"#REF!"}},{"$f":"IF(Schema!#REF!=\"\",\"\",Schema!#REF!)","v":{"$error":"#REF!"}},{"$f":"IF(Schema!#REF!=\"\",\"\",Schema!#REF!)","v":{"$error":"#REF!"}},{"$f":"IF(Schema!#REF!=\"\",\"\",Schema!#REF!)","v":{"$error":"#REF!"}},{"$f":"IF(Schema!#REF!=\"\",\"\",Schema!#REF!)","v":{"$error":"#REF!"}}]
[{"$f":"Schema!#REF!&Schema!#REF!&Schema!#REF!&Schema!#REF!","v":{"$error":"#REF!"}},{"$error":"#REF!"},{"$f":"IF(A126=\"\",\"\",IF(LEN(Schema!#REF!)=2,1,IF(LEN(Schema!#REF!)=2,10,IF(LEN(Schema!#REF!)=2,100,0))))","v":{"$error":"#REF!"}},{"$error":"#REF!"},{"$f":"IF(A126=\"\",\"\",SUM(Tabel2[[#This Row],[I1]:[I2]]))","v":{"$error":"#REF!"}},{"$error":"#REF!"},{"$error":"#REF!"},{"$error":"#REF!"},{"$error":"#REF!"},{"$f":"IF(C126=\"\",\"\",IF(LEN(Tabel2[[#This Row],[Entiteit of attribuut]])=2,\"\",Tabel2[[#This Row],[Entiteit]]&\"_\"&Tabel2[[#This Row],[Entiteit of attribuut]]))","v":{"$error":"#REF!"}},{"$f":"IF(Schema!#REF!=\"\",\"\",Schema!#REF!)","v":{"$error":"#REF!"}},{"$f":"IF(Schema!#REF!=\"\",\"\",Schema!#REF!)","v":{"$error":"#REF!"}},{"$f":"IF(Schema!#REF!=\"\",\"\",Schema!#REF!)","v":{"$error":"#REF!"}},{"$f":"IF(Schema!#REF!=\"\",\"\",Schema!#REF!)","v":{"$error":"#REF!"}},{"$f":"IF(Schema!#REF!=\"\",\"\",Schema!#REF!)","v":{"$error":"#REF!"}}]
[{"$f":"Schema!#REF!&Schema!#REF!&Schema!#REF!&Schema!#REF!","v":{"$error":"#REF!"}},{"$error":"#REF!"},{"$f":"IF(A127=\"\",\"\",IF(LEN(Schema!#REF!)=2,1,IF(LEN(Schema!#REF!)=2,10,IF(LEN(Schema!#REF!)=2,100,0))))","v":{"$error":"#REF!"}},{"$error":"#REF!"},{"$f":"IF(A127=\"\",\"\",SUM(Tabel2[[#This Row],[I1]:[I2]]))","v":{"$error":"#REF!"}},{"$error":"#REF!"},{"$error":"#REF!"},{"$error":"#REF!"},{"$error":"#REF!"},{"$f":"IF(C127=\"\",\"\",IF(LEN(Tabel2[[#This Row],[Entiteit of attribuut]])=2,\"\",Tabel2[[#This Row],[Entiteit]]&\"_\"&Tabel2[[#This Row],[Entiteit of attribuut]]))","v":{"$error":"#REF!"}},{"$f":"IF(Schema!#REF!=\"\",\"\",Schema!#REF!)","v":{"$error":"#REF!"}},{"$f":"IF(Schema!#REF!=\"\",\"\",Schema!#REF!)","v":{"$error":"#REF!"}},{"$f":"IF(Schema!#REF!=\"\",\"\",Schema!#REF!)","v":{"$error":"#REF!"}},{"$f":"IF(Schema!#REF!=\"\",\"\",Schema!#REF!)","v":{"$error":"#REF!"}},{"$f":"IF(Schema!#REF!=\"\",\"\",Schema!#REF!)","v":{"$error":"#REF!"}}]
[{"$f":"Schema!#REF!&Schema!#REF!&Schema!#REF!&Schema!#REF!","v":{"$error":"#REF!"}},{"$error":"#REF!"},{"$f":"IF(A128=\"\",\"\",IF(LEN(Schema!#REF!)=2,1,IF(LEN(Schema!#REF!)=2,10,IF(LEN(Schema!#REF!)=2,100,0))))","v":{"$error":"#REF!"}},{"$error":"#REF!"},{"$f":"IF(A128=\"\",\"\",SUM(Tabel2[[#This Row],[I1]:[I2]]))","v":{"$error":"#REF!"}},{"$error":"#REF!"},{"$error":"#REF!"},{"$error":"#REF!"},{"$error":"#REF!"},{"$f":"IF(C128=\"\",\"\",IF(LEN(Tabel2[[#This Row],[Entiteit of attribuut]])=2,\"\",Tabel2[[#This Row],[Entiteit]]&\"_\"&Tabel2[[#This Row],[Entiteit of attribuut]]))","v":{"$error":"#REF!"}},{"$f":"IF(Schema!#REF!=\"\",\"\",Schema!#REF!)","v":{"$error":"#REF!"}},{"$f":"IF(Schema!#REF!=\"\",\"\",Schema!#REF!)","v":{"$error":"#REF!"}},{"$f":"IF(Schema!#REF!=\"\",\"\",Schema!#REF!)","v":{"$error":"#REF!"}},{"$f":"IF(Schema!#REF!=\"\",\"\",Schema!#REF!)","v":{"$error":"#REF!"}},{"$f":"IF(Schema!#REF!=\"\",\"\",Schema!#REF!)","v":{"$error":"#REF!"}}]
[{"$f":"Schema!#REF!&Schema!#REF!&Schema!#REF!&Schema!#REF!","v":{"$error":"#REF!"}},{"$error":"#REF!"},{"$f":"IF(A129=\"\",\"\",IF(LEN(Schema!#REF!)=2,1,IF(LEN(Schema!#REF!)=2,10,IF(LEN(Schema!#REF!)=2,100,0))))","v":{"$error":"#REF!"}},{"$error":"#REF!"},{"$f":"IF(A129=\"\",\"\",SUM(Tabel2[[#This Row],[I1]:[I2]]))","v":{"$error":"#REF!"}},{"$error":"#REF!"},{"$error":"#REF!"},{"$error":"#REF!"},{"$error":"#REF!"},{"$f":"IF(C129=\"\",\"\",IF(LEN(Tabel2[[#This Row],[Entiteit of attribuut]])=2,\"\",Tabel2[[#This Row],[Entiteit]]&\"_\"&Tabel2[[#This Row],[Entiteit of attribuut]]))","v":{"$error":"#REF!"}},{"$f":"IF(Schema!#REF!=\"\",\"\",Schema!#REF!)","v":{"$error":"#REF!"}},{"$f":"IF(Schema!#REF!=\"\",\"\",Schema!#REF!)","v":{"$error":"#REF!"}},{"$f":"IF(Schema!#REF!=\"\",\"\",Schema!#REF!)","v":{"$error":"#REF!"}},{"$f":"IF(Schema!#REF!=\"\",\"\",Schema!#REF!)","v":{"$error":"#REF!"}},{"$f":"IF(Schema!#REF!=\"\",\"\",Schema!#REF!)","v":{"$error":"#REF!"}}]
[{"$f":"Schema!#REF!&Schema!#REF!&Schema!#REF!&Schema!#REF!","v":{"$error":"#REF!"}},{"$error":"#REF!"},{"$f":"IF(A130=\"\",\"\",IF(LEN(Schema!#REF!)=2,1,IF(LEN(Schema!#REF!)=2,10,IF(LEN(Schema!#REF!)=2,100,0))))","v":{"$error":"#REF!"}},{"$error":"#REF!"},{"$f":"IF(A130=\"\",\"\",SUM(Tabel2[[#This Row],[I1]:[I2]]))","v":{"$error":"#REF!"}},{"$error":"#REF!"},{"$error":"#REF!"},{"$error":"#REF!"},{"$error":"#REF!"},{"$f":"IF(C130=\"\",\"\",IF(LEN(Tabel2[[#This Row],[Entiteit of attribuut]])=2,\"\",Tabel2[[#This Row],[Entiteit]]&\"_\"&Tabel2[[#This Row],[Entiteit of attribuut]]))","v":{"$error":"#REF!"}},{"$f":"IF(Schema!#REF!=\"\",\"\",Schema!#REF!)","v":{"$error":"#REF!"}},{"$f":"IF(Schema!#REF!=\"\",\"\",Schema!#REF!)","v":{"$error":"#REF!"}},{"$f":"IF(Schema!#REF!=\"\",\"\",Schema!#REF!)","v":{"$error":"#REF!"}},{"$f":"IF(Schema!#REF!=\"\",\"\",Schema!#REF!)","v":{"$error":"#REF!"}},{"$f":"IF(Schema!#REF!=\"\",\"\",Schema!#REF!)","v":{"$error":"#REF!"}}]
[{"$f":"Schema!#REF!&Schema!#REF!&Schema!#REF!&Schema!#REF!","v":{"$error":"#REF!"}},{"$f":"IF(LEN(A131)=2,A131,IF(A131=\"\",\"Leeg\",B130))","v":{"$error":"#REF!"}},{"$f":"IF(A131=\"\",\"\",IF(LEN(Schema!#REF!)=2,1,IF(LEN(Schema!#REF!)=2,10,IF(LEN(Schema!#REF!)=2,100,0))))","v":{"$error":"#REF!"}},{"$f":"IF(C131=0,D130,C131)","v":{"$error":"#REF!"}},{"$f":"IF(A131=\"\",\"\",SUM(Tabel2[[#This Row],[I1]:[I2]]))","v":{"$error":"#REF!"}},{"$f":"IF(A131=\"\",\"\",IF(C131=1,B131,F130))","v":{"$error":"#REF!"}},{"$f":"IF(C131=10,A131,IF(OR(C131=0,C131=100),G130,\"\"))","v":{"$error":"#REF!"}},{"$f":"IF(E131=200,B131,IF(C131=0,H130,\"\"))","v":{"$error":"#REF!"}},{"$f":"IF(C131=\"\",\"\",IF(OR(E131=1,E131=10,E131=100),I130,IF(E131=2,F131,IF(E131=20,F131&\"/\"&G131,IF(E131=200,F131&\"/\"&G131&\"/\"&H131)))))","v":{"$error":"#REF!"}},{"$f":"IF(C131=\"\",\"\",IF(LEN(Tabel2[[#This Row],[Entiteit of attribuut]])=2,\"\",Tabel2[[#This Row],[Entiteit]]&\"_\"&Tabel2[[#This Row],[Entiteit of attribuut]]))","v":{"$error":"#REF!"}},{"$f":"IF(Schema!#REF!=\"\",\"\",Schema!#REF!)","v":{"$error":"#REF!"}},{"$f":"IF(Schema!#REF!=\"\",\"\",Schema!#REF!)","v":{"$error":"#REF!"}},{"$f":"IF(Schema!#REF!=\"\",\"\",Schema!#REF!)","v":{"$error":"#REF!"}},{"$f":"IF(Schema!#REF!=\"\",\"\",Schema!#REF!)","v":{"$error":"#REF!"}},{"$f":"IF(Schema!#REF!=\"\",\"\",Schema!#REF!)","v":{"$error":"#REF!"}}]
[{"$f":"Schema!#REF!&Schema!#REF!&Schema!#REF!&Schema!#REF!","v":{"$error":"#REF!"}},{"$error":"#REF!"},{"$f":"IF(A132=\"\",\"\",IF(LEN(Schema!#REF!)=2,1,IF(LEN(Schema!#REF!)=2,10,IF(LEN(Schema!#REF!)=2,100,0))))","v":{"$error":"#REF!"}},{"$error":"#REF!"},{"$f":"IF(A132=\"\",\"\",SUM(Tabel2[[#This Row],[I1]:[I2]]))","v":{"$error":"#REF!"}},{"$error":"#REF!"},{"$error":"#REF!"},{"$error":"#REF!"},{"$error":"#REF!"},{"$f":"IF(C132=\"\",\"\",IF(LEN(Tabel2[[#This Row],[Entiteit of attribuut]])=2,\"\",Tabel2[[#This Row],[Entiteit]]&\"_\"&Tabel2[[#This Row],[Entiteit of attribuut]]))","v":{"$error":"#REF!"}},{"$f":"IF(Schema!#REF!=\"\",\"\",Schema!#REF!)","v":{"$error":"#REF!"}},{"$f":"IF(Schema!#REF!=\"\",\"\",Schema!#REF!)","v":{"$error":"#REF!"}},{"$f":"IF(Schema!#REF!=\"\",\"\",Schema!#REF!)","v":{"$error":"#REF!"}},{"$f":"IF(Schema!#REF!=\"\",\"\",Schema!#REF!)","v":{"$error":"#REF!"}},{"$f":"IF(Schema!#REF!=\"\",\"\",Schema!#REF!)","v":{"$error":"#REF!"}}]
[{"$f":"Schema!#REF!&Schema!#REF!&Schema!#REF!&Schema!#REF!","v":{"$error":"#REF!"}},{"$error":"#REF!"},{"$f":"IF(A133=\"\",\"\",IF(LEN(Schema!#REF!)=2,1,IF(LEN(Schema!#REF!)=2,10,IF(LEN(Schema!#REF!)=2,100,0))))","v":{"$error":"#REF!"}},{"$error":"#REF!"},{"$f":"IF(A133=\"\",\"\",SUM(Tabel2[[#This Row],[I1]:[I2]]))","v":{"$error":"#REF!"}},{"$error":"#REF!"},{"$error":"#REF!"},{"$error":"#REF!"},{"$error":"#REF!"},{"$f":"IF(C133=\"\",\"\",IF(LEN(Tabel2[[#This Row],[Entiteit of attribuut]])=2,\"\",Tabel2[[#This Row],[Entiteit]]&\"_\"&Tabel2[[#This Row],[Entiteit of attribuut]]))","v":{"$error":"#REF!"}},{"$f":"IF(Schema!#REF!=\"\",\"\",Schema!#REF!)","v":{"$error":"#REF!"}},{"$f":"IF(Schema!#REF!=\"\",\"\",Schema!#REF!)","v":{"$error":"#REF!"}},{"$f":"IF(Schema!#REF!=\"\",\"\",Schema!#REF!)","v":{"$error":"#REF!"}},{"$f":"IF(Schema!#REF!=\"\",\"\",Schema!#REF!)","v":{"$error":"#REF!"}},{"$f":"IF(Schema!#REF!=\"\",\"\",Schema!#REF!)","v":{"$error":"#REF!"}}]
[{"$f":"Schema!#REF!&Schema!#REF!&Schema!#REF!&Schema!#REF!","v":{"$error":"#REF!"}},{"$error":"#REF!"},{"$f":"IF(A134=\"\",\"\",IF(LEN(Schema!#REF!)=2,1,IF(LEN(Schema!#REF!)=2,10,IF(LEN(Schema!#REF!)=2,100,0))))","v":{"$error":"#REF!"}},{"$error":"#REF!"},{"$f":"IF(A134=\"\",\"\",SUM(Tabel2[[#This Row],[I1]:[I2]]))","v":{"$error":"#REF!"}},{"$error":"#REF!"},{"$error":"#REF!"},{"$error":"#REF!"},{"$error":"#REF!"},{"$f":"IF(C134=\"\",\"\",IF(LEN(Tabel2[[#This Row],[Entiteit of attribuut]])=2,\"\",Tabel2[[#This Row],[Entiteit]]&\"_\"&Tabel2[[#This Row],[Entiteit of attribuut]]))","v":{"$error":"#REF!"}},{"$f":"IF(Schema!#REF!=\"\",\"\",Schema!#REF!)","v":{"$error":"#REF!"}},{"$f":"IF(Schema!#REF!=\"\",\"\",Schema!#REF!)","v":{"$error":"#REF!"}},{"$f":"IF(Schema!#REF!=\"\",\"\",Schema!#REF!)","v":{"$error":"#REF!"}},{"$f":"IF(Schema!#REF!=\"\",\"\",Schema!#REF!)","v":{"$error":"#REF!"}},{"$f":"IF(Schema!#REF!=\"\",\"\",Schema!#REF!)","v":{"$error":"#REF!"}}]
[{"$f":"Schema!#REF!&Schema!#REF!&Schema!#REF!&Schema!#REF!","v":{"$error":"#REF!"}},{"$error":"#REF!"},{"$f":"IF(A135=\"\",\"\",IF(LEN(Schema!#REF!)=2,1,IF(LEN(Schema!#REF!)=2,10,IF(LEN(Schema!#REF!)=2,100,0))))","v":{"$error":"#REF!"}},{"$error":"#REF!"},{"$f":"IF(A135=\"\",\"\",SUM(Tabel2[[#This Row],[I1]:[I2]]))","v":{"$error":"#REF!"}},{"$error":"#REF!"},{"$error":"#REF!"},{"$error":"#REF!"},{"$error":"#REF!"},{"$f":"IF(C135=\"\",\"\",IF(LEN(Tabel2[[#This Row],[Entiteit of attribuut]])=2,\"\",Tabel2[[#This Row],[Entiteit]]&\"_\"&Tabel2[[#This Row],[Entiteit of attribuut]]))","v":{"$error":"#REF!"}},{"$f":"IF(Schema!#REF!=\"\",\"\",Schema!#REF!)","v":{"$error":"#REF!"}},{"$f":"IF(Schema!#REF!=\"\",\"\",Schema!#REF!)","v":{"$error":"#REF!"}},{"$f":"IF(Schema!#REF!=\"\",\"\",Schema!#REF!)","v":{"$error":"#REF!"}},{"$f":"IF(Schema!#REF!=\"\",\"\",Schema!#REF!)","v":{"$error":"#REF!"}},{"$f":"IF(Schema!#REF!=\"\",\"\",Schema!#REF!)","v":{"$error":"#REF!"}}]
[{"$f":"Schema!#REF!&Schema!#REF!&Schema!#REF!&Schema!#REF!","v":{"$error":"#REF!"}},{"$error":"#REF!"},{"$f":"IF(A136=\"\",\"\",IF(LEN(Schema!#REF!)=2,1,IF(LEN(Schema!#REF!)=2,10,IF(LEN(Schema!#REF!)=2,100,0))))","v":{"$error":"#REF!"}},{"$error":"#REF!"},{"$f":"IF(A136=\"\",\"\",SUM(Tabel2[[#This Row],[I1]:[I2]]))","v":{"$error":"#REF!"}},{"$error":"#REF!"},{"$error":"#REF!"},{"$error":"#REF!"},{"$error":"#REF!"},{"$f":"IF(C136=\"\",\"\",IF(LEN(Tabel2[[#This Row],[Entiteit of attribuut]])=2,\"\",Tabel2[[#This Row],[Entiteit]]&\"_\"&Tabel2[[#This Row],[Entiteit of attribuut]]))","v":{"$error":"#REF!"}},{"$f":"IF(Schema!#REF!=\"\",\"\",Schema!#REF!)","v":{"$error":"#REF!"}},{"$f":"IF(Schema!#REF!=\"\",\"\",Schema!#REF!)","v":{"$error":"#REF!"}},{"$f":"IF(Schema!#REF!=\"\",\"\",Schema!#REF!)","v":{"$error":"#REF!"}},{"$f":"IF(Schema!#REF!=\"\",\"\",Schema!#REF!)","v":{"$error":"#REF!"}},{"$f":"IF(Schema!#REF!=\"\",\"\",Schema!#REF!)","v":{"$error":"#REF!"}}]
[{"$f":"Schema!#REF!&Schema!#REF!&Schema!#REF!&Schema!#REF!","v":{"$error":"#REF!"}},{"$error":"#REF!"},{"$f":"IF(A137=\"\",\"\",IF(LEN(Schema!#REF!)=2,1,IF(LEN(Schema!#REF!)=2,10,IF(LEN(Schema!#REF!)=2,100,0))))","v":{"$error":"#REF!"}},{"$error":"#REF!"},{"$f":"IF(A137=\"\",\"\",SUM(Tabel2[[#This Row],[I1]:[I2]]))","v":{"$error":"#REF!"}},{"$error":"#REF!"},{"$error":"#REF!"},{"$error":"#REF!"},{"$error":"#REF!"},{"$f":"IF(C137=\"\",\"\",IF(LEN(Tabel2[[#This Row],[Entiteit of attribuut]])=2,\"\",Tabel2[[#This Row],[Entiteit]]&\"_\"&Tabel2[[#This Row],[Entiteit of attribuut]]))","v":{"$error":"#REF!"}},{"$f":"IF(Schema!#REF!=\"\",\"\",Schema!#REF!)","v":{"$error":"#REF!"}},{"$f":"IF(Schema!#REF!=\"\",\"\",Schema!#REF!)","v":{"$error":"#REF!"}},{"$f":"IF(Schema!#REF!=\"\",\"\",Schema!#REF!)","v":{"$error":"#REF!"}},{"$f":"IF(Schema!#REF!=\"\",\"\",Schema!#REF!)","v":{"$error":"#REF!"}},{"$f":"IF(Schema!#REF!=\"\",\"\",Schema!#REF!)","v":{"$error":"#REF!"}}]
[{"$f":"Schema!#REF!&Schema!#REF!&Schema!#REF!&Schema!#REF!","v":{"$error":"#REF!"}},{"$error":"#REF!"},{"$f":"IF(A138=\"\",\"\",IF(LEN(Schema!#REF!)=2,1,IF(LEN(Schema!#REF!)=2,10,IF(LEN(Schema!#REF!)=2,100,0))))","v":{"$error":"#REF!"}},{"$error":"#REF!"},{"$f":"IF(A138=\"\",\"\",SUM(Tabel2[[#This Row],[I1]:[I2]]))","v":{"$error":"#REF!"}},{"$error":"#REF!"},{"$error":"#REF!"},{"$error":"#REF!"},{"$error":"#REF!"},{"$f":"IF(C138=\"\",\"\",IF(LEN(Tabel2[[#This Row],[Entiteit of attribuut]])=2,\"\",Tabel2[[#This Row],[Entiteit]]&\"_\"&Tabel2[[#This Row],[Entiteit of attribuut]]))","v":{"$error":"#REF!"}},{"$f":"IF(Schema!#REF!=\"\",\"\",Schema!#REF!)","v":{"$error":"#REF!"}},{"$f":"IF(Schema!#REF!=\"\",\"\",Schema!#REF!)","v":{"$error":"#REF!"}},{"$f":"IF(Schema!#REF!=\"\",\"\",Schema!#REF!)","v":{"$error":"#REF!"}},{"$f":"IF(Schema!#REF!=\"\",\"\",Schema!#REF!)","v":{"$error":"#REF!"}},{"$f":"IF(Schema!#REF!=\"\",\"\",Schema!#REF!)","v":{"$error":"#REF!"}}]
[{"$f":"Schema!#REF!&Schema!#REF!&Schema!#REF!&Schema!#REF!","v":{"$error":"#REF!"}},{"$error":"#REF!"},{"$f":"IF(A139=\"\",\"\",IF(LEN(Schema!#REF!)=2,1,IF(LEN(Schema!#REF!)=2,10,IF(LEN(Schema!#REF!)=2,100,0))))","v":{"$error":"#REF!"}},{"$error":"#REF!"},{"$f":"IF(A139=\"\",\"\",SUM(Tabel2[[#This Row],[I1]:[I2]]))","v":{"$error":"#REF!"}},{"$error":"#REF!"},{"$error":"#REF!"},{"$error":"#REF!"},{"$error":"#REF!"},{"$f":"IF(C139=\"\",\"\",IF(LEN(Tabel2[[#This Row],[Entiteit of attribuut]])=2,\"\",Tabel2[[#This Row],[Entiteit]]&\"_\"&Tabel2[[#This Row],[Entiteit of attribuut]]))","v":{"$error":"#REF!"}},{"$f":"IF(Schema!#REF!=\"\",\"\",Schema!#REF!)","v":{"$error":"#REF!"}},{"$f":"IF(Schema!#REF!=\"\",\"\",Schema!#REF!)","v":{"$error":"#REF!"}},{"$f":"IF(Schema!#REF!=\"\",\"\",Schema!#REF!)","v":{"$error":"#REF!"}},{"$f":"IF(Schema!#REF!=\"\",\"\",Schema!#REF!)","v":{"$error":"#REF!"}},{"$f":"IF(Schema!#REF!=\"\",\"\",Schema!#REF!)","v":{"$error":"#REF!"}}]
[{"$f":"Schema!#REF!&Schema!#REF!&Schema!#REF!&Schema!#REF!","v":{"$error":"#REF!"}},{"$error":"#REF!"},{"$f":"IF(A140=\"\",\"\",IF(LEN(Schema!#REF!)=2,1,IF(LEN(Schema!#REF!)=2,10,IF(LEN(Schema!#REF!)=2,100,0))))","v":{"$error":"#REF!"}},{"$error":"#REF!"},{"$f":"IF(A140=\"\",\"\",SUM(Tabel2[[#This Row],[I1]:[I2]]))","v":{"$error":"#REF!"}},{"$error":"#REF!"},{"$error":"#REF!"},{"$error":"#REF!"},{"$error":"#REF!"},{"$f":"IF(C140=\"\",\"\",IF(LEN(Tabel2[[#This Row],[Entiteit of attribuut]])=2,\"\",Tabel2[[#This Row],[Entiteit]]&\"_\"&Tabel2[[#This Row],[Entiteit of attribuut]]))","v":{"$error":"#REF!"}},{"$f":"IF(Schema!#REF!=\"\",\"\",Schema!#REF!)","v":{"$error":"#REF!"}},{"$f":"IF(Schema!#REF!=\"\",\"\",Schema!#REF!)","v":{"$error":"#REF!"}},{"$f":"IF(Schema!#REF!=\"\",\"\",Schema!#REF!)","v":{"$error":"#REF!"}},{"$f":"IF(Schema!#REF!=\"\",\"\",Schema!#REF!)","v":{"$error":"#REF!"}},{"$f":"IF(Schema!#REF!=\"\",\"\",Schema!#REF!)","v":{"$error":"#REF!"}}]
[{"$f":"Schema!#REF!&Schema!#REF!&Schema!#REF!&Schema!#REF!","v":{"$error":"#REF!"}},{"$error":"#REF!"},{"$f":"IF(A141=\"\",\"\",IF(LEN(Schema!#REF!)=2,1,IF(LEN(Schema!#REF!)=2,10,IF(LEN(Schema!#REF!)=2,100,0))))","v":{"$error":"#REF!"}},{"$error":"#REF!"},{"$f":"IF(A141=\"\",\"\",SUM(Tabel2[[#This Row],[I1]:[I2]]))","v":{"$error":"#REF!"}},{"$error":"#REF!"},{"$error":"#REF!"},{"$error":"#REF!"},{"$error":"#REF!"},{"$f":"IF(C141=\"\",\"\",IF(LEN(Tabel2[[#This Row],[Entiteit of attribuut]])=2,\"\",Tabel2[[#This Row],[Entiteit]]&\"_\"&Tabel2[[#This Row],[Entiteit of attribuut]]))","v":{"$error":"#REF!"}},{"$f":"IF(Schema!#REF!=\"\",\"\",Schema!#REF!)","v":{"$error":"#REF!"}},{"$f":"IF(Schema!#REF!=\"\",\"\",Schema!#REF!)","v":{"$error":"#REF!"}},{"$f":"IF(Schema!#REF!=\"\",\"\",Schema!#REF!)","v":{"$error":"#REF!"}},{"$f":"IF(Schema!#REF!=\"\",\"\",Schema!#REF!)","v":{"$error":"#REF!"}},{"$f":"IF(Schema!#REF!=\"\",\"\",Schema!#REF!)","v":{"$error":"#REF!"}}]
[{"$f":"Schema!#REF!&Schema!#REF!&Schema!#REF!&Schema!#REF!","v":{"$error":"#REF!"}},{"$error":"#REF!"},{"$f":"IF(A142=\"\",\"\",IF(LEN(Schema!#REF!)=2,1,IF(LEN(Schema!#REF!)=2,10,IF(LEN(Schema!#REF!)=2,100,0))))","v":{"$error":"#REF!"}},{"$error":"#REF!"},{"$f":"IF(A142=\"\",\"\",SUM(Tabel2[[#This Row],[I1]:[I2]]))","v":{"$error":"#REF!"}},{"$error":"#REF!"},{"$error":"#REF!"},{"$error":"#REF!"},{"$error":"#REF!"},{"$f":"IF(C142=\"\",\"\",IF(LEN(Tabel2[[#This Row],[Entiteit of attribuut]])=2,\"\",Tabel2[[#This Row],[Entiteit]]&\"_\"&Tabel2[[#This Row],[Entiteit of attribuut]]))","v":{"$error":"#REF!"}},{"$f":"IF(Schema!#REF!=\"\",\"\",Schema!#REF!)","v":{"$error":"#REF!"}},{"$f":"IF(Schema!#REF!=\"\",\"\",Schema!#REF!)","v":{"$error":"#REF!"}},{"$f":"IF(Schema!#REF!=\"\",\"\",Schema!#REF!)","v":{"$error":"#REF!"}},{"$f":"IF(Schema!#REF!=\"\",\"\",Schema!#REF!)","v":{"$error":"#REF!"}},{"$f":"IF(Schema!#REF!=\"\",\"\",Schema!#REF!)","v":{"$error":"#REF!"}}]
[{"$f":"Schema!#REF!&Schema!#REF!&Schema!#REF!&Schema!#REF!","v":{"$error":"#REF!"}},{"$error":"#REF!"},{"$f":"IF(A143=\"\",\"\",IF(LEN(Schema!#REF!)=2,1,IF(LEN(Schema!#REF!)=2,10,IF(LEN(Schema!#REF!)=2,100,0))))","v":{"$error":"#REF!"}},{"$error":"#REF!"},{"$f":"IF(A143=\"\",\"\",SUM(Tabel2[[#This Row],[I1]:[I2]]))","v":{"$error":"#REF!"}},{"$error":"#REF!"},{"$error":"#REF!"},{"$error":"#REF!"},{"$error":"#REF!"},{"$f":"IF(C143=\"\",\"\",IF(LEN(Tabel2[[#This Row],[Entiteit of attribuut]])=2,\"\",Tabel2[[#This Row],[Entiteit]]&\"_\"&Tabel2[[#This Row],[Entiteit of attribuut]]))","v":{"$error":"#REF!"}},{"$f":"IF(Schema!#REF!=\"\",\"\",Schema!#REF!)","v":{"$error":"#REF!"}},{"$f":"IF(Schema!#REF!=\"\",\"\",Schema!#REF!)","v":{"$error":"#REF!"}},{"$f":"IF(Schema!#REF!=\"\",\"\",Schema!#REF!)","v":{"$error":"#REF!"}},{"$f":"IF(Schema!#REF!=\"\",\"\",Schema!#REF!)","v":{"$error":"#REF!"}},{"$f":"IF(Schema!#REF!=\"\",\"\",Schema!#REF!)","v":{"$error":"#REF!"}}]
[{"$f":"Schema!#REF!&Schema!#REF!&Schema!#REF!&Schema!#REF!","v":{"$error":"#REF!"}},{"$error":"#REF!"},{"$f":"IF(A144=\"\",\"\",IF(LEN(Schema!#REF!)=2,1,IF(LEN(Schema!#REF!)=2,10,IF(LEN(Schema!#REF!)=2,100,0))))","v":{"$error":"#REF!"}},{"$error":"#REF!"},{"$f":"IF(A144=\"\",\"\",SUM(Tabel2[[#This Row],[I1]:[I2]]))","v":{"$error":"#REF!"}},{"$error":"#REF!"},{"$error":"#REF!"},{"$error":"#REF!"},{"$error":"#REF!"},{"$f":"IF(C144=\"\",\"\",IF(LEN(Tabel2[[#This Row],[Entiteit of attribuut]])=2,\"\",Tabel2[[#This Row],[Entiteit]]&\"_\"&Tabel2[[#This Row],[Entiteit of attribuut]]))","v":{"$error":"#REF!"}},{"$f":"IF(Schema!#REF!=\"\",\"\",Schema!#REF!)","v":{"$error":"#REF!"}},{"$f":"IF(Schema!#REF!=\"\",\"\",Schema!#REF!)","v":{"$error":"#REF!"}},{"$f":"IF(Schema!#REF!=\"\",\"\",Schema!#REF!)","v":{"$error":"#REF!"}},{"$f":"IF(Schema!#REF!=\"\",\"\",Schema!#REF!)","v":{"$error":"#REF!"}},{"$f":"IF(Schema!#REF!=\"\",\"\",Schema!#REF!)","v":{"$error":"#REF!"}}]
[{"$f":"Schema!#REF!&Schema!#REF!&Schema!#REF!&Schema!#REF!","v":{"$error":"#REF!"}},{"$error":"#REF!"},{"$f":"IF(A145=\"\",\"\",IF(LEN(Schema!#REF!)=2,1,IF(LEN(Schema!#REF!)=2,10,IF(LEN(Schema!#REF!)=2,100,0))))","v":{"$error":"#REF!"}},{"$error":"#REF!"},{"$f":"IF(A145=\"\",\"\",SUM(Tabel2[[#This Row],[I1]:[I2]]))","v":{"$error":"#REF!"}},{"$error":"#REF!"},{"$error":"#REF!"},{"$error":"#REF!"},{"$error":"#REF!"},{"$f":"IF(C145=\"\",\"\",IF(LEN(Tabel2[[#This Row],[Entiteit of attribuut]])=2,\"\",Tabel2[[#This Row],[Entiteit]]&\"_\"&Tabel2[[#This Row],[Entiteit of attribuut]]))","v":{"$error":"#REF!"}},{"$f":"IF(Schema!#REF!=\"\",\"\",Schema!#REF!)","v":{"$error":"#REF!"}},{"$f":"IF(Schema!#REF!=\"\",\"\",Schema!#REF!)","v":{"$error":"#REF!"}},{"$f":"IF(Schema!#REF!=\"\",\"\",Schema!#REF!)","v":{"$error":"#REF!"}},{"$f":"IF(Schema!#REF!=\"\",\"\",Schema!#REF!)","v":{"$error":"#REF!"}},{"$f":"IF(Schema!#REF!=\"\",\"\",Schema!#REF!)","v":{"$error":"#REF!"}}]
[{"$f":"Schema!#REF!&Schema!#REF!&Schema!#REF!&Schema!#REF!","v":{"$error":"#REF!"}},{"$error":"#REF!"},{"$f":"IF(A146=\"\",\"\",IF(LEN(Schema!#REF!)=2,1,IF(LEN(Schema!#REF!)=2,10,IF(LEN(Schema!#REF!)=2,100,0))))","v":{"$error":"#REF!"}},{"$error":"#REF!"},{"$f":"IF(A146=\"\",\"\",SUM(Tabel2[[#This Row],[I1]:[I2]]))","v":{"$error":"#REF!"}},{"$error":"#REF!"},{"$error":"#REF!"},{"$error":"#REF!"},{"$error":"#REF!"},{"$f":"IF(C146=\"\",\"\",IF(LEN(Tabel2[[#This Row],[Entiteit of attribuut]])=2,\"\",Tabel2[[#This Row],[Entiteit]]&\"_\"&Tabel2[[#This Row],[Entiteit of attribuut]]))","v":{"$error":"#REF!"}},{"$f":"IF(Schema!#REF!=\"\",\"\",Schema!#REF!)","v":{"$error":"#REF!"}},{"$f":"IF(Schema!#REF!=\"\",\"\",Schema!#REF!)","v":{"$error":"#REF!"}},{"$f":"IF(Schema!#REF!=\"\",\"\",Schema!#REF!)","v":{"$error":"#REF!"}},{"$f":"IF(Schema!#REF!=\"\",\"\",Schema!#REF!)","v":{"$error":"#REF!"}},{"$f":"IF(Schema!#REF!=\"\",\"\",Schema!#REF!)","v":{"$error":"#REF!"}}]
[{"$f":"Schema!#REF!&Schema!#REF!&Schema!#REF!&Schema!#REF!","v":{"$error":"#REF!"}},{"$error":"#REF!"},{"$f":"IF(A147=\"\",\"\",IF(LEN(Schema!#REF!)=2,1,IF(LEN(Schema!#REF!)=2,10,IF(LEN(Schema!#REF!)=2,100,0))))","v":{"$error":"#REF!"}},{"$error":"#REF!"},{"$f":"IF(A147=\"\",\"\",SUM(Tabel2[[#This Row],[I1]:[I2]]))","v":{"$error":"#REF!"}},{"$error":"#REF!"},{"$error":"#REF!"},{"$error":"#REF!"},{"$error":"#REF!"},{"$f":"IF(C147=\"\",\"\",IF(LEN(Tabel2[[#This Row],[Entiteit of attribuut]])=2,\"\",Tabel2[[#This Row],[Entiteit]]&\"_\"&Tabel2[[#This Row],[Entiteit of attribuut]]))","v":{"$error":"#REF!"}},{"$f":"IF(Schema!#REF!=\"\",\"\",Schema!#REF!)","v":{"$error":"#REF!"}},{"$f":"IF(Schema!#REF!=\"\",\"\",Schema!#REF!)","v":{"$error":"#REF!"}},{"$f":"IF(Schema!#REF!=\"\",\"\",Schema!#REF!)","v":{"$error":"#REF!"}},{"$f":"IF(Schema!#REF!=\"\",\"\",Schema!#REF!)","v":{"$error":"#REF!"}},{"$f":"IF(Schema!#REF!=\"\",\"\",Schema!#REF!)","v":{"$error":"#REF!"}}]
[{"$f":"Schema!#REF!&Schema!#REF!&Schema!#REF!&Schema!#REF!","v":{"$error":"#REF!"}},{"$error":"#REF!"},{"$f":"IF(A148=\"\",\"\",IF(LEN(Schema!#REF!)=2,1,IF(LEN(Schema!#REF!)=2,10,IF(LEN(Schema!#REF!)=2,100,0))))","v":{"$error":"#REF!"}},{"$error":"#REF!"},{"$f":"IF(A148=\"\",\"\",SUM(Tabel2[[#This Row],[I1]:[I2]]))","v":{"$error":"#REF!"}},{"$error":"#REF!"},{"$error":"#REF!"},{"$error":"#REF!"},{"$error":"#REF!"},{"$f":"IF(C148=\"\",\"\",IF(LEN(Tabel2[[#This Row],[Entiteit of attribuut]])=2,\"\",Tabel2[[#This Row],[Entiteit]]&\"_\"&Tabel2[[#This Row],[Entiteit of attribuut]]))","v":{"$error":"#REF!"}},{"$f":"IF(Schema!#REF!=\"\",\"\",Schema!#REF!)","v":{"$error":"#REF!"}},{"$f":"IF(Schema!#REF!=\"\",\"\",Schema!#REF!)","v":{"$error":"#REF!"}},{"$f":"IF(Schema!#REF!=\"\",\"\",Schema!#REF!)","v":{"$error":"#REF!"}},{"$f":"IF(Schema!#REF!=\"\",\"\",Schema!#REF!)","v":{"$error":"#REF!"}},{"$f":"IF(Schema!#REF!=\"\",\"\",Schema!#REF!)","v":{"$error":"#REF!"}}]
[{"$f":"Schema!#REF!&Schema!#REF!&Schema!#REF!&Schema!#REF!","v":{"$error":"#REF!"}},{"$error":"#REF!"},{"$f":"IF(A149=\"\",\"\",IF(LEN(Schema!#REF!)=2,1,IF(LEN(Schema!#REF!)=2,10,IF(LEN(Schema!#REF!)=2,100,0))))","v":{"$error":"#REF!"}},{"$error":"#REF!"},{"$f":"IF(A149=\"\",\"\",SUM(Tabel2[[#This Row],[I1]:[I2]]))","v":{"$error":"#REF!"}},{"$error":"#REF!"},{"$error":"#REF!"},{"$error":"#REF!"},{"$error":"#REF!"},{"$f":"IF(C149=\"\",\"\",IF(LEN(Tabel2[[#This Row],[Entiteit of attribuut]])=2,\"\",Tabel2[[#This Row],[Entiteit]]&\"_\"&Tabel2[[#This Row],[Entiteit of attribuut]]))","v":{"$error":"#REF!"}},{"$f":"IF(Schema!#REF!=\"\",\"\",Schema!#REF!)","v":{"$error":"#REF!"}},{"$f":"IF(Schema!#REF!=\"\",\"\",Schema!#REF!)","v":{"$error":"#REF!"}},{"$f":"IF(Schema!#REF!=\"\",\"\",Schema!#REF!)","v":{"$error":"#REF!"}},{"$f":"IF(Schema!#REF!=\"\",\"\",Schema!#REF!)","v":{"$error":"#REF!"}},{"$f":"IF(Schema!#REF!=\"\",\"\",Schema!#REF!)","v":{"$error":"#REF!"}}]
[{"$f":"Schema!#REF!&Schema!#REF!&Schema!#REF!&Schema!#REF!","v":{"$error":"#REF!"}},{"$error":"#REF!"},{"$f":"IF(A150=\"\",\"\",IF(LEN(Schema!#REF!)=2,1,IF(LEN(Schema!#REF!)=2,10,IF(LEN(Schema!#REF!)=2,100,0))))","v":{"$error":"#REF!"}},{"$error":"#REF!"},{"$f":"IF(A150=\"\",\"\",SUM(Tabel2[[#This Row],[I1]:[I2]]))","v":{"$error":"#REF!"}},{"$error":"#REF!"},{"$error":"#REF!"},{"$error":"#REF!"},{"$error":"#REF!"},{"$f":"IF(C150=\"\",\"\",IF(LEN(Tabel2[[#This Row],[Entiteit of attribuut]])=2,\"\",Tabel2[[#This Row],[Entiteit]]&\"_\"&Tabel2[[#This Row],[Entiteit of attribuut]]))","v":{"$error":"#REF!"}},{"$f":"IF(Schema!#REF!=\"\",\"\",Schema!#REF!)","v":{"$error":"#REF!"}},{"$f":"IF(Schema!#REF!=\"\",\"\",Schema!#REF!)","v":{"$error":"#REF!"}},{"$f":"IF(Schema!#REF!=\"\",\"\",Schema!#REF!)","v":{"$error":"#REF!"}},{"$f":"IF(Schema!#REF!=\"\",\"\",Schema!#REF!)","v":{"$error":"#REF!"}},{"$f":"IF(Schema!#REF!=\"\",\"\",Schema!#REF!)","v":{"$error":"#REF!"}}]
[{"$f":"Schema!#REF!&Schema!#REF!&Schema!#REF!&Schema!#REF!","v":{"$error":"#REF!"}},{"$error":"#REF!"},{"$f":"IF(A151=\"\",\"\",IF(LEN(Schema!#REF!)=2,1,IF(LEN(Schema!#REF!)=2,10,IF(LEN(Schema!#REF!)=2,100,0))))","v":{"$error":"#REF!"}},{"$error":"#REF!"},{"$f":"IF(A151=\"\",\"\",SUM(Tabel2[[#This Row],[I1]:[I2]]))","v":{"$error":"#REF!"}},{"$error":"#REF!"},{"$error":"#REF!"},{"$error":"#REF!"},{"$error":"#REF!"},{"$f":"IF(C151=\"\",\"\",IF(LEN(Tabel2[[#This Row],[Entiteit of attribuut]])=2,\"\",Tabel2[[#This Row],[Entiteit]]&\"_\"&Tabel2[[#This Row],[Entiteit of attribuut]]))","v":{"$error":"#REF!"}},{"$f":"IF(Schema!#REF!=\"\",\"\",Schema!#REF!)","v":{"$error":"#REF!"}},{"$f":"IF(Schema!#REF!=\"\",\"\",Schema!#REF!)","v":{"$error":"#REF!"}},{"$f":"IF(Schema!#REF!=\"\",\"\",Schema!#REF!)","v":{"$error":"#REF!"}},{"$f":"IF(Schema!#REF!=\"\",\"\",Schema!#REF!)","v":{"$error":"#REF!"}},{"$f":"IF(Schema!#REF!=\"\",\"\",Schema!#REF!)","v":{"$error":"#REF!"}}]
[{"$f":"Schema!#REF!&Schema!#REF!&Schema!#REF!&Schema!#REF!","v":{"$error":"#REF!"}},{"$error":"#REF!"},{"$f":"IF(A152=\"\",\"\",IF(LEN(Schema!#REF!)=2,1,IF(LEN(Schema!#REF!)=2,10,IF(LEN(Schema!#REF!)=2,100,0))))","v":{"$error":"#REF!"}},{"$error":"#REF!"},{"$f":"IF(A152=\"\",\"\",SUM(Tabel2[[#This Row],[I1]:[I2]]))","v":{"$error":"#REF!"}},{"$error":"#REF!"},{"$error":"#REF!"},{"$error":"#REF!"},{"$error":"#REF!"},{"$f":"IF(C152=\"\",\"\",IF(LEN(Tabel2[[#This Row],[Entiteit of attribuut]])=2,\"\",Tabel2[[#This Row],[Entiteit]]&\"_\"&Tabel2[[#This Row],[Entiteit of attribuut]]))","v":{"$error":"#REF!"}},{"$f":"IF(Schema!#REF!=\"\",\"\",Schema!#REF!)","v":{"$error":"#REF!"}},{"$f":"IF(Schema!#REF!=\"\",\"\",Schema!#REF!)","v":{"$error":"#REF!"}},{"$f":"IF(Schema!#REF!=\"\",\"\",Schema!#REF!)","v":{"$error":"#REF!"}},{"$f":"IF(Schema!#REF!=\"\",\"\",Schema!#REF!)","v":{"$error":"#REF!"}},{"$f":"IF(Schema!#REF!=\"\",\"\",Schema!#REF!)","v":{"$error":"#REF!"}}]
[{"$f":"Schema!#REF!&Schema!#REF!&Schema!#REF!&Schema!#REF!","v":{"$error":"#REF!"}},{"$error":"#REF!"},{"$f":"IF(A153=\"\",\"\",IF(LEN(Schema!#REF!)=2,1,IF(LEN(Schema!#REF!)=2,10,IF(LEN(Schema!#REF!)=2,100,0))))","v":{"$error":"#REF!"}},{"$error":"#REF!"},{"$f":"IF(A153=\"\",\"\",SUM(Tabel2[[#This Row],[I1]:[I2]]))","v":{"$error":"#REF!"}},{"$error":"#REF!"},{"$error":"#REF!"},{"$error":"#REF!"},{"$error":"#REF!"},{"$f":"IF(C153=\"\",\"\",IF(LEN(Tabel2[[#This Row],[Entiteit of attribuut]])=2,\"\",Tabel2[[#This Row],[Entiteit]]&\"_\"&Tabel2[[#This Row],[Entiteit of attribuut]]))","v":{"$error":"#REF!"}},{"$f":"IF(Schema!#REF!=\"\",\"\",Schema!#REF!)","v":{"$error":"#REF!"}},{"$f":"IF(Schema!#REF!=\"\",\"\",Schema!#REF!)","v":{"$error":"#REF!"}},{"$f":"IF(Schema!#REF!=\"\",\"\",Schema!#REF!)","v":{"$error":"#REF!"}},{"$f":"IF(Schema!#REF!=\"\",\"\",Schema!#REF!)","v":{"$error":"#REF!"}},{"$f":"IF(Schema!#REF!=\"\",\"\",Schema!#REF!)","v":{"$error":"#REF!"}}]
[{"$f":"Schema!#REF!&Schema!#REF!&Schema!#REF!&Schema!#REF!","v":{"$error":"#REF!"}},{"$error":"#REF!"},{"$f":"IF(A154=\"\",\"\",IF(LEN(Schema!#REF!)=2,1,IF(LEN(Schema!#REF!)=2,10,IF(LEN(Schema!#REF!)=2,100,0))))","v":{"$error":"#REF!"}},{"$error":"#REF!"},{"$f":"IF(A154=\"\",\"\",SUM(Tabel2[[#This Row],[I1]:[I2]]))","v":{"$error":"#REF!"}},{"$error":"#REF!"},{"$error":"#REF!"},{"$error":"#REF!"},{"$error":"#REF!"},{"$f":"IF(C154=\"\",\"\",IF(LEN(Tabel2[[#This Row],[Entiteit of attribuut]])=2,\"\",Tabel2[[#This Row],[Entiteit]]&\"_\"&Tabel2[[#This Row],[Entiteit of attribuut]]))","v":{"$error":"#REF!"}},{"$f":"IF(Schema!#REF!=\"\",\"\",Schema!#REF!)","v":{"$error":"#REF!"}},{"$f":"IF(Schema!#REF!=\"\",\"\",Schema!#REF!)","v":{"$error":"#REF!"}},{"$f":"IF(Schema!#REF!=\"\",\"\",Schema!#REF!)","v":{"$error":"#REF!"}},{"$f":"IF(Schema!#REF!=\"\",\"\",Schema!#REF!)","v":{"$error":"#REF!"}},{"$f":"IF(Schema!#REF!=\"\",\"\",Schema!#REF!)","v":{"$error":"#REF!"}}]
[{"$f":"Schema!#REF!&Schema!#REF!&Schema!#REF!&Schema!#REF!","v":{"$error":"#REF!"}},{"$error":"#REF!"},{"$f":"IF(A155=\"\",\"\",IF(LEN(Schema!#REF!)=2,1,IF(LEN(Schema!#REF!)=2,10,IF(LEN(Schema!#REF!)=2,100,0))))","v":{"$error":"#REF!"}},{"$error":"#REF!"},{"$f":"IF(A155=\"\",\"\",SUM(Tabel2[[#This Row],[I1]:[I2]]))","v":{"$error":"#REF!"}},{"$error":"#REF!"},{"$error":"#REF!"},{"$error":"#REF!"},{"$error":"#REF!"},{"$f":"IF(C155=\"\",\"\",IF(LEN(Tabel2[[#This Row],[Entiteit of attribuut]])=2,\"\",Tabel2[[#This Row],[Entiteit]]&\"_\"&Tabel2[[#This Row],[Entiteit of attribuut]]))","v":{"$error":"#REF!"}},{"$f":"IF(Schema!#REF!=\"\",\"\",Schema!#REF!)","v":{"$error":"#REF!"}},{"$f":"IF(Schema!#REF!=\"\",\"\",Schema!#REF!)","v":{"$error":"#REF!"}},{"$f":"IF(Schema!#REF!=\"\",\"\",Schema!#REF!)","v":{"$error":"#REF!"}},{"$f":"IF(Schema!#REF!=\"\",\"\",Schema!#REF!)","v":{"$error":"#REF!"}},{"$f":"IF(Schema!#REF!=\"\",\"\",Schema!#REF!)","v":{"$error":"#REF!"}}]
[{"$f":"Schema!#REF!&Schema!#REF!&Schema!#REF!&Schema!#REF!","v":{"$error":"#REF!"}},{"$error":"#REF!"},{"$f":"IF(A156=\"\",\"\",IF(LEN(Schema!#REF!)=2,1,IF(LEN(Schema!#REF!)=2,10,IF(LEN(Schema!#REF!)=2,100,0))))","v":{"$error":"#REF!"}},{"$error":"#REF!"},{"$f":"IF(A156=\"\",\"\",SUM(Tabel2[[#This Row],[I1]:[I2]]))","v":{"$error":"#REF!"}},{"$error":"#REF!"},{"$error":"#REF!"},{"$error":"#REF!"},{"$error":"#REF!"},{"$f":"IF(C156=\"\",\"\",IF(LEN(Tabel2[[#This Row],[Entiteit of attribuut]])=2,\"\",Tabel2[[#This Row],[Entiteit]]&\"_\"&Tabel2[[#This Row],[Entiteit of attribuut]]))","v":{"$error":"#REF!"}},{"$f":"IF(Schema!#REF!=\"\",\"\",Schema!#REF!)","v":{"$error":"#REF!"}},{"$f":"IF(Schema!#REF!=\"\",\"\",Schema!#REF!)","v":{"$error":"#REF!"}},{"$f":"IF(Schema!#REF!=\"\",\"\",Schema!#REF!)","v":{"$error":"#REF!"}},{"$f":"IF(Schema!#REF!=\"\",\"\",Schema!#REF!)","v":{"$error":"#REF!"}},{"$f":"IF(Schema!#REF!=\"\",\"\",Schema!#REF!)","v":{"$error":"#REF!"}}]
[{"$f":"Schema!#REF!&Schema!#REF!&Schema!#REF!&Schema!#REF!","v":{"$error":"#REF!"}},{"$error":"#REF!"},{"$f":"IF(A157=\"\",\"\",IF(LEN(Schema!#REF!)=2,1,IF(LEN(Schema!#REF!)=2,10,IF(LEN(Schema!#REF!)=2,100,0))))","v":{"$error":"#REF!"}},{"$error":"#REF!"},{"$f":"IF(A157=\"\",\"\",SUM(Tabel2[[#This Row],[I1]:[I2]]))","v":{"$error":"#REF!"}},{"$error":"#REF!"},{"$error":"#REF!"},{"$error":"#REF!"},{"$error":"#REF!"},{"$f":"IF(C157=\"\",\"\",IF(LEN(Tabel2[[#This Row],[Entiteit of attribuut]])=2,\"\",Tabel2[[#This Row],[Entiteit]]&\"_\"&Tabel2[[#This Row],[Entiteit of attribuut]]))","v":{"$error":"#REF!"}},{"$f":"IF(Schema!#REF!=\"\",\"\",Schema!#REF!)","v":{"$error":"#REF!"}},{"$f":"IF(Schema!#REF!=\"\",\"\",Schema!#REF!)","v":{"$error":"#REF!"}},{"$f":"IF(Schema!#REF!=\"\",\"\",Schema!#REF!)","v":{"$error":"#REF!"}},{"$f":"IF(Schema!#REF!=\"\",\"\",Schema!#REF!)","v":{"$error":"#REF!"}},{"$f":"IF(Schema!#REF!=\"\",\"\",Schema!#REF!)","v":{"$error":"#REF!"}}]
[{"$f":"Schema!#REF!&Schema!#REF!&Schema!#REF!&Schema!#REF!","v":{"$error":"#REF!"}},{"$error":"#REF!"},{"$f":"IF(A158=\"\",\"\",IF(LEN(Schema!#REF!)=2,1,IF(LEN(Schema!#REF!)=2,10,IF(LEN(Schema!#REF!)=2,100,0))))","v":{"$error":"#REF!"}},{"$error":"#REF!"},{"$f":"IF(A158=\"\",\"\",SUM(Tabel2[[#This Row],[I1]:[I2]]))","v":{"$error":"#REF!"}},{"$error":"#REF!"},{"$error":"#REF!"},{"$error":"#REF!"},{"$error":"#REF!"},{"$f":"IF(C158=\"\",\"\",IF(LEN(Tabel2[[#This Row],[Entiteit of attribuut]])=2,\"\",Tabel2[[#This Row],[Entiteit]]&\"_\"&Tabel2[[#This Row],[Entiteit of attribuut]]))","v":{"$error":"#REF!"}},{"$f":"IF(Schema!#REF!=\"\",\"\",Schema!#REF!)","v":{"$error":"#REF!"}},{"$f":"IF(Schema!#REF!=\"\",\"\",Schema!#REF!)","v":{"$error":"#REF!"}},{"$f":"IF(Schema!#REF!=\"\",\"\",Schema!#REF!)","v":{"$error":"#REF!"}},{"$f":"IF(Schema!#REF!=\"\",\"\",Schema!#REF!)","v":{"$error":"#REF!"}},{"$f":"IF(Schema!#REF!=\"\",\"\",Schema!#REF!)","v":{"$error":"#REF!"}}]
[{"$f":"Schema!#REF!&Schema!#REF!&Schema!#REF!&Schema!#REF!","v":{"$error":"#REF!"}},{"$error":"#REF!"},{"$f":"IF(A159=\"\",\"\",IF(LEN(Schema!#REF!)=2,1,IF(LEN(Schema!#REF!)=2,10,IF(LEN(Schema!#REF!)=2,100,0))))","v":{"$error":"#REF!"}},{"$error":"#REF!"},{"$f":"IF(A159=\"\",\"\",SUM(Tabel2[[#This Row],[I1]:[I2]]))","v":{"$error":"#REF!"}},{"$error":"#REF!"},{"$error":"#REF!"},{"$error":"#REF!"},{"$error":"#REF!"},{"$f":"IF(C159=\"\",\"\",IF(LEN(Tabel2[[#This Row],[Entiteit of attribuut]])=2,\"\",Tabel2[[#This Row],[Entiteit]]&\"_\"&Tabel2[[#This Row],[Entiteit of attribuut]]))","v":{"$error":"#REF!"}},{"$f":"IF(Schema!#REF!=\"\",\"\",Schema!#REF!)","v":{"$error":"#REF!"}},{"$f":"IF(Schema!#REF!=\"\",\"\",Schema!#REF!)","v":{"$error":"#REF!"}},{"$f":"IF(Schema!#REF!=\"\",\"\",Schema!#REF!)","v":{"$error":"#REF!"}},{"$f":"IF(Schema!#REF!=\"\",\"\",Schema!#REF!)","v":{"$error":"#REF!"}},{"$f":"IF(Schema!#REF!=\"\",\"\",Schema!#REF!)","v":{"$error":"#REF!"}}]
[{"$f":"Schema!#REF!&Schema!#REF!&Schema!#REF!&Schema!#REF!","v":{"$error":"#REF!"}},{"$error":"#REF!"},{"$f":"IF(A160=\"\",\"\",IF(LEN(Schema!#REF!)=2,1,IF(LEN(Schema!#REF!)=2,10,IF(LEN(Schema!#REF!)=2,100,0))))","v":{"$error":"#REF!"}},{"$error":"#REF!"},{"$f":"IF(A160=\"\",\"\",SUM(Tabel2[[#This Row],[I1]:[I2]]))","v":{"$error":"#REF!"}},{"$error":"#REF!"},{"$error":"#REF!"},{"$error":"#REF!"},{"$error":"#REF!"},{"$f":"IF(C160=\"\",\"\",IF(LEN(Tabel2[[#This Row],[Entiteit of attribuut]])=2,\"\",Tabel2[[#This Row],[Entiteit]]&\"_\"&Tabel2[[#This Row],[Entiteit of attribuut]]))","v":{"$error":"#REF!"}},{"$f":"IF(Schema!#REF!=\"\",\"\",Schema!#REF!)","v":{"$error":"#REF!"}},{"$f":"IF(Schema!#REF!=\"\",\"\",Schema!#REF!)","v":{"$error":"#REF!"}},{"$f":"IF(Schema!#REF!=\"\",\"\",Schema!#REF!)","v":{"$error":"#REF!"}},{"$f":"IF(Schema!#REF!=\"\",\"\",Schema!#REF!)","v":{"$error":"#REF!"}},{"$f":"IF(Schema!#REF!=\"\",\"\",Schema!#REF!)","v":{"$error":"#REF!"}}]
[{"$f":"Schema!#REF!&Schema!#REF!&Schema!#REF!&Schema!#REF!","v":{"$error":"#REF!"}},{"$error":"#REF!"},{"$f":"IF(A161=\"\",\"\",IF(LEN(Schema!#REF!)=2,1,IF(LEN(Schema!#REF!)=2,10,IF(LEN(Schema!#REF!)=2,100,0))))","v":{"$error":"#REF!"}},{"$error":"#REF!"},{"$f":"IF(A161=\"\",\"\",SUM(Tabel2[[#This Row],[I1]:[I2]]))","v":{"$error":"#REF!"}},{"$error":"#REF!"},{"$error":"#REF!"},{"$error":"#REF!"},{"$error":"#REF!"},{"$f":"IF(C161=\"\",\"\",IF(LEN(Tabel2[[#This Row],[Entiteit of attribuut]])=2,\"\",Tabel2[[#This Row],[Entiteit]]&\"_\"&Tabel2[[#This Row],[Entiteit of attribuut]]))","v":{"$error":"#REF!"}},{"$f":"IF(Schema!#REF!=\"\",\"\",Schema!#REF!)","v":{"$error":"#REF!"}},{"$f":"IF(Schema!#REF!=\"\",\"\",Schema!#REF!)","v":{"$error":"#REF!"}},{"$f":"IF(Schema!#REF!=\"\",\"\",Schema!#REF!)","v":{"$error":"#REF!"}},{"$f":"IF(Schema!#REF!=\"\",\"\",Schema!#REF!)","v":{"$error":"#REF!"}},{"$f":"IF(Schema!#REF!=\"\",\"\",Schema!#REF!)","v":{"$error":"#REF!"}}]
[{"$f":"Schema!#REF!&Schema!#REF!&Schema!#REF!&Schema!#REF!","v":{"$error":"#REF!"}},{"$error":"#REF!"},{"$f":"IF(A162=\"\",\"\",IF(LEN(Schema!#REF!)=2,1,IF(LEN(Schema!#REF!)=2,10,IF(LEN(Schema!#REF!)=2,100,0))))","v":{"$error":"#REF!"}},{"$error":"#REF!"},{"$f":"IF(A162=\"\",\"\",SUM(Tabel2[[#This Row],[I1]:[I2]]))","v":{"$error":"#REF!"}},{"$error":"#REF!"},{"$error":"#REF!"},{"$error":"#REF!"},{"$error":"#REF!"},{"$f":"IF(C162=\"\",\"\",IF(LEN(Tabel2[[#This Row],[Entiteit of attribuut]])=2,\"\",Tabel2[[#This Row],[Entiteit]]&\"_\"&Tabel2[[#This Row],[Entiteit of attribuut]]))","v":{"$error":"#REF!"}},{"$f":"IF(Schema!#REF!=\"\",\"\",Schema!#REF!)","v":{"$error":"#REF!"}},{"$f":"IF(Schema!#REF!=\"\",\"\",Schema!#REF!)","v":{"$error":"#REF!"}},{"$f":"IF(Schema!#REF!=\"\",\"\",Schema!#REF!)","v":{"$error":"#REF!"}},{"$f":"IF(Schema!#REF!=\"\",\"\",Schema!#REF!)","v":{"$error":"#REF!"}},{"$f":"IF(Schema!#REF!=\"\",\"\",Schema!#REF!)","v":{"$error":"#REF!"}}]
[{"$f":"Schema!#REF!&Schema!#REF!&Schema!#REF!&Schema!#REF!","v":{"$error":"#REF!"}},{"$error":"#REF!"},{"$f":"IF(A163=\"\",\"\",IF(LEN(Schema!#REF!)=2,1,IF(LEN(Schema!#REF!)=2,10,IF(LEN(Schema!#REF!)=2,100,0))))","v":{"$error":"#REF!"}},{"$error":"#REF!"},{"$f":"IF(A163=\"\",\"\",SUM(Tabel2[[#This Row],[I1]:[I2]]))","v":{"$error":"#REF!"}},{"$error":"#REF!"},{"$error":"#REF!"},{"$error":"#REF!"},{"$error":"#REF!"},{"$f":"IF(C163=\"\",\"\",IF(LEN(Tabel2[[#This Row],[Entiteit of attribuut]])=2,\"\",Tabel2[[#This Row],[Entiteit]]&\"_\"&Tabel2[[#This Row],[Entiteit of attribuut]]))","v":{"$error":"#REF!"}},{"$f":"IF(Schema!#REF!=\"\",\"\",Schema!#REF!)","v":{"$error":"#REF!"}},{"$f":"IF(Schema!#REF!=\"\",\"\",Schema!#REF!)","v":{"$error":"#REF!"}},{"$f":"IF(Schema!#REF!=\"\",\"\",Schema!#REF!)","v":{"$error":"#REF!"}},{"$f":"IF(Schema!#REF!=\"\",\"\",Schema!#REF!)","v":{"$error":"#REF!"}},{"$f":"IF(Schema!#REF!=\"\",\"\",Schema!#REF!)","v":{"$error":"#REF!"}}]
[{"$f":"Schema!#REF!&Schema!#REF!&Schema!#REF!&Schema!#REF!","v":{"$error":"#REF!"}},{"$error":"#REF!"},{"$f":"IF(A164=\"\",\"\",IF(LEN(Schema!#REF!)=2,1,IF(LEN(Schema!#REF!)=2,10,IF(LEN(Schema!#REF!)=2,100,0))))","v":{"$error":"#REF!"}},{"$error":"#REF!"},{"$f":"IF(A164=\"\",\"\",SUM(Tabel2[[#This Row],[I1]:[I2]]))","v":{"$error":"#REF!"}},{"$error":"#REF!"},{"$error":"#REF!"},{"$error":"#REF!"},{"$error":"#REF!"},{"$f":"IF(C164=\"\",\"\",IF(LEN(Tabel2[[#This Row],[Entiteit of attribuut]])=2,\"\",Tabel2[[#This Row],[Entiteit]]&\"_\"&Tabel2[[#This Row],[Entiteit of attribuut]]))","v":{"$error":"#REF!"}},{"$f":"IF(Schema!#REF!=\"\",\"\",Schema!#REF!)","v":{"$error":"#REF!"}},{"$f":"IF(Schema!#REF!=\"\",\"\",Schema!#REF!)","v":{"$error":"#REF!"}},{"$f":"IF(Schema!#REF!=\"\",\"\",Schema!#REF!)","v":{"$error":"#REF!"}},{"$f":"IF(Schema!#REF!=\"\",\"\",Schema!#REF!)","v":{"$error":"#REF!"}},{"$f":"IF(Schema!#REF!=\"\",\"\",Schema!#REF!)","v":{"$error":"#REF!"}}]
[{"$f":"Schema!#REF!&Schema!#REF!&Schema!#REF!&Schema!#REF!","v":{"$error":"#REF!"}},{"$error":"#REF!"},{"$f":"IF(A165=\"\",\"\",IF(LEN(Schema!#REF!)=2,1,IF(LEN(Schema!#REF!)=2,10,IF(LEN(Schema!#REF!)=2,100,0))))","v":{"$error":"#REF!"}},{"$error":"#REF!"},{"$f":"IF(A165=\"\",\"\",SUM(Tabel2[[#This Row],[I1]:[I2]]))","v":{"$error":"#REF!"}},{"$error":"#REF!"},{"$error":"#REF!"},{"$error":"#REF!"},{"$error":"#REF!"},{"$f":"IF(C165=\"\",\"\",IF(LEN(Tabel2[[#This Row],[Entiteit of attribuut]])=2,\"\",Tabel2[[#This Row],[Entiteit]]&\"_\"&Tabel2[[#This Row],[Entiteit of attribuut]]))","v":{"$error":"#REF!"}},{"$f":"IF(Schema!#REF!=\"\",\"\",Schema!#REF!)","v":{"$error":"#REF!"}},{"$f":"IF(Schema!#REF!=\"\",\"\",Schema!#REF!)","v":{"$error":"#REF!"}},{"$f":"IF(Schema!#REF!=\"\",\"\",Schema!#REF!)","v":{"$error":"#REF!"}},{"$f":"IF(Schema!#REF!=\"\",\"\",Schema!#REF!)","v":{"$error":"#REF!"}},{"$f":"IF(Schema!#REF!=\"\",\"\",Schema!#REF!)","v":{"$error":"#REF!"}}]
[{"$f":"Schema!#REF!&Schema!#REF!&Schema!#REF!&Schema!#REF!","v":{"$error":"#REF!"}},{"$error":"#REF!"},{"$f":"IF(A166=\"\",\"\",IF(LEN(Schema!#REF!)=2,1,IF(LEN(Schema!#REF!)=2,10,IF(LEN(Schema!#REF!)=2,100,0))))","v":{"$error":"#REF!"}},{"$error":"#REF!"},{"$f":"IF(A166=\"\",\"\",SUM(Tabel2[[#This Row],[I1]:[I2]]))","v":{"$error":"#REF!"}},{"$error":"#REF!"},{"$error":"#REF!"},{"$error":"#REF!"},{"$error":"#REF!"},{"$f":"IF(C166=\"\",\"\",IF(LEN(Tabel2[[#This Row],[Entiteit of attribuut]])=2,\"\",Tabel2[[#This Row],[Entiteit]]&\"_\"&Tabel2[[#This Row],[Entiteit of attribuut]]))","v":{"$error":"#REF!"}},{"$f":"IF(Schema!#REF!=\"\",\"\",Schema!#REF!)","v":{"$error":"#REF!"}},{"$f":"IF(Schema!#REF!=\"\",\"\",Schema!#REF!)","v":{"$error":"#REF!"}},{"$f":"IF(Schema!#REF!=\"\",\"\",Schema!#REF!)","v":{"$error":"#REF!"}},{"$f":"IF(Schema!#REF!=\"\",\"\",Schema!#REF!)","v":{"$error":"#REF!"}},{"$f":"IF(Schema!#REF!=\"\",\"\",Schema!#REF!)","v":{"$error":"#REF!"}}]
[{"$f":"Schema!#REF!&Schema!#REF!&Schema!#REF!&Schema!#REF!","v":{"$error":"#REF!"}},{"$error":"#REF!"},{"$f":"IF(A167=\"\",\"\",IF(LEN(Schema!#REF!)=2,1,IF(LEN(Schema!#REF!)=2,10,IF(LEN(Schema!#REF!)=2,100,0))))","v":{"$error":"#REF!"}},{"$error":"#REF!"},{"$f":"IF(A167=\"\",\"\",SUM(Tabel2[[#This Row],[I1]:[I2]]))","v":{"$error":"#REF!"}},{"$error":"#REF!"},{"$error":"#REF!"},{"$error":"#REF!"},{"$error":"#REF!"},{"$f":"IF(C167=\"\",\"\",IF(LEN(Tabel2[[#This Row],[Entiteit of attribuut]])=2,\"\",Tabel2[[#This Row],[Entiteit]]&\"_\"&Tabel2[[#This Row],[Entiteit of attribuut]]))","v":{"$error":"#REF!"}},{"$f":"IF(Schema!#REF!=\"\",\"\",Schema!#REF!)","v":{"$error":"#REF!"}},{"$f":"IF(Schema!#REF!=\"\",\"\",Schema!#REF!)","v":{"$error":"#REF!"}},{"$f":"IF(Schema!#REF!=\"\",\"\",Schema!#REF!)","v":{"$error":"#REF!"}},{"$f":"IF(Schema!#REF!=\"\",\"\",Schema!#REF!)","v":{"$error":"#REF!"}},{"$f":"IF(Schema!#REF!=\"\",\"\",Schema!#REF!)","v":{"$error":"#REF!"}}]
[{"$f":"Schema!#REF!&Schema!#REF!&Schema!#REF!&Schema!#REF!","v":{"$error":"#REF!"}},{"$error":"#REF!"},{"$f":"IF(A168=\"\",\"\",IF(LEN(Schema!#REF!)=2,1,IF(LEN(Schema!#REF!)=2,10,IF(LEN(Schema!#REF!)=2,100,0))))","v":{"$error":"#REF!"}},{"$error":"#REF!"},{"$f":"IF(A168=\"\",\"\",SUM(Tabel2[[#This Row],[I1]:[I2]]))","v":{"$error":"#REF!"}},{"$error":"#REF!"},{"$error":"#REF!"},{"$error":"#REF!"},{"$error":"#REF!"},{"$f":"IF(C168=\"\",\"\",IF(LEN(Tabel2[[#This Row],[Entiteit of attribuut]])=2,\"\",Tabel2[[#This Row],[Entiteit]]&\"_\"&Tabel2[[#This Row],[Entiteit of attribuut]]))","v":{"$error":"#REF!"}},{"$f":"IF(Schema!#REF!=\"\",\"\",Schema!#REF!)","v":{"$error":"#REF!"}},{"$f":"IF(Schema!#REF!=\"\",\"\",Schema!#REF!)","v":{"$error":"#REF!"}},{"$f":"IF(Schema!#REF!=\"\",\"\",Schema!#REF!)","v":{"$error":"#REF!"}},{"$f":"IF(Schema!#REF!=\"\",\"\",Schema!#REF!)","v":{"$error":"#REF!"}},{"$f":"IF(Schema!#REF!=\"\",\"\",Schema!#REF!)","v":{"$error":"#REF!"}}]
[{"$f":"Schema!#REF!&Schema!#REF!&Schema!#REF!&Schema!#REF!","v":{"$error":"#REF!"}},{"$error":"#REF!"},{"$f":"IF(A169=\"\",\"\",IF(LEN(Schema!#REF!)=2,1,IF(LEN(Schema!#REF!)=2,10,IF(LEN(Schema!#REF!)=2,100,0))))","v":{"$error":"#REF!"}},{"$error":"#REF!"},{"$f":"IF(A169=\"\",\"\",SUM(Tabel2[[#This Row],[I1]:[I2]]))","v":{"$error":"#REF!"}},{"$error":"#REF!"},{"$error":"#REF!"},{"$error":"#REF!"},{"$error":"#REF!"},{"$f":"IF(C169=\"\",\"\",IF(LEN(Tabel2[[#This Row],[Entiteit of attribuut]])=2,\"\",Tabel2[[#This Row],[Entiteit]]&\"_\"&Tabel2[[#This Row],[Entiteit of attribuut]]))","v":{"$error":"#REF!"}},{"$f":"IF(Schema!#REF!=\"\",\"\",Schema!#REF!)","v":{"$error":"#REF!"}},{"$f":"IF(Schema!#REF!=\"\",\"\",Schema!#REF!)","v":{"$error":"#REF!"}},{"$f":"IF(Schema!#REF!=\"\",\"\",Schema!#REF!)","v":{"$error":"#REF!"}},{"$f":"IF(Schema!#REF!=\"\",\"\",Schema!#REF!)","v":{"$error":"#REF!"}},{"$f":"IF(Schema!#REF!=\"\",\"\",Schema!#REF!)","v":{"$error":"#REF!"}}]
[{"$f":"Schema!#REF!&Schema!#REF!&Schema!#REF!&Schema!#REF!","v":{"$error":"#REF!"}},{"$error":"#REF!"},{"$f":"IF(A170=\"\",\"\",IF(LEN(Schema!#REF!)=2,1,IF(LEN(Schema!#REF!)=2,10,IF(LEN(Schema!#REF!)=2,100,0))))","v":{"$error":"#REF!"}},{"$error":"#REF!"},{"$f":"IF(A170=\"\",\"\",SUM(Tabel2[[#This Row],[I1]:[I2]]))","v":{"$error":"#REF!"}},{"$error":"#REF!"},{"$error":"#REF!"},{"$error":"#REF!"},{"$error":"#REF!"},{"$f":"IF(C170=\"\",\"\",IF(LEN(Tabel2[[#This Row],[Entiteit of attribuut]])=2,\"\",Tabel2[[#This Row],[Entiteit]]&\"_\"&Tabel2[[#This Row],[Entiteit of attribuut]]))","v":{"$error":"#REF!"}},{"$f":"IF(Schema!#REF!=\"\",\"\",Schema!#REF!)","v":{"$error":"#REF!"}},{"$f":"IF(Schema!#REF!=\"\",\"\",Schema!#REF!)","v":{"$error":"#REF!"}},{"$f":"IF(Schema!#REF!=\"\",\"\",Schema!#REF!)","v":{"$error":"#REF!"}},{"$f":"IF(Schema!#REF!=\"\",\"\",Schema!#REF!)","v":{"$error":"#REF!"}},{"$f":"IF(Schema!#REF!=\"\",\"\",Schema!#REF!)","v":{"$error":"#REF!"}}]
[{"$f":"Schema!#REF!&Schema!#REF!&Schema!#REF!&Schema!#REF!","v":{"$error":"#REF!"}},{"$error":"#REF!"},{"$f":"IF(A171=\"\",\"\",IF(LEN(Schema!#REF!)=2,1,IF(LEN(Schema!#REF!)=2,10,IF(LEN(Schema!#REF!)=2,100,0))))","v":{"$error":"#REF!"}},{"$error":"#REF!"},{"$f":"IF(A171=\"\",\"\",SUM(Tabel2[[#This Row],[I1]:[I2]]))","v":{"$error":"#REF!"}},{"$error":"#REF!"},{"$error":"#REF!"},{"$error":"#REF!"},{"$error":"#REF!"},{"$f":"IF(C171=\"\",\"\",IF(LEN(Tabel2[[#This Row],[Entiteit of attribuut]])=2,\"\",Tabel2[[#This Row],[Entiteit]]&\"_\"&Tabel2[[#This Row],[Entiteit of attribuut]]))","v":{"$error":"#REF!"}},{"$f":"IF(Schema!#REF!=\"\",\"\",Schema!#REF!)","v":{"$error":"#REF!"}},{"$f":"IF(Schema!#REF!=\"\",\"\",Schema!#REF!)","v":{"$error":"#REF!"}},{"$f":"IF(Schema!#REF!=\"\",\"\",Schema!#REF!)","v":{"$error":"#REF!"}},{"$f":"IF(Schema!#REF!=\"\",\"\",Schema!#REF!)","v":{"$error":"#REF!"}},{"$f":"IF(Schema!#REF!=\"\",\"\",Schema!#REF!)","v":{"$error":"#REF!"}}]
[{"$f":"Schema!#REF!&Schema!#REF!&Schema!#REF!&Schema!#REF!","v":{"$error":"#REF!"}},{"$error":"#REF!"},{"$f":"IF(A172=\"\",\"\",IF(LEN(Schema!#REF!)=2,1,IF(LEN(Schema!#REF!)=2,10,IF(LEN(Schema!#REF!)=2,100,0))))","v":{"$error":"#REF!"}},{"$error":"#REF!"},{"$f":"IF(A172=\"\",\"\",SUM(Tabel2[[#This Row],[I1]:[I2]]))","v":{"$error":"#REF!"}},{"$error":"#REF!"},{"$error":"#REF!"},{"$error":"#REF!"},{"$error":"#REF!"},{"$f":"IF(C172=\"\",\"\",IF(LEN(Tabel2[[#This Row],[Entiteit of attribuut]])=2,\"\",Tabel2[[#This Row],[Entiteit]]&\"_\"&Tabel2[[#This Row],[Entiteit of attribuut]]))","v":{"$error":"#REF!"}},{"$f":"IF(Schema!#REF!=\"\",\"\",Schema!#REF!)","v":{"$error":"#REF!"}},{"$f":"IF(Schema!#REF!=\"\",\"\",Schema!#REF!)","v":{"$error":"#REF!"}},{"$f":"IF(Schema!#REF!=\"\",\"\",Schema!#REF!)","v":{"$error":"#REF!"}},{"$f":"IF(Schema!#REF!=\"\",\"\",Schema!#REF!)","v":{"$error":"#REF!"}},{"$f":"IF(Schema!#REF!=\"\",\"\",Schema!#REF!)","v":{"$error":"#REF!"}}]
[{"$f":"Schema!#REF!&Schema!#REF!&Schema!#REF!&Schema!#REF!","v":{"$error":"#REF!"}},{"$error":"#REF!"},{"$f":"IF(A173=\"\",\"\",IF(LEN(Schema!#REF!)=2,1,IF(LEN(Schema!#REF!)=2,10,IF(LEN(Schema!#REF!)=2,100,0))))","v":{"$error":"#REF!"}},{"$error":"#REF!"},{"$f":"IF(A173=\"\",\"\",SUM(Tabel2[[#This Row],[I1]:[I2]]))","v":{"$error":"#REF!"}},{"$error":"#REF!"},{"$error":"#REF!"},{"$error":"#REF!"},{"$error":"#REF!"},{"$f":"IF(C173=\"\",\"\",IF(LEN(Tabel2[[#This Row],[Entiteit of attribuut]])=2,\"\",Tabel2[[#This Row],[Entiteit]]&\"_\"&Tabel2[[#This Row],[Entiteit of attribuut]]))","v":{"$error":"#REF!"}},{"$f":"IF(Schema!#REF!=\"\",\"\",Schema!#REF!)","v":{"$error":"#REF!"}},{"$f":"IF(Schema!#REF!=\"\",\"\",Schema!#REF!)","v":{"$error":"#REF!"}},{"$f":"IF(Schema!#REF!=\"\",\"\",Schema!#REF!)","v":{"$error":"#REF!"}},{"$f":"IF(Schema!#REF!=\"\",\"\",Schema!#REF!)","v":{"$error":"#REF!"}},{"$f":"IF(Schema!#REF!=\"\",\"\",Schema!#REF!)","v":{"$error":"#REF!"}}]
[{"$f":"Schema!#REF!&Schema!#REF!&Schema!#REF!&Schema!#REF!","v":{"$error":"#REF!"}},{"$error":"#REF!"},{"$f":"IF(A174=\"\",\"\",IF(LEN(Schema!#REF!)=2,1,IF(LEN(Schema!#REF!)=2,10,IF(LEN(Schema!#REF!)=2,100,0))))","v":{"$error":"#REF!"}},{"$error":"#REF!"},{"$f":"IF(A174=\"\",\"\",SUM(Tabel2[[#This Row],[I1]:[I2]]))","v":{"$error":"#REF!"}},{"$error":"#REF!"},{"$error":"#REF!"},{"$error":"#REF!"},{"$error":"#REF!"},{"$f":"IF(C174=\"\",\"\",IF(LEN(Tabel2[[#This Row],[Entiteit of attribuut]])=2,\"\",Tabel2[[#This Row],[Entiteit]]&\"_\"&Tabel2[[#This Row],[Entiteit of attribuut]]))","v":{"$error":"#REF!"}},{"$f":"IF(Schema!#REF!=\"\",\"\",Schema!#REF!)","v":{"$error":"#REF!"}},{"$f":"IF(Schema!#REF!=\"\",\"\",Schema!#REF!)","v":{"$error":"#REF!"}},{"$f":"IF(Schema!#REF!=\"\",\"\",Schema!#REF!)","v":{"$error":"#REF!"}},{"$f":"IF(Schema!#REF!=\"\",\"\",Schema!#REF!)","v":{"$error":"#REF!"}},{"$f":"IF(Schema!#REF!=\"\",\"\",Schema!#REF!)","v":{"$error":"#REF!"}}]
[{"$f":"Schema!#REF!&Schema!#REF!&Schema!#REF!&Schema!#REF!","v":{"$error":"#REF!"}},{"$error":"#REF!"},{"$f":"IF(A175=\"\",\"\",IF(LEN(Schema!#REF!)=2,1,IF(LEN(Schema!#REF!)=2,10,IF(LEN(Schema!#REF!)=2,100,0))))","v":{"$error":"#REF!"}},{"$error":"#REF!"},{"$f":"IF(A175=\"\",\"\",SUM(Tabel2[[#This Row],[I1]:[I2]]))","v":{"$error":"#REF!"}},{"$error":"#REF!"},{"$error":"#REF!"},{"$error":"#REF!"},{"$error":"#REF!"},{"$f":"IF(C175=\"\",\"\",IF(LEN(Tabel2[[#This Row],[Entiteit of attribuut]])=2,\"\",Tabel2[[#This Row],[Entiteit]]&\"_\"&Tabel2[[#This Row],[Entiteit of attribuut]]))","v":{"$error":"#REF!"}},{"$f":"IF(Schema!#REF!=\"\",\"\",Schema!#REF!)","v":{"$error":"#REF!"}},{"$f":"IF(Schema!#REF!=\"\",\"\",Schema!#REF!)","v":{"$error":"#REF!"}},{"$f":"IF(Schema!#REF!=\"\",\"\",Schema!#REF!)","v":{"$error":"#REF!"}},{"$f":"IF(Schema!#REF!=\"\",\"\",Schema!#REF!)","v":{"$error":"#REF!"}},{"$f":"IF(Schema!#REF!=\"\",\"\",Schema!#REF!)","v":{"$error":"#REF!"}}]
[{"$f":"Schema!#REF!&Schema!#REF!&Schema!#REF!&Schema!#REF!","v":{"$error":"#REF!"}},{"$error":"#REF!"},{"$f":"IF(A176=\"\",\"\",IF(LEN(Schema!#REF!)=2,1,IF(LEN(Schema!#REF!)=2,10,IF(LEN(Schema!#REF!)=2,100,0))))","v":{"$error":"#REF!"}},{"$error":"#REF!"},{"$f":"IF(A176=\"\",\"\",SUM(Tabel2[[#This Row],[I1]:[I2]]))","v":{"$error":"#REF!"}},{"$error":"#REF!"},{"$error":"#REF!"},{"$error":"#REF!"},{"$error":"#REF!"},{"$f":"IF(C176=\"\",\"\",IF(LEN(Tabel2[[#This Row],[Entiteit of attribuut]])=2,\"\",Tabel2[[#This Row],[Entiteit]]&\"_\"&Tabel2[[#This Row],[Entiteit of attribuut]]))","v":{"$error":"#REF!"}},{"$f":"IF(Schema!#REF!=\"\",\"\",Schema!#REF!)","v":{"$error":"#REF!"}},{"$f":"IF(Schema!#REF!=\"\",\"\",Schema!#REF!)","v":{"$error":"#REF!"}},{"$f":"IF(Schema!#REF!=\"\",\"\",Schema!#REF!)","v":{"$error":"#REF!"}},{"$f":"IF(Schema!#REF!=\"\",\"\",Schema!#REF!)","v":{"$error":"#REF!"}},{"$f":"IF(Schema!#REF!=\"\",\"\",Schema!#REF!)","v":{"$error":"#REF!"}}]
[{"$f":"Schema!#REF!&Schema!#REF!&Schema!#REF!&Schema!#REF!","v":{"$error":"#REF!"}},{"$error":"#REF!"},{"$f":"IF(A177=\"\",\"\",IF(LEN(Schema!#REF!)=2,1,IF(LEN(Schema!#REF!)=2,10,IF(LEN(Schema!#REF!)=2,100,0))))","v":{"$error":"#REF!"}},{"$error":"#REF!"},{"$f":"IF(A177=\"\",\"\",SUM(Tabel2[[#This Row],[I1]:[I2]]))","v":{"$error":"#REF!"}},{"$error":"#REF!"},{"$error":"#REF!"},{"$error":"#REF!"},{"$error":"#REF!"},{"$f":"IF(C177=\"\",\"\",IF(LEN(Tabel2[[#This Row],[Entiteit of attribuut]])=2,\"\",Tabel2[[#This Row],[Entiteit]]&\"_\"&Tabel2[[#This Row],[Entiteit of attribuut]]))","v":{"$error":"#REF!"}},{"$f":"IF(Schema!#REF!=\"\",\"\",Schema!#REF!)","v":{"$error":"#REF!"}},{"$f":"IF(Schema!#REF!=\"\",\"\",Schema!#REF!)","v":{"$error":"#REF!"}},{"$f":"IF(Schema!#REF!=\"\",\"\",Schema!#REF!)","v":{"$error":"#REF!"}},{"$f":"IF(Schema!#REF!=\"\",\"\",Schema!#REF!)","v":{"$error":"#REF!"}},{"$f":"IF(Schema!#REF!=\"\",\"\",Schema!#REF!)","v":{"$error":"#REF!"}}]
[{"$f":"Schema!#REF!&Schema!#REF!&Schema!#REF!&Schema!#REF!","v":{"$error":"#REF!"}},{"$error":"#REF!"},{"$f":"IF(A178=\"\",\"\",IF(LEN(Schema!#REF!)=2,1,IF(LEN(Schema!#REF!)=2,10,IF(LEN(Schema!#REF!)=2,100,0))))","v":{"$error":"#REF!"}},{"$error":"#REF!"},{"$f":"IF(A178=\"\",\"\",SUM(Tabel2[[#This Row],[I1]:[I2]]))","v":{"$error":"#REF!"}},{"$error":"#REF!"},{"$error":"#REF!"},{"$error":"#REF!"},{"$error":"#REF!"},{"$f":"IF(C178=\"\",\"\",IF(LEN(Tabel2[[#This Row],[Entiteit of attribuut]])=2,\"\",Tabel2[[#This Row],[Entiteit]]&\"_\"&Tabel2[[#This Row],[Entiteit of attribuut]]))","v":{"$error":"#REF!"}},{"$f":"IF(Schema!#REF!=\"\",\"\",Schema!#REF!)","v":{"$error":"#REF!"}},{"$f":"IF(Schema!#REF!=\"\",\"\",Schema!#REF!)","v":{"$error":"#REF!"}},{"$f":"IF(Schema!#REF!=\"\",\"\",Schema!#REF!)","v":{"$error":"#REF!"}},{"$f":"IF(Schema!#REF!=\"\",\"\",Schema!#REF!)","v":{"$error":"#REF!"}},{"$f":"IF(Schema!#REF!=\"\",\"\",Schema!#REF!)","v":{"$error":"#REF!"}}]
[{"$f":"Schema!#REF!&Schema!#REF!&Schema!#REF!&Schema!#REF!","v":{"$error":"#REF!"}},{"$error":"#REF!"},{"$f":"IF(A179=\"\",\"\",IF(LEN(Schema!#REF!)=2,1,IF(LEN(Schema!#REF!)=2,10,IF(LEN(Schema!#REF!)=2,100,0))))","v":{"$error":"#REF!"}},{"$error":"#REF!"},{"$f":"IF(A179=\"\",\"\",SUM(Tabel2[[#This Row],[I1]:[I2]]))","v":{"$error":"#REF!"}},{"$error":"#REF!"},{"$error":"#REF!"},{"$error":"#REF!"},{"$error":"#REF!"},{"$f":"IF(C179=\"\",\"\",IF(LEN(Tabel2[[#This Row],[Entiteit of attribuut]])=2,\"\",Tabel2[[#This Row],[Entiteit]]&\"_\"&Tabel2[[#This Row],[Entiteit of attribuut]]))","v":{"$error":"#REF!"}},{"$f":"IF(Schema!#REF!=\"\",\"\",Schema!#REF!)","v":{"$error":"#REF!"}},{"$f":"IF(Schema!#REF!=\"\",\"\",Schema!#REF!)","v":{"$error":"#REF!"}},{"$f":"IF(Schema!#REF!=\"\",\"\",Schema!#REF!)","v":{"$error":"#REF!"}},{"$f":"IF(Schema!#REF!=\"\",\"\",Schema!#REF!)","v":{"$error":"#REF!"}},{"$f":"IF(Schema!#REF!=\"\",\"\",Schema!#REF!)","v":{"$error":"#REF!"}}]
[{"$f":"Schema!#REF!&Schema!#REF!&Schema!#REF!&Schema!#REF!","v":{"$error":"#REF!"}},{"$error":"#REF!"},{"$f":"IF(A180=\"\",\"\",IF(LEN(Schema!#REF!)=2,1,IF(LEN(Schema!#REF!)=2,10,IF(LEN(Schema!#REF!)=2,100,0))))","v":{"$error":"#REF!"}},{"$error":"#REF!"},{"$f":"IF(A180=\"\",\"\",SUM(Tabel2[[#This Row],[I1]:[I2]]))","v":{"$error":"#REF!"}},{"$error":"#REF!"},{"$error":"#REF!"},{"$error":"#REF!"},{"$error":"#REF!"},{"$f":"IF(C180=\"\",\"\",IF(LEN(Tabel2[[#This Row],[Entiteit of attribuut]])=2,\"\",Tabel2[[#This Row],[Entiteit]]&\"_\"&Tabel2[[#This Row],[Entiteit of attribuut]]))","v":{"$error":"#REF!"}},{"$f":"IF(Schema!#REF!=\"\",\"\",Schema!#REF!)","v":{"$error":"#REF!"}},{"$f":"IF(Schema!#REF!=\"\",\"\",Schema!#REF!)","v":{"$error":"#REF!"}},{"$f":"IF(Schema!#REF!=\"\",\"\",Schema!#REF!)","v":{"$error":"#REF!"}},{"$f":"IF(Schema!#REF!=\"\",\"\",Schema!#REF!)","v":{"$error":"#REF!"}},{"$f":"IF(Schema!#REF!=\"\",\"\",Schema!#REF!)","v":{"$error":"#REF!"}}]
[{"$f":"Schema!#REF!&Schema!#REF!&Schema!#REF!&Schema!#REF!","v":{"$error":"#REF!"}},{"$error":"#REF!"},{"$f":"IF(A181=\"\",\"\",IF(LEN(Schema!#REF!)=2,1,IF(LEN(Schema!#REF!)=2,10,IF(LEN(Schema!#REF!)=2,100,0))))","v":{"$error":"#REF!"}},{"$error":"#REF!"},{"$f":"IF(A181=\"\",\"\",SUM(Tabel2[[#This Row],[I1]:[I2]]))","v":{"$error":"#REF!"}},{"$error":"#REF!"},{"$error":"#REF!"},{"$error":"#REF!"},{"$error":"#REF!"},{"$f":"IF(C181=\"\",\"\",IF(LEN(Tabel2[[#This Row],[Entiteit of attribuut]])=2,\"\",Tabel2[[#This Row],[Entiteit]]&\"_\"&Tabel2[[#This Row],[Entiteit of attribuut]]))","v":{"$error":"#REF!"}},{"$f":"IF(Schema!#REF!=\"\",\"\",Schema!#REF!)","v":{"$error":"#REF!"}},{"$f":"IF(Schema!#REF!=\"\",\"\",Schema!#REF!)","v":{"$error":"#REF!"}},{"$f":"IF(Schema!#REF!=\"\",\"\",Schema!#REF!)","v":{"$error":"#REF!"}},{"$f":"IF(Schema!#REF!=\"\",\"\",Schema!#REF!)","v":{"$error":"#REF!"}},{"$f":"IF(Schema!#REF!=\"\",\"\",Schema!#REF!)","v":{"$error":"#REF!"}}]
[{"$f":"Schema!#REF!&Schema!#REF!&Schema!#REF!&Schema!#REF!","v":{"$error":"#REF!"}},{"$error":"#REF!"},{"$f":"IF(A182=\"\",\"\",IF(LEN(Schema!#REF!)=2,1,IF(LEN(Schema!#REF!)=2,10,IF(LEN(Schema!#REF!)=2,100,0))))","v":{"$error":"#REF!"}},{"$error":"#REF!"},{"$f":"IF(A182=\"\",\"\",SUM(Tabel2[[#This Row],[I1]:[I2]]))","v":{"$error":"#REF!"}},{"$error":"#REF!"},{"$error":"#REF!"},{"$error":"#REF!"},{"$error":"#REF!"},{"$f":"IF(C182=\"\",\"\",IF(LEN(Tabel2[[#This Row],[Entiteit of attribuut]])=2,\"\",Tabel2[[#This Row],[Entiteit]]&\"_\"&Tabel2[[#This Row],[Entiteit of attribuut]]))","v":{"$error":"#REF!"}},{"$f":"IF(Schema!#REF!=\"\",\"\",Schema!#REF!)","v":{"$error":"#REF!"}},{"$f":"IF(Schema!#REF!=\"\",\"\",Schema!#REF!)","v":{"$error":"#REF!"}},{"$f":"IF(Schema!#REF!=\"\",\"\",Schema!#REF!)","v":{"$error":"#REF!"}},{"$f":"IF(Schema!#REF!=\"\",\"\",Schema!#REF!)","v":{"$error":"#REF!"}},{"$f":"IF(Schema!#REF!=\"\",\"\",Schema!#REF!)","v":{"$error":"#REF!"}}]
[{"$f":"Schema!#REF!&Schema!#REF!&Schema!#REF!&Schema!#REF!","v":{"$error":"#REF!"}},{"$error":"#REF!"},{"$f":"IF(A183=\"\",\"\",IF(LEN(Schema!#REF!)=2,1,IF(LEN(Schema!#REF!)=2,10,IF(LEN(Schema!#REF!)=2,100,0))))","v":{"$error":"#REF!"}},{"$error":"#REF!"},{"$f":"IF(A183=\"\",\"\",SUM(Tabel2[[#This Row],[I1]:[I2]]))","v":{"$error":"#REF!"}},{"$error":"#REF!"},{"$error":"#REF!"},{"$error":"#REF!"},{"$error":"#REF!"},{"$f":"IF(C183=\"\",\"\",IF(LEN(Tabel2[[#This Row],[Entiteit of attribuut]])=2,\"\",Tabel2[[#This Row],[Entiteit]]&\"_\"&Tabel2[[#This Row],[Entiteit of attribuut]]))","v":{"$error":"#REF!"}},{"$f":"IF(Schema!#REF!=\"\",\"\",Schema!#REF!)","v":{"$error":"#REF!"}},{"$f":"IF(Schema!#REF!=\"\",\"\",Schema!#REF!)","v":{"$error":"#REF!"}},{"$f":"IF(Schema!#REF!=\"\",\"\",Schema!#REF!)","v":{"$error":"#REF!"}},{"$f":"IF(Schema!#REF!=\"\",\"\",Schema!#REF!)","v":{"$error":"#REF!"}},{"$f":"IF(Schema!#REF!=\"\",\"\",Schema!#REF!)","v":{"$error":"#REF!"}}]
[{"$f":"Schema!#REF!&Schema!#REF!&Schema!#REF!&Schema!#REF!","v":{"$error":"#REF!"}},{"$error":"#REF!"},{"$f":"IF(A184=\"\",\"\",IF(LEN(Schema!#REF!)=2,1,IF(LEN(Schema!#REF!)=2,10,IF(LEN(Schema!#REF!)=2,100,0))))","v":{"$error":"#REF!"}},{"$error":"#REF!"},{"$f":"IF(A184=\"\",\"\",SUM(Tabel2[[#This Row],[I1]:[I2]]))","v":{"$error":"#REF!"}},{"$error":"#REF!"},{"$error":"#REF!"},{"$error":"#REF!"},{"$error":"#REF!"},{"$f":"IF(C184=\"\",\"\",IF(LEN(Tabel2[[#This Row],[Entiteit of attribuut]])=2,\"\",Tabel2[[#This Row],[Entiteit]]&\"_\"&Tabel2[[#This Row],[Entiteit of attribuut]]))","v":{"$error":"#REF!"}},{"$f":"IF(Schema!#REF!=\"\",\"\",Schema!#REF!)","v":{"$error":"#REF!"}},{"$f":"IF(Schema!#REF!=\"\",\"\",Schema!#REF!)","v":{"$error":"#REF!"}},{"$f":"IF(Schema!#REF!=\"\",\"\",Schema!#REF!)","v":{"$error":"#REF!"}},{"$f":"IF(Schema!#REF!=\"\",\"\",Schema!#REF!)","v":{"$error":"#REF!"}},{"$f":"IF(Schema!#REF!=\"\",\"\",Schema!#REF!)","v":{"$error":"#REF!"}}]
[{"$f":"Schema!#REF!&Schema!#REF!&Schema!#REF!&Schema!#REF!","v":{"$error":"#REF!"}},{"$error":"#REF!"},{"$f":"IF(A185=\"\",\"\",IF(LEN(Schema!#REF!)=2,1,IF(LEN(Schema!#REF!)=2,10,IF(LEN(Schema!#REF!)=2,100,0))))","v":{"$error":"#REF!"}},{"$error":"#REF!"},{"$f":"IF(A185=\"\",\"\",SUM(Tabel2[[#This Row],[I1]:[I2]]))","v":{"$error":"#REF!"}},{"$error":"#REF!"},{"$error":"#REF!"},{"$error":"#REF!"},{"$error":"#REF!"},{"$f":"IF(C185=\"\",\"\",IF(LEN(Tabel2[[#This Row],[Entiteit of attribuut]])=2,\"\",Tabel2[[#This Row],[Entiteit]]&\"_\"&Tabel2[[#This Row],[Entiteit of attribuut]]))","v":{"$error":"#REF!"}},{"$f":"IF(Schema!#REF!=\"\",\"\",Schema!#REF!)","v":{"$error":"#REF!"}},{"$f":"IF(Schema!#REF!=\"\",\"\",Schema!#REF!)","v":{"$error":"#REF!"}},{"$f":"IF(Schema!#REF!=\"\",\"\",Schema!#REF!)","v":{"$error":"#REF!"}},{"$f":"IF(Schema!#REF!=\"\",\"\",Schema!#REF!)","v":{"$error":"#REF!"}},{"$f":"IF(Schema!#REF!=\"\",\"\",Schema!#REF!)","v":{"$error":"#REF!"}}]
[{"$f":"Schema!#REF!&Schema!#REF!&Schema!#REF!&Schema!#REF!","v":{"$error":"#REF!"}},{"$error":"#REF!"},{"$f":"IF(A186=\"\",\"\",IF(LEN(Schema!#REF!)=2,1,IF(LEN(Schema!#REF!)=2,10,IF(LEN(Schema!#REF!)=2,100,0))))","v":{"$error":"#REF!"}},{"$error":"#REF!"},{"$f":"IF(A186=\"\",\"\",SUM(Tabel2[[#This Row],[I1]:[I2]]))","v":{"$error":"#REF!"}},{"$error":"#REF!"},{"$error":"#REF!"},{"$error":"#REF!"},{"$error":"#REF!"},{"$f":"IF(C186=\"\",\"\",IF(LEN(Tabel2[[#This Row],[Entiteit of attribuut]])=2,\"\",Tabel2[[#This Row],[Entiteit]]&\"_\"&Tabel2[[#This Row],[Entiteit of attribuut]]))","v":{"$error":"#REF!"}},{"$f":"IF(Schema!#REF!=\"\",\"\",Schema!#REF!)","v":{"$error":"#REF!"}},{"$f":"IF(Schema!#REF!=\"\",\"\",Schema!#REF!)","v":{"$error":"#REF!"}},{"$f":"IF(Schema!#REF!=\"\",\"\",Schema!#REF!)","v":{"$error":"#REF!"}},{"$f":"IF(Schema!#REF!=\"\",\"\",Schema!#REF!)","v":{"$error":"#REF!"}},{"$f":"IF(Schema!#REF!=\"\",\"\",Schema!#REF!)","v":{"$error":"#REF!"}}]
[{"$f":"Schema!#REF!&Schema!#REF!&Schema!#REF!&Schema!#REF!","v":{"$error":"#REF!"}},{"$error":"#REF!"},{"$f":"IF(A187=\"\",\"\",IF(LEN(Schema!#REF!)=2,1,IF(LEN(Schema!#REF!)=2,10,IF(LEN(Schema!#REF!)=2,100,0))))","v":{"$error":"#REF!"}},{"$error":"#REF!"},{"$f":"IF(A187=\"\",\"\",SUM(Tabel2[[#This Row],[I1]:[I2]]))","v":{"$error":"#REF!"}},{"$error":"#REF!"},{"$error":"#REF!"},{"$error":"#REF!"},{"$error":"#REF!"},{"$f":"IF(C187=\"\",\"\",IF(LEN(Tabel2[[#This Row],[Entiteit of attribuut]])=2,\"\",Tabel2[[#This Row],[Entiteit]]&\"_\"&Tabel2[[#This Row],[Entiteit of attribuut]]))","v":{"$error":"#REF!"}},{"$f":"IF(Schema!#REF!=\"\",\"\",Schema!#REF!)","v":{"$error":"#REF!"}},{"$f":"IF(Schema!#REF!=\"\",\"\",Schema!#REF!)","v":{"$error":"#REF!"}},{"$f":"IF(Schema!#REF!=\"\",\"\",Schema!#REF!)","v":{"$error":"#REF!"}},{"$f":"IF(Schema!#REF!=\"\",\"\",Schema!#REF!)","v":{"$error":"#REF!"}},{"$f":"IF(Schema!#REF!=\"\",\"\",Schema!#REF!)","v":{"$error":"#REF!"}}]
[{"$f":"Schema!#REF!&Schema!#REF!&Schema!#REF!&Schema!#REF!","v":{"$error":"#REF!"}},{"$error":"#REF!"},{"$f":"IF(A188=\"\",\"\",IF(LEN(Schema!#REF!)=2,1,IF(LEN(Schema!#REF!)=2,10,IF(LEN(Schema!#REF!)=2,100,0))))","v":{"$error":"#REF!"}},{"$error":"#REF!"},{"$f":"IF(A188=\"\",\"\",SUM(Tabel2[[#This Row],[I1]:[I2]]))","v":{"$error":"#REF!"}},{"$error":"#REF!"},{"$error":"#REF!"},{"$error":"#REF!"},{"$error":"#REF!"},{"$f":"IF(C188=\"\",\"\",IF(LEN(Tabel2[[#This Row],[Entiteit of attribuut]])=2,\"\",Tabel2[[#This Row],[Entiteit]]&\"_\"&Tabel2[[#This Row],[Entiteit of attribuut]]))","v":{"$error":"#REF!"}},{"$f":"IF(Schema!#REF!=\"\",\"\",Schema!#REF!)","v":{"$error":"#REF!"}},{"$f":"IF(Schema!#REF!=\"\",\"\",Schema!#REF!)","v":{"$error":"#REF!"}},{"$f":"IF(Schema!#REF!=\"\",\"\",Schema!#REF!)","v":{"$error":"#REF!"}},{"$f":"IF(Schema!#REF!=\"\",\"\",Schema!#REF!)","v":{"$error":"#REF!"}},{"$f":"IF(Schema!#REF!=\"\",\"\",Schema!#REF!)","v":{"$error":"#REF!"}}]
[{"$f":"Schema!#REF!&Schema!#REF!&Schema!#REF!&Schema!#REF!","v":{"$error":"#REF!"}},{"$error":"#REF!"},{"$f":"IF(A189=\"\",\"\",IF(LEN(Schema!#REF!)=2,1,IF(LEN(Schema!#REF!)=2,10,IF(LEN(Schema!#REF!)=2,100,0))))","v":{"$error":"#REF!"}},{"$error":"#REF!"},{"$f":"IF(A189=\"\",\"\",SUM(Tabel2[[#This Row],[I1]:[I2]]))","v":{"$error":"#REF!"}},{"$error":"#REF!"},{"$error":"#REF!"},{"$error":"#REF!"},{"$error":"#REF!"},{"$f":"IF(C189=\"\",\"\",IF(LEN(Tabel2[[#This Row],[Entiteit of attribuut]])=2,\"\",Tabel2[[#This Row],[Entiteit]]&\"_\"&Tabel2[[#This Row],[Entiteit of attribuut]]))","v":{"$error":"#REF!"}},{"$f":"IF(Schema!#REF!=\"\",\"\",Schema!#REF!)","v":{"$error":"#REF!"}},{"$f":"IF(Schema!#REF!=\"\",\"\",Schema!#REF!)","v":{"$error":"#REF!"}},{"$f":"IF(Schema!#REF!=\"\",\"\",Schema!#REF!)","v":{"$error":"#REF!"}},{"$f":"IF(Schema!#REF!=\"\",\"\",Schema!#REF!)","v":{"$error":"#REF!"}},{"$f":"IF(Schema!#REF!=\"\",\"\",Schema!#REF!)","v":{"$error":"#REF!"}}]
[{"$f":"Schema!#REF!&Schema!#REF!&Schema!#REF!&Schema!#REF!","v":{"$error":"#REF!"}},{"$error":"#REF!"},{"$f":"IF(A190=\"\",\"\",IF(LEN(Schema!#REF!)=2,1,IF(LEN(Schema!#REF!)=2,10,IF(LEN(Schema!#REF!)=2,100,0))))","v":{"$error":"#REF!"}},{"$error":"#REF!"},{"$f":"IF(A190=\"\",\"\",SUM(Tabel2[[#This Row],[I1]:[I2]]))","v":{"$error":"#REF!"}},{"$error":"#REF!"},{"$error":"#REF!"},{"$error":"#REF!"},{"$error":"#REF!"},{"$f":"IF(C190=\"\",\"\",IF(LEN(Tabel2[[#This Row],[Entiteit of attribuut]])=2,\"\",Tabel2[[#This Row],[Entiteit]]&\"_\"&Tabel2[[#This Row],[Entiteit of attribuut]]))","v":{"$error":"#REF!"}},{"$f":"IF(Schema!#REF!=\"\",\"\",Schema!#REF!)","v":{"$error":"#REF!"}},{"$f":"IF(Schema!#REF!=\"\",\"\",Schema!#REF!)","v":{"$error":"#REF!"}},{"$f":"IF(Schema!#REF!=\"\",\"\",Schema!#REF!)","v":{"$error":"#REF!"}},{"$f":"IF(Schema!#REF!=\"\",\"\",Schema!#REF!)","v":{"$error":"#REF!"}},{"$f":"IF(Schema!#REF!=\"\",\"\",Schema!#REF!)","v":{"$error":"#REF!"}}]
[{"$f":"Schema!#REF!&Schema!#REF!&Schema!#REF!&Schema!#REF!","v":{"$error":"#REF!"}},{"$error":"#REF!"},{"$f":"IF(A191=\"\",\"\",IF(LEN(Schema!#REF!)=2,1,IF(LEN(Schema!#REF!)=2,10,IF(LEN(Schema!#REF!)=2,100,0))))","v":{"$error":"#REF!"}},{"$error":"#REF!"},{"$f":"IF(A191=\"\",\"\",SUM(Tabel2[[#This Row],[I1]:[I2]]))","v":{"$error":"#REF!"}},{"$error":"#REF!"},{"$error":"#REF!"},{"$error":"#REF!"},{"$error":"#REF!"},{"$f":"IF(C191=\"\",\"\",IF(LEN(Tabel2[[#This Row],[Entiteit of attribuut]])=2,\"\",Tabel2[[#This Row],[Entiteit]]&\"_\"&Tabel2[[#This Row],[Entiteit of attribuut]]))","v":{"$error":"#REF!"}},{"$f":"IF(Schema!#REF!=\"\",\"\",Schema!#REF!)","v":{"$error":"#REF!"}},{"$f":"IF(Schema!#REF!=\"\",\"\",Schema!#REF!)","v":{"$error":"#REF!"}},{"$f":"IF(Schema!#REF!=\"\",\"\",Schema!#REF!)","v":{"$error":"#REF!"}},{"$f":"IF(Schema!#REF!=\"\",\"\",Schema!#REF!)","v":{"$error":"#REF!"}},{"$f":"IF(Schema!#REF!=\"\",\"\",Schema!#REF!)","v":{"$error":"#REF!"}}]
[{"$f":"Schema!#REF!&Schema!#REF!&Schema!#REF!&Schema!#REF!","v":{"$error":"#REF!"}},{"$error":"#REF!"},{"$f":"IF(A192=\"\",\"\",IF(LEN(Schema!#REF!)=2,1,IF(LEN(Schema!#REF!)=2,10,IF(LEN(Schema!#REF!)=2,100,0))))","v":{"$error":"#REF!"}},{"$error":"#REF!"},{"$f":"IF(A192=\"\",\"\",SUM(Tabel2[[#This Row],[I1]:[I2]]))","v":{"$error":"#REF!"}},{"$error":"#REF!"},{"$error":"#REF!"},{"$error":"#REF!"},{"$error":"#REF!"},{"$f":"IF(C192=\"\",\"\",IF(LEN(Tabel2[[#This Row],[Entiteit of attribuut]])=2,\"\",Tabel2[[#This Row],[Entiteit]]&\"_\"&Tabel2[[#This Row],[Entiteit of attribuut]]))","v":{"$error":"#REF!"}},{"$f":"IF(Schema!#REF!=\"\",\"\",Schema!#REF!)","v":{"$error":"#REF!"}},{"$f":"IF(Schema!#REF!=\"\",\"\",Schema!#REF!)","v":{"$error":"#REF!"}},{"$f":"IF(Schema!#REF!=\"\",\"\",Schema!#REF!)","v":{"$error":"#REF!"}},{"$f":"IF(Schema!#REF!=\"\",\"\",Schema!#REF!)","v":{"$error":"#REF!"}},{"$f":"IF(Schema!#REF!=\"\",\"\",Schema!#REF!)","v":{"$error":"#REF!"}}]
[{"$f":"Schema!#REF!&Schema!#REF!&Schema!#REF!&Schema!#REF!","v":{"$error":"#REF!"}},{"$error":"#REF!"},{"$f":"IF(A193=\"\",\"\",IF(LEN(Schema!#REF!)=2,1,IF(LEN(Schema!#REF!)=2,10,IF(LEN(Schema!#REF!)=2,100,0))))","v":{"$error":"#REF!"}},{"$error":"#REF!"},{"$f":"IF(A193=\"\",\"\",SUM(Tabel2[[#This Row],[I1]:[I2]]))","v":{"$error":"#REF!"}},{"$error":"#REF!"},{"$error":"#REF!"},{"$error":"#REF!"},{"$error":"#REF!"},{"$f":"IF(C193=\"\",\"\",IF(LEN(Tabel2[[#This Row],[Entiteit of attribuut]])=2,\"\",Tabel2[[#This Row],[Entiteit]]&\"_\"&Tabel2[[#This Row],[Entiteit of attribuut]]))","v":{"$error":"#REF!"}},{"$f":"IF(Schema!#REF!=\"\",\"\",Schema!#REF!)","v":{"$error":"#REF!"}},{"$f":"IF(Schema!#REF!=\"\",\"\",Schema!#REF!)","v":{"$error":"#REF!"}},{"$f":"IF(Schema!#REF!=\"\",\"\",Schema!#REF!)","v":{"$error":"#REF!"}},{"$f":"IF(Schema!#REF!=\"\",\"\",Schema!#REF!)","v":{"$error":"#REF!"}},{"$f":"IF(Schema!#REF!=\"\",\"\",Schema!#REF!)","v":{"$error":"#REF!"}}]
[{"$f":"Schema!#REF!&Schema!#REF!&Schema!#REF!&Schema!#REF!","v":{"$error":"#REF!"}},{"$error":"#REF!"},{"$f":"IF(A194=\"\",\"\",IF(LEN(Schema!#REF!)=2,1,IF(LEN(Schema!#REF!)=2,10,IF(LEN(Schema!#REF!)=2,100,0))))","v":{"$error":"#REF!"}},{"$error":"#REF!"},{"$f":"IF(A194=\"\",\"\",SUM(Tabel2[[#This Row],[I1]:[I2]]))","v":{"$error":"#REF!"}},{"$error":"#REF!"},{"$error":"#REF!"},{"$error":"#REF!"},{"$error":"#REF!"},{"$f":"IF(C194=\"\",\"\",IF(LEN(Tabel2[[#This Row],[Entiteit of attribuut]])=2,\"\",Tabel2[[#This Row],[Entiteit]]&\"_\"&Tabel2[[#This Row],[Entiteit of attribuut]]))","v":{"$error":"#REF!"}},{"$f":"IF(Schema!#REF!=\"\",\"\",Schema!#REF!)","v":{"$error":"#REF!"}},{"$f":"IF(Schema!#REF!=\"\",\"\",Schema!#REF!)","v":{"$error":"#REF!"}},{"$f":"IF(Schema!#REF!=\"\",\"\",Schema!#REF!)","v":{"$error":"#REF!"}},{"$f":"IF(Schema!#REF!=\"\",\"\",Schema!#REF!)","v":{"$error":"#REF!"}},{"$f":"IF(Schema!#REF!=\"\",\"\",Schema!#REF!)","v":{"$error":"#REF!"}}]
[{"$f":"Schema!#REF!&Schema!#REF!&Schema!#REF!&Schema!#REF!","v":{"$error":"#REF!"}},{"$f":"IF(LEN(A195)=2,A195,IF(A195=\"\",\"Leeg\",B194))","v":{"$error":"#REF!"}},{"$f":"IF(A195=\"\",\"\",IF(LEN(Schema!#REF!)=2,1,IF(LEN(Schema!#REF!)=2,10,IF(LEN(Schema!#REF!)=2,100,0))))","v":{"$error":"#REF!"}},{"$f":"IF(C195=0,D194,C195)","v":{"$error":"#REF!"}},{"$f":"IF(A195=\"\",\"\",SUM(Tabel2[[#This Row],[I1]:[I2]]))","v":{"$error":"#REF!"}},{"$f":"IF(A195=\"\",\"\",IF(C195=1,B195,F194))","v":{"$error":"#REF!"}},{"$f":"IF(C195=10,A195,IF(OR(C195=0,C195=100),G194,\"\"))","v":{"$error":"#REF!"}},{"$f":"IF(E195=200,B195,IF(C195=0,H194,\"\"))","v":{"$error":"#REF!"}},{"$f":"IF(C195=\"\",\"\",IF(OR(E195=1,E195=10,E195=100),I194,IF(E195=2,F195,IF(E195=20,F195&\"/\"&G195,IF(E195=200,F195&\"/\"&G195&\"/\"&H195)))))","v":{"$error":"#REF!"}},{"$f":"IF(C195=\"\",\"\",IF(LEN(Tabel2[[#This Row],[Entiteit of attribuut]])=2,\"\",Tabel2[[#This Row],[Entiteit]]&\"_\"&Tabel2[[#This Row],[Entiteit of attribuut]]))","v":{"$error":"#REF!"}},{"$f":"IF(Schema!#REF!=\"\",\"\",Schema!#REF!)","v":{"$error":"#REF!"}},{"$f":"IF(Schema!#REF!=\"\",\"\",Schema!#REF!)","v":{"$error":"#REF!"}},{"$f":"IF(Schema!#REF!=\"\",\"\",Schema!#REF!)","v":{"$error":"#REF!"}},{"$f":"IF(Schema!#REF!=\"\",\"\",Schema!#REF!)","v":{"$error":"#REF!"}},{"$f":"IF(Schema!#REF!=\"\",\"\",Schema!#REF!)","v":{"$error":"#REF!"}}]
[{"$f":"Schema!#REF!&Schema!#REF!&Schema!#REF!&Schema!#REF!","v":{"$error":"#REF!"}},{"$error":"#REF!"},{"$f":"IF(A196=\"\",\"\",IF(LEN(Schema!#REF!)=2,1,IF(LEN(Schema!#REF!)=2,10,IF(LEN(Schema!#REF!)=2,100,0))))","v":{"$error":"#REF!"}},{"$error":"#REF!"},{"$f":"IF(A196=\"\",\"\",SUM(Tabel2[[#This Row],[I1]:[I2]]))","v":{"$error":"#REF!"}},{"$error":"#REF!"},{"$error":"#REF!"},{"$error":"#REF!"},{"$error":"#REF!"},{"$f":"IF(C196=\"\",\"\",IF(LEN(Tabel2[[#This Row],[Entiteit of attribuut]])=2,\"\",Tabel2[[#This Row],[Entiteit]]&\"_\"&Tabel2[[#This Row],[Entiteit of attribuut]]))","v":{"$error":"#REF!"}},{"$f":"IF(Schema!#REF!=\"\",\"\",Schema!#REF!)","v":{"$error":"#REF!"}},{"$f":"IF(Schema!#REF!=\"\",\"\",Schema!#REF!)","v":{"$error":"#REF!"}},{"$f":"IF(Schema!#REF!=\"\",\"\",Schema!#REF!)","v":{"$error":"#REF!"}},{"$f":"IF(Schema!#REF!=\"\",\"\",Schema!#REF!)","v":{"$error":"#REF!"}},{"$f":"IF(Schema!#REF!=\"\",\"\",Schema!#REF!)","v":{"$error":"#REF!"}}]
[{"$f":"Schema!#REF!&Schema!#REF!&Schema!#REF!&Schema!#REF!","v":{"$error":"#REF!"}},{"$error":"#REF!"},{"$f":"IF(A197=\"\",\"\",IF(LEN(Schema!#REF!)=2,1,IF(LEN(Schema!#REF!)=2,10,IF(LEN(Schema!#REF!)=2,100,0))))","v":{"$error":"#REF!"}},{"$error":"#REF!"},{"$f":"IF(A197=\"\",\"\",SUM(Tabel2[[#This Row],[I1]:[I2]]))","v":{"$error":"#REF!"}},{"$error":"#REF!"},{"$error":"#REF!"},{"$error":"#REF!"},{"$error":"#REF!"},{"$f":"IF(C197=\"\",\"\",IF(LEN(Tabel2[[#This Row],[Entiteit of attribuut]])=2,\"\",Tabel2[[#This Row],[Entiteit]]&\"_\"&Tabel2[[#This Row],[Entiteit of attribuut]]))","v":{"$error":"#REF!"}},{"$f":"IF(Schema!#REF!=\"\",\"\",Schema!#REF!)","v":{"$error":"#REF!"}},{"$f":"IF(Schema!#REF!=\"\",\"\",Schema!#REF!)","v":{"$error":"#REF!"}},{"$f":"IF(Schema!#REF!=\"\",\"\",Schema!#REF!)","v":{"$error":"#REF!"}},{"$f":"IF(Schema!#REF!=\"\",\"\",Schema!#REF!)","v":{"$error":"#REF!"}},{"$f":"IF(Schema!#REF!=\"\",\"\",Schema!#REF!)","v":{"$error":"#REF!"}}]
[{"$f":"Schema!#REF!&Schema!#REF!&Schema!#REF!&Schema!#REF!","v":{"$error":"#REF!"}},{"$error":"#REF!"},{"$f":"IF(A198=\"\",\"\",IF(LEN(Schema!#REF!)=2,1,IF(LEN(Schema!#REF!)=2,10,IF(LEN(Schema!#REF!)=2,100,0))))","v":{"$error":"#REF!"}},{"$error":"#REF!"},{"$f":"IF(A198=\"\",\"\",SUM(Tabel2[[#This Row],[I1]:[I2]]))","v":{"$error":"#REF!"}},{"$error":"#REF!"},{"$error":"#REF!"},{"$error":"#REF!"},{"$error":"#REF!"},{"$f":"IF(C198=\"\",\"\",IF(LEN(Tabel2[[#This Row],[Entiteit of attribuut]])=2,\"\",Tabel2[[#This Row],[Entiteit]]&\"_\"&Tabel2[[#This Row],[Entiteit of attribuut]]))","v":{"$error":"#REF!"}},{"$f":"IF(Schema!#REF!=\"\",\"\",Schema!#REF!)","v":{"$error":"#REF!"}},{"$f":"IF(Schema!#REF!=\"\",\"\",Schema!#REF!)","v":{"$error":"#REF!"}},{"$f":"IF(Schema!#REF!=\"\",\"\",Schema!#REF!)","v":{"$error":"#REF!"}},{"$f":"IF(Schema!#REF!=\"\",\"\",Schema!#REF!)","v":{"$error":"#REF!"}},{"$f":"IF(Schema!#REF!=\"\",\"\",Schema!#REF!)","v":{"$error":"#REF!"}}]
[{"$f":"Schema!#REF!&Schema!#REF!&Schema!#REF!&Schema!#REF!","v":{"$error":"#REF!"}},{"$error":"#REF!"},{"$f":"IF(A199=\"\",\"\",IF(LEN(Schema!#REF!)=2,1,IF(LEN(Schema!#REF!)=2,10,IF(LEN(Schema!#REF!)=2,100,0))))","v":{"$error":"#REF!"}},{"$error":"#REF!"},{"$f":"IF(A199=\"\",\"\",SUM(Tabel2[[#This Row],[I1]:[I2]]))","v":{"$error":"#REF!"}},{"$error":"#REF!"},{"$error":"#REF!"},{"$error":"#REF!"},{"$error":"#REF!"},{"$f":"IF(C199=\"\",\"\",IF(LEN(Tabel2[[#This Row],[Entiteit of attribuut]])=2,\"\",Tabel2[[#This Row],[Entiteit]]&\"_\"&Tabel2[[#This Row],[Entiteit of attribuut]]))","v":{"$error":"#REF!"}},{"$f":"IF(Schema!#REF!=\"\",\"\",Schema!#REF!)","v":{"$error":"#REF!"}},{"$f":"IF(Schema!#REF!=\"\",\"\",Schema!#REF!)","v":{"$error":"#REF!"}},{"$f":"IF(Schema!#REF!=\"\",\"\",Schema!#REF!)","v":{"$error":"#REF!"}},{"$f":"IF(Schema!#REF!=\"\",\"\",Schema!#REF!)","v":{"$error":"#REF!"}},{"$f":"IF(Schema!#REF!=\"\",\"\",Schema!#REF!)","v":{"$error":"#REF!"}}]
[{"$f":"Schema!#REF!&Schema!#REF!&Schema!#REF!&Schema!#REF!","v":{"$error":"#REF!"}},{"$error":"#REF!"},{"$f":"IF(A200=\"\",\"\",IF(LEN(Schema!#REF!)=2,1,IF(LEN(Schema!#REF!)=2,10,IF(LEN(Schema!#REF!)=2,100,0))))","v":{"$error":"#REF!"}},{"$error":"#REF!"},{"$f":"IF(A200=\"\",\"\",SUM(Tabel2[[#This Row],[I1]:[I2]]))","v":{"$error":"#REF!"}},{"$error":"#REF!"},{"$error":"#REF!"},{"$error":"#REF!"},{"$error":"#REF!"},{"$f":"IF(C200=\"\",\"\",IF(LEN(Tabel2[[#This Row],[Entiteit of attribuut]])=2,\"\",Tabel2[[#This Row],[Entiteit]]&\"_\"&Tabel2[[#This Row],[Entiteit of attribuut]]))","v":{"$error":"#REF!"}},{"$f":"IF(Schema!#REF!=\"\",\"\",Schema!#REF!)","v":{"$error":"#REF!"}},{"$f":"IF(Schema!#REF!=\"\",\"\",Schema!#REF!)","v":{"$error":"#REF!"}},{"$f":"IF(Schema!#REF!=\"\",\"\",Schema!#REF!)","v":{"$error":"#REF!"}},{"$f":"IF(Schema!#REF!=\"\",\"\",Schema!#REF!)","v":{"$error":"#REF!"}},{"$f":"IF(Schema!#REF!=\"\",\"\",Schema!#REF!)","v":{"$error":"#REF!"}}]
[{"$f":"Schema!#REF!&Schema!#REF!&Schema!#REF!&Schema!#REF!","v":{"$error":"#REF!"}},{"$error":"#REF!"},{"$f":"IF(A201=\"\",\"\",IF(LEN(Schema!#REF!)=2,1,IF(LEN(Schema!#REF!)=2,10,IF(LEN(Schema!#REF!)=2,100,0))))","v":{"$error":"#REF!"}},{"$error":"#REF!"},{"$f":"IF(A201=\"\",\"\",SUM(Tabel2[[#This Row],[I1]:[I2]]))","v":{"$error":"#REF!"}},{"$error":"#REF!"},{"$error":"#REF!"},{"$error":"#REF!"},{"$error":"#REF!"},{"$f":"IF(C201=\"\",\"\",IF(LEN(Tabel2[[#This Row],[Entiteit of attribuut]])=2,\"\",Tabel2[[#This Row],[Entiteit]]&\"_\"&Tabel2[[#This Row],[Entiteit of attribuut]]))","v":{"$error":"#REF!"}},{"$f":"IF(Schema!#REF!=\"\",\"\",Schema!#REF!)","v":{"$error":"#REF!"}},{"$f":"IF(Schema!#REF!=\"\",\"\",Schema!#REF!)","v":{"$error":"#REF!"}},{"$f":"IF(Schema!#REF!=\"\",\"\",Schema!#REF!)","v":{"$error":"#REF!"}},{"$f":"IF(Schema!#REF!=\"\",\"\",Schema!#REF!)","v":{"$error":"#REF!"}},{"$f":"IF(Schema!#REF!=\"\",\"\",Schema!#REF!)","v":{"$error":"#REF!"}}]
[{"$f":"Schema!#REF!&Schema!#REF!&Schema!#REF!&Schema!#REF!","v":{"$error":"#REF!"}},{"$error":"#REF!"},{"$f":"IF(A202=\"\",\"\",IF(LEN(Schema!#REF!)=2,1,IF(LEN(Schema!#REF!)=2,10,IF(LEN(Schema!#REF!)=2,100,0))))","v":{"$error":"#REF!"}},{"$error":"#REF!"},{"$f":"IF(A202=\"\",\"\",SUM(Tabel2[[#This Row],[I1]:[I2]]))","v":{"$error":"#REF!"}},{"$error":"#REF!"},{"$error":"#REF!"},{"$error":"#REF!"},{"$error":"#REF!"},{"$f":"IF(C202=\"\",\"\",IF(LEN(Tabel2[[#This Row],[Entiteit of attribuut]])=2,\"\",Tabel2[[#This Row],[Entiteit]]&\"_\"&Tabel2[[#This Row],[Entiteit of attribuut]]))","v":{"$error":"#REF!"}},{"$f":"IF(Schema!#REF!=\"\",\"\",Schema!#REF!)","v":{"$error":"#REF!"}},{"$f":"IF(Schema!#REF!=\"\",\"\",Schema!#REF!)","v":{"$error":"#REF!"}},{"$f":"IF(Schema!#REF!=\"\",\"\",Schema!#REF!)","v":{"$error":"#REF!"}},{"$f":"IF(Schema!#REF!=\"\",\"\",Schema!#REF!)","v":{"$error":"#REF!"}},{"$f":"IF(Schema!#REF!=\"\",\"\",Schema!#REF!)","v":{"$error":"#REF!"}}]
[{"$f":"Schema!#REF!&Schema!#REF!&Schema!#REF!&Schema!#REF!","v":{"$error":"#REF!"}},{"$error":"#REF!"},{"$f":"IF(A203=\"\",\"\",IF(LEN(Schema!#REF!)=2,1,IF(LEN(Schema!#REF!)=2,10,IF(LEN(Schema!#REF!)=2,100,0))))","v":{"$error":"#REF!"}},{"$error":"#REF!"},{"$f":"IF(A203=\"\",\"\",SUM(Tabel2[[#This Row],[I1]:[I2]]))","v":{"$error":"#REF!"}},{"$error":"#REF!"},{"$error":"#REF!"},{"$error":"#REF!"},{"$error":"#REF!"},{"$f":"IF(C203=\"\",\"\",IF(LEN(Tabel2[[#This Row],[Entiteit of attribuut]])=2,\"\",Tabel2[[#This Row],[Entiteit]]&\"_\"&Tabel2[[#This Row],[Entiteit of attribuut]]))","v":{"$error":"#REF!"}},{"$f":"IF(Schema!#REF!=\"\",\"\",Schema!#REF!)","v":{"$error":"#REF!"}},{"$f":"IF(Schema!#REF!=\"\",\"\",Schema!#REF!)","v":{"$error":"#REF!"}},{"$f":"IF(Schema!#REF!=\"\",\"\",Schema!#REF!)","v":{"$error":"#REF!"}},{"$f":"IF(Schema!#REF!=\"\",\"\",Schema!#REF!)","v":{"$error":"#REF!"}},{"$f":"IF(Schema!#REF!=\"\",\"\",Schema!#REF!)","v":{"$error":"#REF!"}}]
[{"$f":"Schema!#REF!&Schema!#REF!&Schema!#REF!&Schema!#REF!","v":{"$error":"#REF!"}},{"$error":"#REF!"},{"$f":"IF(A204=\"\",\"\",IF(LEN(Schema!#REF!)=2,1,IF(LEN(Schema!#REF!)=2,10,IF(LEN(Schema!#REF!)=2,100,0))))","v":{"$error":"#REF!"}},{"$error":"#REF!"},{"$f":"IF(A204=\"\",\"\",SUM(Tabel2[[#This Row],[I1]:[I2]]))","v":{"$error":"#REF!"}},{"$error":"#REF!"},{"$error":"#REF!"},{"$error":"#REF!"},{"$error":"#REF!"},{"$f":"IF(C204=\"\",\"\",IF(LEN(Tabel2[[#This Row],[Entiteit of attribuut]])=2,\"\",Tabel2[[#This Row],[Entiteit]]&\"_\"&Tabel2[[#This Row],[Entiteit of attribuut]]))","v":{"$error":"#REF!"}},{"$f":"IF(Schema!#REF!=\"\",\"\",Schema!#REF!)","v":{"$error":"#REF!"}},{"$f":"IF(Schema!#REF!=\"\",\"\",Schema!#REF!)","v":{"$error":"#REF!"}},{"$f":"IF(Schema!#REF!=\"\",\"\",Schema!#REF!)","v":{"$error":"#REF!"}},{"$f":"IF(Schema!#REF!=\"\",\"\",Schema!#REF!)","v":{"$error":"#REF!"}},{"$f":"IF(Schema!#REF!=\"\",\"\",Schema!#REF!)","v":{"$error":"#REF!"}}]
[{"$f":"Schema!#REF!&Schema!#REF!&Schema!#REF!&Schema!#REF!","v":{"$error":"#REF!"}},{"$error":"#REF!"},{"$f":"IF(A205=\"\",\"\",IF(LEN(Schema!#REF!)=2,1,IF(LEN(Schema!#REF!)=2,10,IF(LEN(Schema!#REF!)=2,100,0))))","v":{"$error":"#REF!"}},{"$error":"#REF!"},{"$f":"IF(A205=\"\",\"\",SUM(Tabel2[[#This Row],[I1]:[I2]]))","v":{"$error":"#REF!"}},{"$error":"#REF!"},{"$error":"#REF!"},{"$error":"#REF!"},{"$error":"#REF!"},{"$f":"IF(C205=\"\",\"\",IF(LEN(Tabel2[[#This Row],[Entiteit of attribuut]])=2,\"\",Tabel2[[#This Row],[Entiteit]]&\"_\"&Tabel2[[#This Row],[Entiteit of attribuut]]))","v":{"$error":"#REF!"}},{"$f":"IF(Schema!#REF!=\"\",\"\",Schema!#REF!)","v":{"$error":"#REF!"}},{"$f":"IF(Schema!#REF!=\"\",\"\",Schema!#REF!)","v":{"$error":"#REF!"}},{"$f":"IF(Schema!#REF!=\"\",\"\",Schema!#REF!)","v":{"$error":"#REF!"}},{"$f":"IF(Schema!#REF!=\"\",\"\",Schema!#REF!)","v":{"$error":"#REF!"}},{"$f":"IF(Schema!#REF!=\"\",\"\",Schema!#REF!)","v":{"$error":"#REF!"}}]
[{"$f":"Schema!#REF!&Schema!#REF!&Schema!#REF!&Schema!#REF!","v":{"$error":"#REF!"}},{"$error":"#REF!"},{"$f":"IF(A206=\"\",\"\",IF(LEN(Schema!#REF!)=2,1,IF(LEN(Schema!#REF!)=2,10,IF(LEN(Schema!#REF!)=2,100,0))))","v":{"$error":"#REF!"}},{"$error":"#REF!"},{"$f":"IF(A206=\"\",\"\",SUM(Tabel2[[#This Row],[I1]:[I2]]))","v":{"$error":"#REF!"}},{"$error":"#REF!"},{"$error":"#REF!"},{"$error":"#REF!"},{"$error":"#REF!"},{"$f":"IF(C206=\"\",\"\",IF(LEN(Tabel2[[#This Row],[Entiteit of attribuut]])=2,\"\",Tabel2[[#This Row],[Entiteit]]&\"_\"&Tabel2[[#This Row],[Entiteit of attribuut]]))","v":{"$error":"#REF!"}},{"$f":"IF(Schema!#REF!=\"\",\"\",Schema!#REF!)","v":{"$error":"#REF!"}},{"$f":"IF(Schema!#REF!=\"\",\"\",Schema!#REF!)","v":{"$error":"#REF!"}},{"$f":"IF(Schema!#REF!=\"\",\"\",Schema!#REF!)","v":{"$error":"#REF!"}},{"$f":"IF(Schema!#REF!=\"\",\"\",Schema!#REF!)","v":{"$error":"#REF!"}},{"$f":"IF(Schema!#REF!=\"\",\"\",Schema!#REF!)","v":{"$error":"#REF!"}}]
[{"$f":"Schema!#REF!&Schema!#REF!&Schema!#REF!&Schema!#REF!","v":{"$error":"#REF!"}},{"$error":"#REF!"},{"$f":"IF(A207=\"\",\"\",IF(LEN(Schema!#REF!)=2,1,IF(LEN(Schema!#REF!)=2,10,IF(LEN(Schema!#REF!)=2,100,0))))","v":{"$error":"#REF!"}},{"$error":"#REF!"},{"$f":"IF(A207=\"\",\"\",SUM(Tabel2[[#This Row],[I1]:[I2]]))","v":{"$error":"#REF!"}},{"$error":"#REF!"},{"$error":"#REF!"},{"$error":"#REF!"},{"$error":"#REF!"},{"$f":"IF(C207=\"\",\"\",IF(LEN(Tabel2[[#This Row],[Entiteit of attribuut]])=2,\"\",Tabel2[[#This Row],[Entiteit]]&\"_\"&Tabel2[[#This Row],[Entiteit of attribuut]]))","v":{"$error":"#REF!"}},{"$f":"IF(Schema!#REF!=\"\",\"\",Schema!#REF!)","v":{"$error":"#REF!"}},{"$f":"IF(Schema!#REF!=\"\",\"\",Schema!#REF!)","v":{"$error":"#REF!"}},{"$f":"IF(Schema!#REF!=\"\",\"\",Schema!#REF!)","v":{"$error":"#REF!"}},{"$f":"IF(Schema!#REF!=\"\",\"\",Schema!#REF!)","v":{"$error":"#REF!"}},{"$f":"IF(Schema!#REF!=\"\",\"\",Schema!#REF!)","v":{"$error":"#REF!"}}]
[{"$f":"Schema!#REF!&Schema!#REF!&Schema!#REF!&Schema!#REF!","v":{"$error":"#REF!"}},{"$error":"#REF!"},{"$f":"IF(A208=\"\",\"\",IF(LEN(Schema!#REF!)=2,1,IF(LEN(Schema!#REF!)=2,10,IF(LEN(Schema!#REF!)=2,100,0))))","v":{"$error":"#REF!"}},{"$error":"#REF!"},{"$f":"IF(A208=\"\",\"\",SUM(Tabel2[[#This Row],[I1]:[I2]]))","v":{"$error":"#REF!"}},{"$error":"#REF!"},{"$error":"#REF!"},{"$error":"#REF!"},{"$error":"#REF!"},{"$f":"IF(C208=\"\",\"\",IF(LEN(Tabel2[[#This Row],[Entiteit of attribuut]])=2,\"\",Tabel2[[#This Row],[Entiteit]]&\"_\"&Tabel2[[#This Row],[Entiteit of attribuut]]))","v":{"$error":"#REF!"}},{"$f":"IF(Schema!#REF!=\"\",\"\",Schema!#REF!)","v":{"$error":"#REF!"}},{"$f":"IF(Schema!#REF!=\"\",\"\",Schema!#REF!)","v":{"$error":"#REF!"}},{"$f":"IF(Schema!#REF!=\"\",\"\",Schema!#REF!)","v":{"$error":"#REF!"}},{"$f":"IF(Schema!#REF!=\"\",\"\",Schema!#REF!)","v":{"$error":"#REF!"}},{"$f":"IF(Schema!#REF!=\"\",\"\",Schema!#REF!)","v":{"$error":"#REF!"}}]
[{"$f":"Schema!#REF!&Schema!#REF!&Schema!#REF!&Schema!#REF!","v":{"$error":"#REF!"}},{"$error":"#REF!"},{"$f":"IF(A209=\"\",\"\",IF(LEN(Schema!#REF!)=2,1,IF(LEN(Schema!#REF!)=2,10,IF(LEN(Schema!#REF!)=2,100,0))))","v":{"$error":"#REF!"}},{"$error":"#REF!"},{"$f":"IF(A209=\"\",\"\",SUM(Tabel2[[#This Row],[I1]:[I2]]))","v":{"$error":"#REF!"}},{"$error":"#REF!"},{"$error":"#REF!"},{"$error":"#REF!"},{"$error":"#REF!"},{"$f":"IF(C209=\"\",\"\",IF(LEN(Tabel2[[#This Row],[Entiteit of attribuut]])=2,\"\",Tabel2[[#This Row],[Entiteit]]&\"_\"&Tabel2[[#This Row],[Entiteit of attribuut]]))","v":{"$error":"#REF!"}},{"$f":"IF(Schema!#REF!=\"\",\"\",Schema!#REF!)","v":{"$error":"#REF!"}},{"$f":"IF(Schema!#REF!=\"\",\"\",Schema!#REF!)","v":{"$error":"#REF!"}},{"$f":"IF(Schema!#REF!=\"\",\"\",Schema!#REF!)","v":{"$error":"#REF!"}},{"$f":"IF(Schema!#REF!=\"\",\"\",Schema!#REF!)","v":{"$error":"#REF!"}},{"$f":"IF(Schema!#REF!=\"\",\"\",Schema!#REF!)","v":{"$error":"#REF!"}}]
[{"$f":"Schema!#REF!&Schema!#REF!&Schema!#REF!&Schema!#REF!","v":{"$error":"#REF!"}},{"$error":"#REF!"},{"$f":"IF(A210=\"\",\"\",IF(LEN(Schema!#REF!)=2,1,IF(LEN(Schema!#REF!)=2,10,IF(LEN(Schema!#REF!)=2,100,0))))","v":{"$error":"#REF!"}},{"$error":"#REF!"},{"$f":"IF(A210=\"\",\"\",SUM(Tabel2[[#This Row],[I1]:[I2]]))","v":{"$error":"#REF!"}},{"$error":"#REF!"},{"$error":"#REF!"},{"$error":"#REF!"},{"$error":"#REF!"},{"$f":"IF(C210=\"\",\"\",IF(LEN(Tabel2[[#This Row],[Entiteit of attribuut]])=2,\"\",Tabel2[[#This Row],[Entiteit]]&\"_\"&Tabel2[[#This Row],[Entiteit of attribuut]]))","v":{"$error":"#REF!"}},{"$f":"IF(Schema!#REF!=\"\",\"\",Schema!#REF!)","v":{"$error":"#REF!"}},{"$f":"IF(Schema!#REF!=\"\",\"\",Schema!#REF!)","v":{"$error":"#REF!"}},{"$f":"IF(Schema!#REF!=\"\",\"\",Schema!#REF!)","v":{"$error":"#REF!"}},{"$f":"IF(Schema!#REF!=\"\",\"\",Schema!#REF!)","v":{"$error":"#REF!"}},{"$f":"IF(Schema!#REF!=\"\",\"\",Schema!#REF!)","v":{"$error":"#REF!"}}]
[{"$f":"Schema!#REF!&Schema!#REF!&Schema!#REF!&Schema!#REF!","v":{"$error":"#REF!"}},{"$error":"#REF!"},{"$f":"IF(A211=\"\",\"\",IF(LEN(Schema!#REF!)=2,1,IF(LEN(Schema!#REF!)=2,10,IF(LEN(Schema!#REF!)=2,100,0))))","v":{"$error":"#REF!"}},{"$error":"#REF!"},{"$f":"IF(A211=\"\",\"\",SUM(Tabel2[[#This Row],[I1]:[I2]]))","v":{"$error":"#REF!"}},{"$error":"#REF!"},{"$error":"#REF!"},{"$error":"#REF!"},{"$error":"#REF!"},{"$f":"IF(C211=\"\",\"\",IF(LEN(Tabel2[[#This Row],[Entiteit of attribuut]])=2,\"\",Tabel2[[#This Row],[Entiteit]]&\"_\"&Tabel2[[#This Row],[Entiteit of attribuut]]))","v":{"$error":"#REF!"}},{"$f":"IF(Schema!#REF!=\"\",\"\",Schema!#REF!)","v":{"$error":"#REF!"}},{"$f":"IF(Schema!#REF!=\"\",\"\",Schema!#REF!)","v":{"$error":"#REF!"}},{"$f":"IF(Schema!#REF!=\"\",\"\",Schema!#REF!)","v":{"$error":"#REF!"}},{"$f":"IF(Schema!#REF!=\"\",\"\",Schema!#REF!)","v":{"$error":"#REF!"}},{"$f":"IF(Schema!#REF!=\"\",\"\",Schema!#REF!)","v":{"$error":"#REF!"}}]
[{"$f":"Schema!#REF!&Schema!#REF!&Schema!#REF!&Schema!#REF!","v":{"$error":"#REF!"}},{"$error":"#REF!"},{"$f":"IF(A212=\"\",\"\",IF(LEN(Schema!#REF!)=2,1,IF(LEN(Schema!#REF!)=2,10,IF(LEN(Schema!#REF!)=2,100,0))))","v":{"$error":"#REF!"}},{"$error":"#REF!"},{"$f":"IF(A212=\"\",\"\",SUM(Tabel2[[#This Row],[I1]:[I2]]))","v":{"$error":"#REF!"}},{"$error":"#REF!"},{"$error":"#REF!"},{"$error":"#REF!"},{"$error":"#REF!"},{"$f":"IF(C212=\"\",\"\",IF(LEN(Tabel2[[#This Row],[Entiteit of attribuut]])=2,\"\",Tabel2[[#This Row],[Entiteit]]&\"_\"&Tabel2[[#This Row],[Entiteit of attribuut]]))","v":{"$error":"#REF!"}},{"$f":"IF(Schema!#REF!=\"\",\"\",Schema!#REF!)","v":{"$error":"#REF!"}},{"$f":"IF(Schema!#REF!=\"\",\"\",Schema!#REF!)","v":{"$error":"#REF!"}},{"$f":"IF(Schema!#REF!=\"\",\"\",Schema!#REF!)","v":{"$error":"#REF!"}},{"$f":"IF(Schema!#REF!=\"\",\"\",Schema!#REF!)","v":{"$error":"#REF!"}},{"$f":"IF(Schema!#REF!=\"\",\"\",Schema!#REF!)","v":{"$error":"#REF!"}}]
[{"$f":"Schema!#REF!&Schema!#REF!&Schema!#REF!&Schema!#REF!","v":{"$error":"#REF!"}},{"$error":"#REF!"},{"$f":"IF(A213=\"\",\"\",IF(LEN(Schema!#REF!)=2,1,IF(LEN(Schema!#REF!)=2,10,IF(LEN(Schema!#REF!)=2,100,0))))","v":{"$error":"#REF!"}},{"$error":"#REF!"},{"$f":"IF(A213=\"\",\"\",SUM(Tabel2[[#This Row],[I1]:[I2]]))","v":{"$error":"#REF!"}},{"$error":"#REF!"},{"$error":"#REF!"},{"$error":"#REF!"},{"$error":"#REF!"},{"$f":"IF(C213=\"\",\"\",IF(LEN(Tabel2[[#This Row],[Entiteit of attribuut]])=2,\"\",Tabel2[[#This Row],[Entiteit]]&\"_\"&Tabel2[[#This Row],[Entiteit of attribuut]]))","v":{"$error":"#REF!"}},{"$f":"IF(Schema!#REF!=\"\",\"\",Schema!#REF!)","v":{"$error":"#REF!"}},{"$f":"IF(Schema!#REF!=\"\",\"\",Schema!#REF!)","v":{"$error":"#REF!"}},{"$f":"IF(Schema!#REF!=\"\",\"\",Schema!#REF!)","v":{"$error":"#REF!"}},{"$f":"IF(Schema!#REF!=\"\",\"\",Schema!#REF!)","v":{"$error":"#REF!"}},{"$f":"IF(Schema!#REF!=\"\",\"\",Schema!#REF!)","v":{"$error":"#REF!"}}]
[{"$f":"Schema!#REF!&Schema!#REF!&Schema!#REF!&Schema!#REF!","v":{"$error":"#REF!"}},{"$error":"#REF!"},{"$f":"IF(A214=\"\",\"\",IF(LEN(Schema!#REF!)=2,1,IF(LEN(Schema!#REF!)=2,10,IF(LEN(Schema!#REF!)=2,100,0))))","v":{"$error":"#REF!"}},{"$error":"#REF!"},{"$f":"IF(A214=\"\",\"\",SUM(Tabel2[[#This Row],[I1]:[I2]]))","v":{"$error":"#REF!"}},{"$error":"#REF!"},{"$error":"#REF!"},{"$error":"#REF!"},{"$error":"#REF!"},{"$f":"IF(C214=\"\",\"\",IF(LEN(Tabel2[[#This Row],[Entiteit of attribuut]])=2,\"\",Tabel2[[#This Row],[Entiteit]]&\"_\"&Tabel2[[#This Row],[Entiteit of attribuut]]))","v":{"$error":"#REF!"}},{"$f":"IF(Schema!#REF!=\"\",\"\",Schema!#REF!)","v":{"$error":"#REF!"}},{"$f":"IF(Schema!#REF!=\"\",\"\",Schema!#REF!)","v":{"$error":"#REF!"}},{"$f":"IF(Schema!#REF!=\"\",\"\",Schema!#REF!)","v":{"$error":"#REF!"}},{"$f":"IF(Schema!#REF!=\"\",\"\",Schema!#REF!)","v":{"$error":"#REF!"}},{"$f":"IF(Schema!#REF!=\"\",\"\",Schema!#REF!)","v":{"$error":"#REF!"}}]
[{"$f":"Schema!#REF!&Schema!#REF!&Schema!#REF!&Schema!#REF!","v":{"$error":"#REF!"}},{"$error":"#REF!"},{"$f":"IF(A215=\"\",\"\",IF(LEN(Schema!#REF!)=2,1,IF(LEN(Schema!#REF!)=2,10,IF(LEN(Schema!#REF!)=2,100,0))))","v":{"$error":"#REF!"}},{"$error":"#REF!"},{"$f":"IF(A215=\"\",\"\",SUM(Tabel2[[#This Row],[I1]:[I2]]))","v":{"$error":"#REF!"}},{"$error":"#REF!"},{"$error":"#REF!"},{"$error":"#REF!"},{"$error":"#REF!"},{"$f":"IF(C215=\"\",\"\",IF(LEN(Tabel2[[#This Row],[Entiteit of attribuut]])=2,\"\",Tabel2[[#This Row],[Entiteit]]&\"_\"&Tabel2[[#This Row],[Entiteit of attribuut]]))","v":{"$error":"#REF!"}},{"$f":"IF(Schema!#REF!=\"\",\"\",Schema!#REF!)","v":{"$error":"#REF!"}},{"$f":"IF(Schema!#REF!=\"\",\"\",Schema!#REF!)","v":{"$error":"#REF!"}},{"$f":"IF(Schema!#REF!=\"\",\"\",Schema!#REF!)","v":{"$error":"#REF!"}},{"$f":"IF(Schema!#REF!=\"\",\"\",Schema!#REF!)","v":{"$error":"#REF!"}},{"$f":"IF(Schema!#REF!=\"\",\"\",Schema!#REF!)","v":{"$error":"#REF!"}}]
[{"$f":"Schema!#REF!&Schema!#REF!&Schema!#REF!&Schema!#REF!","v":{"$error":"#REF!"}},{"$error":"#REF!"},{"$f":"IF(A216=\"\",\"\",IF(LEN(Schema!#REF!)=2,1,IF(LEN(Schema!#REF!)=2,10,IF(LEN(Schema!#REF!)=2,100,0))))","v":{"$error":"#REF!"}},{"$error":"#REF!"},{"$f":"IF(A216=\"\",\"\",SUM(Tabel2[[#This Row],[I1]:[I2]]))","v":{"$error":"#REF!"}},{"$error":"#REF!"},{"$error":"#REF!"},{"$error":"#REF!"},{"$error":"#REF!"},{"$f":"IF(C216=\"\",\"\",IF(LEN(Tabel2[[#This Row],[Entiteit of attribuut]])=2,\"\",Tabel2[[#This Row],[Entiteit]]&\"_\"&Tabel2[[#This Row],[Entiteit of attribuut]]))","v":{"$error":"#REF!"}},{"$f":"IF(Schema!#REF!=\"\",\"\",Schema!#REF!)","v":{"$error":"#REF!"}},{"$f":"IF(Schema!#REF!=\"\",\"\",Schema!#REF!)","v":{"$error":"#REF!"}},{"$f":"IF(Schema!#REF!=\"\",\"\",Schema!#REF!)","v":{"$error":"#REF!"}},{"$f":"IF(Schema!#REF!=\"\",\"\",Schema!#REF!)","v":{"$error":"#REF!"}},{"$f":"IF(Schema!#REF!=\"\",\"\",Schema!#REF!)","v":{"$error":"#REF!"}}]
[{"$f":"Schema!#REF!&Schema!#REF!&Schema!#REF!&Schema!#REF!","v":{"$error":"#REF!"}},{"$error":"#REF!"},{"$f":"IF(A217=\"\",\"\",IF(LEN(Schema!#REF!)=2,1,IF(LEN(Schema!#REF!)=2,10,IF(LEN(Schema!#REF!)=2,100,0))))","v":{"$error":"#REF!"}},{"$error":"#REF!"},{"$f":"IF(A217=\"\",\"\",SUM(Tabel2[[#This Row],[I1]:[I2]]))","v":{"$error":"#REF!"}},{"$error":"#REF!"},{"$error":"#REF!"},{"$error":"#REF!"},{"$error":"#REF!"},{"$f":"IF(C217=\"\",\"\",IF(LEN(Tabel2[[#This Row],[Entiteit of attribuut]])=2,\"\",Tabel2[[#This Row],[Entiteit]]&\"_\"&Tabel2[[#This Row],[Entiteit of attribuut]]))","v":{"$error":"#REF!"}},{"$f":"IF(Schema!#REF!=\"\",\"\",Schema!#REF!)","v":{"$error":"#REF!"}},{"$f":"IF(Schema!#REF!=\"\",\"\",Schema!#REF!)","v":{"$error":"#REF!"}},{"$f":"IF(Schema!#REF!=\"\",\"\",Schema!#REF!)","v":{"$error":"#REF!"}},{"$f":"IF(Schema!#REF!=\"\",\"\",Schema!#REF!)","v":{"$error":"#REF!"}},{"$f":"IF(Schema!#REF!=\"\",\"\",Schema!#REF!)","v":{"$error":"#REF!"}}]
[{"$f":"Schema!#REF!&Schema!#REF!&Schema!#REF!&Schema!#REF!","v":{"$error":"#REF!"}},{"$error":"#REF!"},{"$f":"IF(A218=\"\",\"\",IF(LEN(Schema!#REF!)=2,1,IF(LEN(Schema!#REF!)=2,10,IF(LEN(Schema!#REF!)=2,100,0))))","v":{"$error":"#REF!"}},{"$error":"#REF!"},{"$f":"IF(A218=\"\",\"\",SUM(Tabel2[[#This Row],[I1]:[I2]]))","v":{"$error":"#REF!"}},{"$error":"#REF!"},{"$error":"#REF!"},{"$error":"#REF!"},{"$error":"#REF!"},{"$f":"IF(C218=\"\",\"\",IF(LEN(Tabel2[[#This Row],[Entiteit of attribuut]])=2,\"\",Tabel2[[#This Row],[Entiteit]]&\"_\"&Tabel2[[#This Row],[Entiteit of attribuut]]))","v":{"$error":"#REF!"}},{"$f":"IF(Schema!#REF!=\"\",\"\",Schema!#REF!)","v":{"$error":"#REF!"}},{"$f":"IF(Schema!#REF!=\"\",\"\",Schema!#REF!)","v":{"$error":"#REF!"}},{"$f":"IF(Schema!#REF!=\"\",\"\",Schema!#REF!)","v":{"$error":"#REF!"}},{"$f":"IF(Schema!#REF!=\"\",\"\",Schema!#REF!)","v":{"$error":"#REF!"}},{"$f":"IF(Schema!#REF!=\"\",\"\",Schema!#REF!)","v":{"$error":"#REF!"}}]
[{"$f":"Schema!#REF!&Schema!#REF!&Schema!#REF!&Schema!#REF!","v":{"$error":"#REF!"}},{"$error":"#REF!"},{"$f":"IF(A219=\"\",\"\",IF(LEN(Schema!#REF!)=2,1,IF(LEN(Schema!#REF!)=2,10,IF(LEN(Schema!#REF!)=2,100,0))))","v":{"$error":"#REF!"}},{"$error":"#REF!"},{"$f":"IF(A219=\"\",\"\",SUM(Tabel2[[#This Row],[I1]:[I2]]))","v":{"$error":"#REF!"}},{"$error":"#REF!"},{"$error":"#REF!"},{"$error":"#REF!"},{"$error":"#REF!"},{"$f":"IF(C219=\"\",\"\",IF(LEN(Tabel2[[#This Row],[Entiteit of attribuut]])=2,\"\",Tabel2[[#This Row],[Entiteit]]&\"_\"&Tabel2[[#This Row],[Entiteit of attribuut]]))","v":{"$error":"#REF!"}},{"$f":"IF(Schema!#REF!=\"\",\"\",Schema!#REF!)","v":{"$error":"#REF!"}},{"$f":"IF(Schema!#REF!=\"\",\"\",Schema!#REF!)","v":{"$error":"#REF!"}},{"$f":"IF(Schema!#REF!=\"\",\"\",Schema!#REF!)","v":{"$error":"#REF!"}},{"$f":"IF(Schema!#REF!=\"\",\"\",Schema!#REF!)","v":{"$error":"#REF!"}},{"$f":"IF(Schema!#REF!=\"\",\"\",Schema!#REF!)","v":{"$error":"#REF!"}}]
[{"$f":"Schema!#REF!&Schema!#REF!&Schema!#REF!&Schema!#REF!","v":{"$error":"#REF!"}},{"$error":"#REF!"},{"$f":"IF(A220=\"\",\"\",IF(LEN(Schema!#REF!)=2,1,IF(LEN(Schema!#REF!)=2,10,IF(LEN(Schema!#REF!)=2,100,0))))","v":{"$error":"#REF!"}},{"$error":"#REF!"},{"$f":"IF(A220=\"\",\"\",SUM(Tabel2[[#This Row],[I1]:[I2]]))","v":{"$error":"#REF!"}},{"$error":"#REF!"},{"$error":"#REF!"},{"$error":"#REF!"},{"$error":"#REF!"},{"$f":"IF(C220=\"\",\"\",IF(LEN(Tabel2[[#This Row],[Entiteit of attribuut]])=2,\"\",Tabel2[[#This Row],[Entiteit]]&\"_\"&Tabel2[[#This Row],[Entiteit of attribuut]]))","v":{"$error":"#REF!"}},{"$f":"IF(Schema!#REF!=\"\",\"\",Schema!#REF!)","v":{"$error":"#REF!"}},{"$f":"IF(Schema!#REF!=\"\",\"\",Schema!#REF!)","v":{"$error":"#REF!"}},{"$f":"IF(Schema!#REF!=\"\",\"\",Schema!#REF!)","v":{"$error":"#REF!"}},{"$f":"IF(Schema!#REF!=\"\",\"\",Schema!#REF!)","v":{"$error":"#REF!"}},{"$f":"IF(Schema!#REF!=\"\",\"\",Schema!#REF!)","v":{"$error":"#REF!"}}]
[{"$f":"Schema!#REF!&Schema!#REF!&Schema!#REF!&Schema!#REF!","v":{"$error":"#REF!"}},{"$error":"#REF!"},{"$f":"IF(A221=\"\",\"\",IF(LEN(Schema!#REF!)=2,1,IF(LEN(Schema!#REF!)=2,10,IF(LEN(Schema!#REF!)=2,100,0))))","v":{"$error":"#REF!"}},{"$error":"#REF!"},{"$f":"IF(A221=\"\",\"\",SUM(Tabel2[[#This Row],[I1]:[I2]]))","v":{"$error":"#REF!"}},{"$error":"#REF!"},{"$error":"#REF!"},{"$error":"#REF!"},{"$error":"#REF!"},{"$f":"IF(C221=\"\",\"\",IF(LEN(Tabel2[[#This Row],[Entiteit of attribuut]])=2,\"\",Tabel2[[#This Row],[Entiteit]]&\"_\"&Tabel2[[#This Row],[Entiteit of attribuut]]))","v":{"$error":"#REF!"}},{"$f":"IF(Schema!#REF!=\"\",\"\",Schema!#REF!)","v":{"$error":"#REF!"}},{"$f":"IF(Schema!#REF!=\"\",\"\",Schema!#REF!)","v":{"$error":"#REF!"}},{"$f":"IF(Schema!#REF!=\"\",\"\",Schema!#REF!)","v":{"$error":"#REF!"}},{"$f":"IF(Schema!#REF!=\"\",\"\",Schema!#REF!)","v":{"$error":"#REF!"}},{"$f":"IF(Schema!#REF!=\"\",\"\",Schema!#REF!)","v":{"$error":"#REF!"}}]
[{"$f":"Schema!#REF!&Schema!#REF!&Schema!#REF!&Schema!#REF!","v":{"$error":"#REF!"}},{"$error":"#REF!"},{"$f":"IF(A222=\"\",\"\",IF(LEN(Schema!#REF!)=2,1,IF(LEN(Schema!#REF!)=2,10,IF(LEN(Schema!#REF!)=2,100,0))))","v":{"$error":"#REF!"}},{"$error":"#REF!"},{"$f":"IF(A222=\"\",\"\",SUM(Tabel2[[#This Row],[I1]:[I2]]))","v":{"$error":"#REF!"}},{"$error":"#REF!"},{"$error":"#REF!"},{"$error":"#REF!"},{"$error":"#REF!"},{"$f":"IF(C222=\"\",\"\",IF(LEN(Tabel2[[#This Row],[Entiteit of attribuut]])=2,\"\",Tabel2[[#This Row],[Entiteit]]&\"_\"&Tabel2[[#This Row],[Entiteit of attribuut]]))","v":{"$error":"#REF!"}},{"$f":"IF(Schema!#REF!=\"\",\"\",Schema!#REF!)","v":{"$error":"#REF!"}},{"$f":"IF(Schema!#REF!=\"\",\"\",Schema!#REF!)","v":{"$error":"#REF!"}},{"$f":"IF(Schema!#REF!=\"\",\"\",Schema!#REF!)","v":{"$error":"#REF!"}},{"$f":"IF(Schema!#REF!=\"\",\"\",Schema!#REF!)","v":{"$error":"#REF!"}},{"$f":"IF(Schema!#REF!=\"\",\"\",Schema!#REF!)","v":{"$error":"#REF!"}}]
[{"$f":"Schema!#REF!&Schema!#REF!&Schema!#REF!&Schema!#REF!","v":{"$error":"#REF!"}},{"$error":"#REF!"},{"$f":"IF(A223=\"\",\"\",IF(LEN(Schema!#REF!)=2,1,IF(LEN(Schema!#REF!)=2,10,IF(LEN(Schema!#REF!)=2,100,0))))","v":{"$error":"#REF!"}},{"$error":"#REF!"},{"$f":"IF(A223=\"\",\"\",SUM(Tabel2[[#This Row],[I1]:[I2]]))","v":{"$error":"#REF!"}},{"$error":"#REF!"},{"$error":"#REF!"},{"$error":"#REF!"},{"$error":"#REF!"},{"$f":"IF(C223=\"\",\"\",IF(LEN(Tabel2[[#This Row],[Entiteit of attribuut]])=2,\"\",Tabel2[[#This Row],[Entiteit]]&\"_\"&Tabel2[[#This Row],[Entiteit of attribuut]]))","v":{"$error":"#REF!"}},{"$f":"IF(Schema!#REF!=\"\",\"\",Schema!#REF!)","v":{"$error":"#REF!"}},{"$f":"IF(Schema!#REF!=\"\",\"\",Schema!#REF!)","v":{"$error":"#REF!"}},{"$f":"IF(Schema!#REF!=\"\",\"\",Schema!#REF!)","v":{"$error":"#REF!"}},{"$f":"IF(Schema!#REF!=\"\",\"\",Schema!#REF!)","v":{"$error":"#REF!"}},{"$f":"IF(Schema!#REF!=\"\",\"\",Schema!#REF!)","v":{"$error":"#REF!"}}]
[{"$f":"Schema!#REF!&Schema!#REF!&Schema!#REF!&Schema!#REF!","v":{"$error":"#REF!"}},{"$error":"#REF!"},{"$f":"IF(A224=\"\",\"\",IF(LEN(Schema!#REF!)=2,1,IF(LEN(Schema!#REF!)=2,10,IF(LEN(Schema!#REF!)=2,100,0))))","v":{"$error":"#REF!"}},{"$error":"#REF!"},{"$f":"IF(A224=\"\",\"\",SUM(Tabel2[[#This Row],[I1]:[I2]]))","v":{"$error":"#REF!"}},{"$error":"#REF!"},{"$error":"#REF!"},{"$error":"#REF!"},{"$error":"#REF!"},{"$f":"IF(C224=\"\",\"\",IF(LEN(Tabel2[[#This Row],[Entiteit of attribuut]])=2,\"\",Tabel2[[#This Row],[Entiteit]]&\"_\"&Tabel2[[#This Row],[Entiteit of attribuut]]))","v":{"$error":"#REF!"}},{"$f":"IF(Schema!#REF!=\"\",\"\",Schema!#REF!)","v":{"$error":"#REF!"}},{"$f":"IF(Schema!#REF!=\"\",\"\",Schema!#REF!)","v":{"$error":"#REF!"}},{"$f":"IF(Schema!#REF!=\"\",\"\",Schema!#REF!)","v":{"$error":"#REF!"}},{"$f":"IF(Schema!#REF!=\"\",\"\",Schema!#REF!)","v":{"$error":"#REF!"}},{"$f":"IF(Schema!#REF!=\"\",\"\",Schema!#REF!)","v":{"$error":"#REF!"}}]
[{"$f":"Schema!#REF!&Schema!#REF!&Schema!#REF!&Schema!#REF!","v":{"$error":"#REF!"}},{"$error":"#REF!"},{"$f":"IF(A225=\"\",\"\",IF(LEN(Schema!#REF!)=2,1,IF(LEN(Schema!#REF!)=2,10,IF(LEN(Schema!#REF!)=2,100,0))))","v":{"$error":"#REF!"}},{"$error":"#REF!"},{"$f":"IF(A225=\"\",\"\",SUM(Tabel2[[#This Row],[I1]:[I2]]))","v":{"$error":"#REF!"}},{"$error":"#REF!"},{"$error":"#REF!"},{"$error":"#REF!"},{"$error":"#REF!"},{"$f":"IF(C225=\"\",\"\",IF(LEN(Tabel2[[#This Row],[Entiteit of attribuut]])=2,\"\",Tabel2[[#This Row],[Entiteit]]&\"_\"&Tabel2[[#This Row],[Entiteit of attribuut]]))","v":{"$error":"#REF!"}},{"$f":"IF(Schema!#REF!=\"\",\"\",Schema!#REF!)","v":{"$error":"#REF!"}},{"$f":"IF(Schema!#REF!=\"\",\"\",Schema!#REF!)","v":{"$error":"#REF!"}},{"$f":"IF(Schema!#REF!=\"\",\"\",Schema!#REF!)","v":{"$error":"#REF!"}},{"$f":"IF(Schema!#REF!=\"\",\"\",Schema!#REF!)","v":{"$error":"#REF!"}},{"$f":"IF(Schema!#REF!=\"\",\"\",Schema!#REF!)","v":{"$error":"#REF!"}}]
[{"$f":"Schema!#REF!&Schema!#REF!&Schema!#REF!&Schema!#REF!","v":{"$error":"#REF!"}},{"$error":"#REF!"},{"$f":"IF(A226=\"\",\"\",IF(LEN(Schema!#REF!)=2,1,IF(LEN(Schema!#REF!)=2,10,IF(LEN(Schema!#REF!)=2,100,0))))","v":{"$error":"#REF!"}},{"$error":"#REF!"},{"$f":"IF(A226=\"\",\"\",SUM(Tabel2[[#This Row],[I1]:[I2]]))","v":{"$error":"#REF!"}},{"$error":"#REF!"},{"$error":"#REF!"},{"$error":"#REF!"},{"$error":"#REF!"},{"$f":"IF(C226=\"\",\"\",IF(LEN(Tabel2[[#This Row],[Entiteit of attribuut]])=2,\"\",Tabel2[[#This Row],[Entiteit]]&\"_\"&Tabel2[[#This Row],[Entiteit of attribuut]]))","v":{"$error":"#REF!"}},{"$f":"IF(Schema!#REF!=\"\",\"\",Schema!#REF!)","v":{"$error":"#REF!"}},{"$f":"IF(Schema!#REF!=\"\",\"\",Schema!#REF!)","v":{"$error":"#REF!"}},{"$f":"IF(Schema!#REF!=\"\",\"\",Schema!#REF!)","v":{"$error":"#REF!"}},{"$f":"IF(Schema!#REF!=\"\",\"\",Schema!#REF!)","v":{"$error":"#REF!"}},{"$f":"IF(Schema!#REF!=\"\",\"\",Schema!#REF!)","v":{"$error":"#REF!"}}]
[{"$f":"Schema!#REF!&Schema!#REF!&Schema!#REF!&Schema!#REF!","v":{"$error":"#REF!"}},{"$error":"#REF!"},{"$f":"IF(A227=\"\",\"\",IF(LEN(Schema!#REF!)=2,1,IF(LEN(Schema!#REF!)=2,10,IF(LEN(Schema!#REF!)=2,100,0))))","v":{"$error":"#REF!"}},{"$error":"#REF!"},{"$f":"IF(A227=\"\",\"\",SUM(Tabel2[[#This Row],[I1]:[I2]]))","v":{"$error":"#REF!"}},{"$error":"#REF!"},{"$error":"#REF!"},{"$error":"#REF!"},{"$error":"#REF!"},{"$f":"IF(C227=\"\",\"\",IF(LEN(Tabel2[[#This Row],[Entiteit of attribuut]])=2,\"\",Tabel2[[#This Row],[Entiteit]]&\"_\"&Tabel2[[#This Row],[Entiteit of attribuut]]))","v":{"$error":"#REF!"}},{"$f":"IF(Schema!#REF!=\"\",\"\",Schema!#REF!)","v":{"$error":"#REF!"}},{"$f":"IF(Schema!#REF!=\"\",\"\",Schema!#REF!)","v":{"$error":"#REF!"}},{"$f":"IF(Schema!#REF!=\"\",\"\",Schema!#REF!)","v":{"$error":"#REF!"}},{"$f":"IF(Schema!#REF!=\"\",\"\",Schema!#REF!)","v":{"$error":"#REF!"}},{"$f":"IF(Schema!#REF!=\"\",\"\",Schema!#REF!)","v":{"$error":"#REF!"}}]
[{"$f":"Schema!#REF!&Schema!#REF!&Schema!#REF!&Schema!#REF!","v":{"$error":"#REF!"}},{"$error":"#REF!"},{"$f":"IF(A228=\"\",\"\",IF(LEN(Schema!#REF!)=2,1,IF(LEN(Schema!#REF!)=2,10,IF(LEN(Schema!#REF!)=2,100,0))))","v":{"$error":"#REF!"}},{"$error":"#REF!"},{"$f":"IF(A228=\"\",\"\",SUM(Tabel2[[#This Row],[I1]:[I2]]))","v":{"$error":"#REF!"}},{"$error":"#REF!"},{"$error":"#REF!"},{"$error":"#REF!"},{"$error":"#REF!"},{"$f":"IF(C228=\"\",\"\",IF(LEN(Tabel2[[#This Row],[Entiteit of attribuut]])=2,\"\",Tabel2[[#This Row],[Entiteit]]&\"_\"&Tabel2[[#This Row],[Entiteit of attribuut]]))","v":{"$error":"#REF!"}},{"$f":"IF(Schema!#REF!=\"\",\"\",Schema!#REF!)","v":{"$error":"#REF!"}},{"$f":"IF(Schema!#REF!=\"\",\"\",Schema!#REF!)","v":{"$error":"#REF!"}},{"$f":"IF(Schema!#REF!=\"\",\"\",Schema!#REF!)","v":{"$error":"#REF!"}},{"$f":"IF(Schema!#REF!=\"\",\"\",Schema!#REF!)","v":{"$error":"#REF!"}},{"$f":"IF(Schema!#REF!=\"\",\"\",Schema!#REF!)","v":{"$error":"#REF!"}}]
[{"$f":"Schema!#REF!&Schema!#REF!&Schema!#REF!&Schema!#REF!","v":{"$error":"#REF!"}},{"$error":"#REF!"},{"$f":"IF(A229=\"\",\"\",IF(LEN(Schema!#REF!)=2,1,IF(LEN(Schema!#REF!)=2,10,IF(LEN(Schema!#REF!)=2,100,0))))","v":{"$error":"#REF!"}},{"$error":"#REF!"},{"$f":"IF(A229=\"\",\"\",SUM(Tabel2[[#This Row],[I1]:[I2]]))","v":{"$error":"#REF!"}},{"$error":"#REF!"},{"$error":"#REF!"},{"$error":"#REF!"},{"$error":"#REF!"},{"$f":"IF(C229=\"\",\"\",IF(LEN(Tabel2[[#This Row],[Entiteit of attribuut]])=2,\"\",Tabel2[[#This Row],[Entiteit]]&\"_\"&Tabel2[[#This Row],[Entiteit of attribuut]]))","v":{"$error":"#REF!"}},{"$f":"IF(Schema!#REF!=\"\",\"\",Schema!#REF!)","v":{"$error":"#REF!"}},{"$f":"IF(Schema!#REF!=\"\",\"\",Schema!#REF!)","v":{"$error":"#REF!"}},{"$f":"IF(Schema!#REF!=\"\",\"\",Schema!#REF!)","v":{"$error":"#REF!"}},{"$f":"IF(Schema!#REF!=\"\",\"\",Schema!#REF!)","v":{"$error":"#REF!"}},{"$f":"IF(Schema!#REF!=\"\",\"\",Schema!#REF!)","v":{"$error":"#REF!"}}]
[{"$f":"Schema!#REF!&Schema!#REF!&Schema!#REF!&Schema!#REF!","v":{"$error":"#REF!"}},{"$error":"#REF!"},{"$f":"IF(A230=\"\",\"\",IF(LEN(Schema!#REF!)=2,1,IF(LEN(Schema!#REF!)=2,10,IF(LEN(Schema!#REF!)=2,100,0))))","v":{"$error":"#REF!"}},{"$error":"#REF!"},{"$f":"IF(A230=\"\",\"\",SUM(Tabel2[[#This Row],[I1]:[I2]]))","v":{"$error":"#REF!"}},{"$error":"#REF!"},{"$error":"#REF!"},{"$error":"#REF!"},{"$error":"#REF!"},{"$f":"IF(C230=\"\",\"\",IF(LEN(Tabel2[[#This Row],[Entiteit of attribuut]])=2,\"\",Tabel2[[#This Row],[Entiteit]]&\"_\"&Tabel2[[#This Row],[Entiteit of attribuut]]))","v":{"$error":"#REF!"}},{"$f":"IF(Schema!#REF!=\"\",\"\",Schema!#REF!)","v":{"$error":"#REF!"}},{"$f":"IF(Schema!#REF!=\"\",\"\",Schema!#REF!)","v":{"$error":"#REF!"}},{"$f":"IF(Schema!#REF!=\"\",\"\",Schema!#REF!)","v":{"$error":"#REF!"}},{"$f":"IF(Schema!#REF!=\"\",\"\",Schema!#REF!)","v":{"$error":"#REF!"}},{"$f":"IF(Schema!#REF!=\"\",\"\",Schema!#REF!)","v":{"$error":"#REF!"}}]
[{"$f":"Schema!#REF!&Schema!#REF!&Schema!#REF!&Schema!#REF!","v":{"$error":"#REF!"}},{"$error":"#REF!"},{"$f":"IF(A231=\"\",\"\",IF(LEN(Schema!#REF!)=2,1,IF(LEN(Schema!#REF!)=2,10,IF(LEN(Schema!#REF!)=2,100,0))))","v":{"$error":"#REF!"}},{"$error":"#REF!"},{"$f":"IF(A231=\"\",\"\",SUM(Tabel2[[#This Row],[I1]:[I2]]))","v":{"$error":"#REF!"}},{"$error":"#REF!"},{"$error":"#REF!"},{"$error":"#REF!"},{"$error":"#REF!"},{"$f":"IF(C231=\"\",\"\",IF(LEN(Tabel2[[#This Row],[Entiteit of attribuut]])=2,\"\",Tabel2[[#This Row],[Entiteit]]&\"_\"&Tabel2[[#This Row],[Entiteit of attribuut]]))","v":{"$error":"#REF!"}},{"$f":"IF(Schema!#REF!=\"\",\"\",Schema!#REF!)","v":{"$error":"#REF!"}},{"$f":"IF(Schema!#REF!=\"\",\"\",Schema!#REF!)","v":{"$error":"#REF!"}},{"$f":"IF(Schema!#REF!=\"\",\"\",Schema!#REF!)","v":{"$error":"#REF!"}},{"$f":"IF(Schema!#REF!=\"\",\"\",Schema!#REF!)","v":{"$error":"#REF!"}},{"$f":"IF(Schema!#REF!=\"\",\"\",Schema!#REF!)","v":{"$error":"#REF!"}}]
[{"$f":"Schema!#REF!&Schema!#REF!&Schema!#REF!&Schema!#REF!","v":{"$error":"#REF!"}},{"$error":"#REF!"},{"$f":"IF(A232=\"\",\"\",IF(LEN(Schema!#REF!)=2,1,IF(LEN(Schema!#REF!)=2,10,IF(LEN(Schema!#REF!)=2,100,0))))","v":{"$error":"#REF!"}},{"$error":"#REF!"},{"$f":"IF(A232=\"\",\"\",SUM(Tabel2[[#This Row],[I1]:[I2]]))","v":{"$error":"#REF!"}},{"$error":"#REF!"},{"$error":"#REF!"},{"$error":"#REF!"},{"$error":"#REF!"},{"$f":"IF(C232=\"\",\"\",IF(LEN(Tabel2[[#This Row],[Entiteit of attribuut]])=2,\"\",Tabel2[[#This Row],[Entiteit]]&\"_\"&Tabel2[[#This Row],[Entiteit of attribuut]]))","v":{"$error":"#REF!"}},{"$f":"IF(Schema!#REF!=\"\",\"\",Schema!#REF!)","v":{"$error":"#REF!"}},{"$f":"IF(Schema!#REF!=\"\",\"\",Schema!#REF!)","v":{"$error":"#REF!"}},{"$f":"IF(Schema!#REF!=\"\",\"\",Schema!#REF!)","v":{"$error":"#REF!"}},{"$f":"IF(Schema!#REF!=\"\",\"\",Schema!#REF!)","v":{"$error":"#REF!"}},{"$f":"IF(Schema!#REF!=\"\",\"\",Schema!#REF!)","v":{"$error":"#REF!"}}]
[{"$f":"Schema!#REF!&Schema!#REF!&Schema!#REF!&Schema!#REF!","v":{"$error":"#REF!"}},{"$error":"#REF!"},{"$f":"IF(A233=\"\",\"\",IF(LEN(Schema!#REF!)=2,1,IF(LEN(Schema!#REF!)=2,10,IF(LEN(Schema!#REF!)=2,100,0))))","v":{"$error":"#REF!"}},{"$error":"#REF!"},{"$f":"IF(A233=\"\",\"\",SUM(Tabel2[[#This Row],[I1]:[I2]]))","v":{"$error":"#REF!"}},{"$error":"#REF!"},{"$error":"#REF!"},{"$error":"#REF!"},{"$error":"#REF!"},{"$f":"IF(C233=\"\",\"\",IF(LEN(Tabel2[[#This Row],[Entiteit of attribuut]])=2,\"\",Tabel2[[#This Row],[Entiteit]]&\"_\"&Tabel2[[#This Row],[Entiteit of attribuut]]))","v":{"$error":"#REF!"}},{"$f":"IF(Schema!#REF!=\"\",\"\",Schema!#REF!)","v":{"$error":"#REF!"}},{"$f":"IF(Schema!#REF!=\"\",\"\",Schema!#REF!)","v":{"$error":"#REF!"}},{"$f":"IF(Schema!#REF!=\"\",\"\",Schema!#REF!)","v":{"$error":"#REF!"}},{"$f":"IF(Schema!#REF!=\"\",\"\",Schema!#REF!)","v":{"$error":"#REF!"}},{"$f":"IF(Schema!#REF!=\"\",\"\",Schema!#REF!)","v":{"$error":"#REF!"}}]
[{"$f":"Schema!#REF!&Schema!#REF!&Schema!#REF!&Schema!#REF!","v":{"$error":"#REF!"}},{"$error":"#REF!"},{"$f":"IF(A234=\"\",\"\",IF(LEN(Schema!#REF!)=2,1,IF(LEN(Schema!#REF!)=2,10,IF(LEN(Schema!#REF!)=2,100,0))))","v":{"$error":"#REF!"}},{"$error":"#REF!"},{"$f":"IF(A234=\"\",\"\",SUM(Tabel2[[#This Row],[I1]:[I2]]))","v":{"$error":"#REF!"}},{"$error":"#REF!"},{"$error":"#REF!"},{"$error":"#REF!"},{"$error":"#REF!"},{"$f":"IF(C234=\"\",\"\",IF(LEN(Tabel2[[#This Row],[Entiteit of attribuut]])=2,\"\",Tabel2[[#This Row],[Entiteit]]&\"_\"&Tabel2[[#This Row],[Entiteit of attribuut]]))","v":{"$error":"#REF!"}},{"$f":"IF(Schema!#REF!=\"\",\"\",Schema!#REF!)","v":{"$error":"#REF!"}},{"$f":"IF(Schema!#REF!=\"\",\"\",Schema!#REF!)","v":{"$error":"#REF!"}},{"$f":"IF(Schema!#REF!=\"\",\"\",Schema!#REF!)","v":{"$error":"#REF!"}},{"$f":"IF(Schema!#REF!=\"\",\"\",Schema!#REF!)","v":{"$error":"#REF!"}},{"$f":"IF(Schema!#REF!=\"\",\"\",Schema!#REF!)","v":{"$error":"#REF!"}}]
[{"$f":"Schema!#REF!&Schema!#REF!&Schema!#REF!&Schema!#REF!","v":{"$error":"#REF!"}},{"$error":"#REF!"},{"$f":"IF(A235=\"\",\"\",IF(LEN(Schema!#REF!)=2,1,IF(LEN(Schema!#REF!)=2,10,IF(LEN(Schema!#REF!)=2,100,0))))","v":{"$error":"#REF!"}},{"$error":"#REF!"},{"$f":"IF(A235=\"\",\"\",SUM(Tabel2[[#This Row],[I1]:[I2]]))","v":{"$error":"#REF!"}},{"$error":"#REF!"},{"$error":"#REF!"},{"$error":"#REF!"},{"$error":"#REF!"},{"$f":"IF(C235=\"\",\"\",IF(LEN(Tabel2[[#This Row],[Entiteit of attribuut]])=2,\"\",Tabel2[[#This Row],[Entiteit]]&\"_\"&Tabel2[[#This Row],[Entiteit of attribuut]]))","v":{"$error":"#REF!"}},{"$f":"IF(Schema!#REF!=\"\",\"\",Schema!#REF!)","v":{"$error":"#REF!"}},{"$f":"IF(Schema!#REF!=\"\",\"\",Schema!#REF!)","v":{"$error":"#REF!"}},{"$f":"IF(Schema!#REF!=\"\",\"\",Schema!#REF!)","v":{"$error":"#REF!"}},{"$f":"IF(Schema!#REF!=\"\",\"\",Schema!#REF!)","v":{"$error":"#REF!"}},{"$f":"IF(Schema!#REF!=\"\",\"\",Schema!#REF!)","v":{"$error":"#REF!"}}]
[{"$f":"Schema!#REF!&Schema!#REF!&Schema!#REF!&Schema!#REF!","v":{"$error":"#REF!"}},{"$error":"#REF!"},{"$f":"IF(A236=\"\",\"\",IF(LEN(Schema!#REF!)=2,1,IF(LEN(Schema!#REF!)=2,10,IF(LEN(Schema!#REF!)=2,100,0))))","v":{"$error":"#REF!"}},{"$error":"#REF!"},{"$f":"IF(A236=\"\",\"\",SUM(Tabel2[[#This Row],[I1]:[I2]]))","v":{"$error":"#REF!"}},{"$error":"#REF!"},{"$error":"#REF!"},{"$error":"#REF!"},{"$error":"#REF!"},{"$f":"IF(C236=\"\",\"\",IF(LEN(Tabel2[[#This Row],[Entiteit of attribuut]])=2,\"\",Tabel2[[#This Row],[Entiteit]]&\"_\"&Tabel2[[#This Row],[Entiteit of attribuut]]))","v":{"$error":"#REF!"}},{"$f":"IF(Schema!#REF!=\"\",\"\",Schema!#REF!)","v":{"$error":"#REF!"}},{"$f":"IF(Schema!#REF!=\"\",\"\",Schema!#REF!)","v":{"$error":"#REF!"}},{"$f":"IF(Schema!#REF!=\"\",\"\",Schema!#REF!)","v":{"$error":"#REF!"}},{"$f":"IF(Schema!#REF!=\"\",\"\",Schema!#REF!)","v":{"$error":"#REF!"}},{"$f":"IF(Schema!#REF!=\"\",\"\",Schema!#REF!)","v":{"$error":"#REF!"}}]
[{"$f":"Schema!#REF!&Schema!#REF!&Schema!#REF!&Schema!#REF!","v":{"$error":"#REF!"}},{"$error":"#REF!"},{"$f":"IF(A237=\"\",\"\",IF(LEN(Schema!#REF!)=2,1,IF(LEN(Schema!#REF!)=2,10,IF(LEN(Schema!#REF!)=2,100,0))))","v":{"$error":"#REF!"}},{"$error":"#REF!"},{"$f":"IF(A237=\"\",\"\",SUM(Tabel2[[#This Row],[I1]:[I2]]))","v":{"$error":"#REF!"}},{"$error":"#REF!"},{"$error":"#REF!"},{"$error":"#REF!"},{"$error":"#REF!"},{"$f":"IF(C237=\"\",\"\",IF(LEN(Tabel2[[#This Row],[Entiteit of attribuut]])=2,\"\",Tabel2[[#This Row],[Entiteit]]&\"_\"&Tabel2[[#This Row],[Entiteit of attribuut]]))","v":{"$error":"#REF!"}},{"$f":"IF(Schema!#REF!=\"\",\"\",Schema!#REF!)","v":{"$error":"#REF!"}},{"$f":"IF(Schema!#REF!=\"\",\"\",Schema!#REF!)","v":{"$error":"#REF!"}},{"$f":"IF(Schema!#REF!=\"\",\"\",Schema!#REF!)","v":{"$error":"#REF!"}},{"$f":"IF(Schema!#REF!=\"\",\"\",Schema!#REF!)","v":{"$error":"#REF!"}},{"$f":"IF(Schema!#REF!=\"\",\"\",Schema!#REF!)","v":{"$error":"#REF!"}}]
[{"$f":"Schema!#REF!&Schema!#REF!&Schema!#REF!&Schema!#REF!","v":{"$error":"#REF!"}},{"$error":"#REF!"},{"$f":"IF(A238=\"\",\"\",IF(LEN(Schema!#REF!)=2,1,IF(LEN(Schema!#REF!)=2,10,IF(LEN(Schema!#REF!)=2,100,0))))","v":{"$error":"#REF!"}},{"$error":"#REF!"},{"$f":"IF(A238=\"\",\"\",SUM(Tabel2[[#This Row],[I1]:[I2]]))","v":{"$error":"#REF!"}},{"$error":"#REF!"},{"$error":"#REF!"},{"$error":"#REF!"},{"$error":"#REF!"},{"$f":"IF(C238=\"\",\"\",IF(LEN(Tabel2[[#This Row],[Entiteit of attribuut]])=2,\"\",Tabel2[[#This Row],[Entiteit]]&\"_\"&Tabel2[[#This Row],[Entiteit of attribuut]]))","v":{"$error":"#REF!"}},{"$f":"IF(Schema!#REF!=\"\",\"\",Schema!#REF!)","v":{"$error":"#REF!"}},{"$f":"IF(Schema!#REF!=\"\",\"\",Schema!#REF!)","v":{"$error":"#REF!"}},{"$f":"IF(Schema!#REF!=\"\",\"\",Schema!#REF!)","v":{"$error":"#REF!"}},{"$f":"IF(Schema!#REF!=\"\",\"\",Schema!#REF!)","v":{"$error":"#REF!"}},{"$f":"IF(Schema!#REF!=\"\",\"\",Schema!#REF!)","v":{"$error":"#REF!"}}]
[{"$f":"Schema!#REF!&Schema!#REF!&Schema!#REF!&Schema!#REF!","v":{"$error":"#REF!"}},{"$error":"#REF!"},{"$f":"IF(A239=\"\",\"\",IF(LEN(Schema!#REF!)=2,1,IF(LEN(Schema!#REF!)=2,10,IF(LEN(Schema!#REF!)=2,100,0))))","v":{"$error":"#REF!"}},{"$error":"#REF!"},{"$f":"IF(A239=\"\",\"\",SUM(Tabel2[[#This Row],[I1]:[I2]]))","v":{"$error":"#REF!"}},{"$error":"#REF!"},{"$error":"#REF!"},{"$error":"#REF!"},{"$error":"#REF!"},{"$f":"IF(C239=\"\",\"\",IF(LEN(Tabel2[[#This Row],[Entiteit of attribuut]])=2,\"\",Tabel2[[#This Row],[Entiteit]]&\"_\"&Tabel2[[#This Row],[Entiteit of attribuut]]))","v":{"$error":"#REF!"}},{"$f":"IF(Schema!#REF!=\"\",\"\",Schema!#REF!)","v":{"$error":"#REF!"}},{"$f":"IF(Schema!#REF!=\"\",\"\",Schema!#REF!)","v":{"$error":"#REF!"}},{"$f":"IF(Schema!#REF!=\"\",\"\",Schema!#REF!)","v":{"$error":"#REF!"}},{"$f":"IF(Schema!#REF!=\"\",\"\",Schema!#REF!)","v":{"$error":"#REF!"}},{"$f":"IF(Schema!#REF!=\"\",\"\",Schema!#REF!)","v":{"$error":"#REF!"}}]
[{"$f":"Schema!#REF!&Schema!#REF!&Schema!#REF!&Schema!#REF!","v":{"$error":"#REF!"}},{"$error":"#REF!"},{"$f":"IF(A240=\"\",\"\",IF(LEN(Schema!#REF!)=2,1,IF(LEN(Schema!#REF!)=2,10,IF(LEN(Schema!#REF!)=2,100,0))))","v":{"$error":"#REF!"}},{"$error":"#REF!"},{"$f":"IF(A240=\"\",\"\",SUM(Tabel2[[#This Row],[I1]:[I2]]))","v":{"$error":"#REF!"}},{"$error":"#REF!"},{"$error":"#REF!"},{"$error":"#REF!"},{"$error":"#REF!"},{"$f":"IF(C240=\"\",\"\",IF(LEN(Tabel2[[#This Row],[Entiteit of attribuut]])=2,\"\",Tabel2[[#This Row],[Entiteit]]&\"_\"&Tabel2[[#This Row],[Entiteit of attribuut]]))","v":{"$error":"#REF!"}},{"$f":"IF(Schema!#REF!=\"\",\"\",Schema!#REF!)","v":{"$error":"#REF!"}},{"$f":"IF(Schema!#REF!=\"\",\"\",Schema!#REF!)","v":{"$error":"#REF!"}},{"$f":"IF(Schema!#REF!=\"\",\"\",Schema!#REF!)","v":{"$error":"#REF!"}},{"$f":"IF(Schema!#REF!=\"\",\"\",Schema!#REF!)","v":{"$error":"#REF!"}},{"$f":"IF(Schema!#REF!=\"\",\"\",Schema!#REF!)","v":{"$error":"#REF!"}}]
[{"$f":"Schema!#REF!&Schema!#REF!&Schema!#REF!&Schema!#REF!","v":{"$error":"#REF!"}},{"$error":"#REF!"},{"$f":"IF(A241=\"\",\"\",IF(LEN(Schema!#REF!)=2,1,IF(LEN(Schema!#REF!)=2,10,IF(LEN(Schema!#REF!)=2,100,0))))","v":{"$error":"#REF!"}},{"$error":"#REF!"},{"$f":"IF(A241=\"\",\"\",SUM(Tabel2[[#This Row],[I1]:[I2]]))","v":{"$error":"#REF!"}},{"$error":"#REF!"},{"$error":"#REF!"},{"$error":"#REF!"},{"$error":"#REF!"},{"$f":"IF(C241=\"\",\"\",IF(LEN(Tabel2[[#This Row],[Entiteit of attribuut]])=2,\"\",Tabel2[[#This Row],[Entiteit]]&\"_\"&Tabel2[[#This Row],[Entiteit of attribuut]]))","v":{"$error":"#REF!"}},{"$f":"IF(Schema!#REF!=\"\",\"\",Schema!#REF!)","v":{"$error":"#REF!"}},{"$f":"IF(Schema!#REF!=\"\",\"\",Schema!#REF!)","v":{"$error":"#REF!"}},{"$f":"IF(Schema!#REF!=\"\",\"\",Schema!#REF!)","v":{"$error":"#REF!"}},{"$f":"IF(Schema!#REF!=\"\",\"\",Schema!#REF!)","v":{"$error":"#REF!"}},{"$f":"IF(Schema!#REF!=\"\",\"\",Schema!#REF!)","v":{"$error":"#REF!"}}]
[{"$f":"Schema!#REF!&Schema!#REF!&Schema!#REF!&Schema!#REF!","v":{"$error":"#REF!"}},{"$error":"#REF!"},{"$f":"IF(A242=\"\",\"\",IF(LEN(Schema!#REF!)=2,1,IF(LEN(Schema!#REF!)=2,10,IF(LEN(Schema!#REF!)=2,100,0))))","v":{"$error":"#REF!"}},{"$error":"#REF!"},{"$f":"IF(A242=\"\",\"\",SUM(Tabel2[[#This Row],[I1]:[I2]]))","v":{"$error":"#REF!"}},{"$error":"#REF!"},{"$error":"#REF!"},{"$error":"#REF!"},{"$error":"#REF!"},{"$f":"IF(C242=\"\",\"\",IF(LEN(Tabel2[[#This Row],[Entiteit of attribuut]])=2,\"\",Tabel2[[#This Row],[Entiteit]]&\"_\"&Tabel2[[#This Row],[Entiteit of attribuut]]))","v":{"$error":"#REF!"}},{"$f":"IF(Schema!#REF!=\"\",\"\",Schema!#REF!)","v":{"$error":"#REF!"}},{"$f":"IF(Schema!#REF!=\"\",\"\",Schema!#REF!)","v":{"$error":"#REF!"}},{"$f":"IF(Schema!#REF!=\"\",\"\",Schema!#REF!)","v":{"$error":"#REF!"}},{"$f":"IF(Schema!#REF!=\"\",\"\",Schema!#REF!)","v":{"$error":"#REF!"}},{"$f":"IF(Schema!#REF!=\"\",\"\",Schema!#REF!)","v":{"$error":"#REF!"}}]
[{"$f":"Schema!#REF!&Schema!#REF!&Schema!#REF!&Schema!#REF!","v":{"$error":"#REF!"}},{"$error":"#REF!"},{"$f":"IF(A243=\"\",\"\",IF(LEN(Schema!#REF!)=2,1,IF(LEN(Schema!#REF!)=2,10,IF(LEN(Schema!#REF!)=2,100,0))))","v":{"$error":"#REF!"}},{"$error":"#REF!"},{"$f":"IF(A243=\"\",\"\",SUM(Tabel2[[#This Row],[I1]:[I2]]))","v":{"$error":"#REF!"}},{"$error":"#REF!"},{"$error":"#REF!"},{"$error":"#REF!"},{"$error":"#REF!"},{"$f":"IF(C243=\"\",\"\",IF(LEN(Tabel2[[#This Row],[Entiteit of attribuut]])=2,\"\",Tabel2[[#This Row],[Entiteit]]&\"_\"&Tabel2[[#This Row],[Entiteit of attribuut]]))","v":{"$error":"#REF!"}},{"$f":"IF(Schema!#REF!=\"\",\"\",Schema!#REF!)","v":{"$error":"#REF!"}},{"$f":"IF(Schema!#REF!=\"\",\"\",Schema!#REF!)","v":{"$error":"#REF!"}},{"$f":"IF(Schema!#REF!=\"\",\"\",Schema!#REF!)","v":{"$error":"#REF!"}},{"$f":"IF(Schema!#REF!=\"\",\"\",Schema!#REF!)","v":{"$error":"#REF!"}},{"$f":"IF(Schema!#REF!=\"\",\"\",Schema!#REF!)","v":{"$error":"#REF!"}}]
[{"$f":"Schema!#REF!&Schema!#REF!&Schema!#REF!&Schema!#REF!","v":{"$error":"#REF!"}},{"$error":"#REF!"},{"$f":"IF(A244=\"\",\"\",IF(LEN(Schema!#REF!)=2,1,IF(LEN(Schema!#REF!)=2,10,IF(LEN(Schema!#REF!)=2,100,0))))","v":{"$error":"#REF!"}},{"$error":"#REF!"},{"$f":"IF(A244=\"\",\"\",SUM(Tabel2[[#This Row],[I1]:[I2]]))","v":{"$error":"#REF!"}},{"$error":"#REF!"},{"$error":"#REF!"},{"$error":"#REF!"},{"$error":"#REF!"},{"$f":"IF(C244=\"\",\"\",IF(LEN(Tabel2[[#This Row],[Entiteit of attribuut]])=2,\"\",Tabel2[[#This Row],[Entiteit]]&\"_\"&Tabel2[[#This Row],[Entiteit of attribuut]]))","v":{"$error":"#REF!"}},{"$f":"IF(Schema!#REF!=\"\",\"\",Schema!#REF!)","v":{"$error":"#REF!"}},{"$f":"IF(Schema!#REF!=\"\",\"\",Schema!#REF!)","v":{"$error":"#REF!"}},{"$f":"IF(Schema!#REF!=\"\",\"\",Schema!#REF!)","v":{"$error":"#REF!"}},{"$f":"IF(Schema!#REF!=\"\",\"\",Schema!#REF!)","v":{"$error":"#REF!"}},{"$f":"IF(Schema!#REF!=\"\",\"\",Schema!#REF!)","v":{"$error":"#REF!"}}]
[{"$f":"Schema!#REF!&Schema!#REF!&Schema!#REF!&Schema!#REF!","v":{"$error":"#REF!"}},{"$error":"#REF!"},{"$f":"IF(A245=\"\",\"\",IF(LEN(Schema!#REF!)=2,1,IF(LEN(Schema!#REF!)=2,10,IF(LEN(Schema!#REF!)=2,100,0))))","v":{"$error":"#REF!"}},{"$error":"#REF!"},{"$f":"IF(A245=\"\",\"\",SUM(Tabel2[[#This Row],[I1]:[I2]]))","v":{"$error":"#REF!"}},{"$error":"#REF!"},{"$error":"#REF!"},{"$error":"#REF!"},{"$error":"#REF!"},{"$f":"IF(C245=\"\",\"\",IF(LEN(Tabel2[[#This Row],[Entiteit of attribuut]])=2,\"\",Tabel2[[#This Row],[Entiteit]]&\"_\"&Tabel2[[#This Row],[Entiteit of attribuut]]))","v":{"$error":"#REF!"}},{"$f":"IF(Schema!#REF!=\"\",\"\",Schema!#REF!)","v":{"$error":"#REF!"}},{"$f":"IF(Schema!#REF!=\"\",\"\",Schema!#REF!)","v":{"$error":"#REF!"}},{"$f":"IF(Schema!#REF!=\"\",\"\",Schema!#REF!)","v":{"$error":"#REF!"}},{"$f":"IF(Schema!#REF!=\"\",\"\",Schema!#REF!)","v":{"$error":"#REF!"}},{"$f":"IF(Schema!#REF!=\"\",\"\",Schema!#REF!)","v":{"$error":"#REF!"}}]
[{"$f":"Schema!#REF!&Schema!#REF!&Schema!#REF!&Schema!#REF!","v":{"$error":"#REF!"}},{"$error":"#REF!"},{"$f":"IF(A246=\"\",\"\",IF(LEN(Schema!#REF!)=2,1,IF(LEN(Schema!#REF!)=2,10,IF(LEN(Schema!#REF!)=2,100,0))))","v":{"$error":"#REF!"}},{"$error":"#REF!"},{"$f":"IF(A246=\"\",\"\",SUM(Tabel2[[#This Row],[I1]:[I2]]))","v":{"$error":"#REF!"}},{"$error":"#REF!"},{"$error":"#REF!"},{"$error":"#REF!"},{"$error":"#REF!"},{"$f":"IF(C246=\"\",\"\",IF(LEN(Tabel2[[#This Row],[Entiteit of attribuut]])=2,\"\",Tabel2[[#This Row],[Entiteit]]&\"_\"&Tabel2[[#This Row],[Entiteit of attribuut]]))","v":{"$error":"#REF!"}},{"$f":"IF(Schema!#REF!=\"\",\"\",Schema!#REF!)","v":{"$error":"#REF!"}},{"$f":"IF(Schema!#REF!=\"\",\"\",Schema!#REF!)","v":{"$error":"#REF!"}},{"$f":"IF(Schema!#REF!=\"\",\"\",Schema!#REF!)","v":{"$error":"#REF!"}},{"$f":"IF(Schema!#REF!=\"\",\"\",Schema!#REF!)","v":{"$error":"#REF!"}},{"$f":"IF(Schema!#REF!=\"\",\"\",Schema!#REF!)","v":{"$error":"#REF!"}}]
[{"$f":"Schema!#REF!&Schema!#REF!&Schema!#REF!&Schema!#REF!","v":{"$error":"#REF!"}},{"$error":"#REF!"},{"$f":"IF(A247=\"\",\"\",IF(LEN(Schema!#REF!)=2,1,IF(LEN(Schema!#REF!)=2,10,IF(LEN(Schema!#REF!)=2,100,0))))","v":{"$error":"#REF!"}},{"$error":"#REF!"},{"$f":"IF(A247=\"\",\"\",SUM(Tabel2[[#This Row],[I1]:[I2]]))","v":{"$error":"#REF!"}},{"$error":"#REF!"},{"$error":"#REF!"},{"$error":"#REF!"},{"$error":"#REF!"},{"$f":"IF(C247=\"\",\"\",IF(LEN(Tabel2[[#This Row],[Entiteit of attribuut]])=2,\"\",Tabel2[[#This Row],[Entiteit]]&\"_\"&Tabel2[[#This Row],[Entiteit of attribuut]]))","v":{"$error":"#REF!"}},{"$f":"IF(Schema!#REF!=\"\",\"\",Schema!#REF!)","v":{"$error":"#REF!"}},{"$f":"IF(Schema!#REF!=\"\",\"\",Schema!#REF!)","v":{"$error":"#REF!"}},{"$f":"IF(Schema!#REF!=\"\",\"\",Schema!#REF!)","v":{"$error":"#REF!"}},{"$f":"IF(Schema!#REF!=\"\",\"\",Schema!#REF!)","v":{"$error":"#REF!"}},{"$f":"IF(Schema!#REF!=\"\",\"\",Schema!#REF!)","v":{"$error":"#REF!"}}]
[{"$f":"Schema!#REF!&Schema!#REF!&Schema!#REF!&Schema!#REF!","v":{"$error":"#REF!"}},{"$error":"#REF!"},{"$f":"IF(A248=\"\",\"\",IF(LEN(Schema!#REF!)=2,1,IF(LEN(Schema!#REF!)=2,10,IF(LEN(Schema!#REF!)=2,100,0))))","v":{"$error":"#REF!"}},{"$error":"#REF!"},{"$f":"IF(A248=\"\",\"\",SUM(Tabel2[[#This Row],[I1]:[I2]]))","v":{"$error":"#REF!"}},{"$error":"#REF!"},{"$error":"#REF!"},{"$error":"#REF!"},{"$error":"#REF!"},{"$f":"IF(C248=\"\",\"\",IF(LEN(Tabel2[[#This Row],[Entiteit of attribuut]])=2,\"\",Tabel2[[#This Row],[Entiteit]]&\"_\"&Tabel2[[#This Row],[Entiteit of attribuut]]))","v":{"$error":"#REF!"}},{"$f":"IF(Schema!#REF!=\"\",\"\",Schema!#REF!)","v":{"$error":"#REF!"}},{"$f":"IF(Schema!#REF!=\"\",\"\",Schema!#REF!)","v":{"$error":"#REF!"}},{"$f":"IF(Schema!#REF!=\"\",\"\",Schema!#REF!)","v":{"$error":"#REF!"}},{"$f":"IF(Schema!#REF!=\"\",\"\",Schema!#REF!)","v":{"$error":"#REF!"}},{"$f":"IF(Schema!#REF!=\"\",\"\",Schema!#REF!)","v":{"$error":"#REF!"}}]
[{"$f":"Schema!#REF!&Schema!#REF!&Schema!#REF!&Schema!#REF!","v":{"$error":"#REF!"}},{"$error":"#REF!"},{"$f":"IF(A249=\"\",\"\",IF(LEN(Schema!#REF!)=2,1,IF(LEN(Schema!#REF!)=2,10,IF(LEN(Schema!#REF!)=2,100,0))))","v":{"$error":"#REF!"}},{"$error":"#REF!"},{"$f":"IF(A249=\"\",\"\",SUM(Tabel2[[#This Row],[I1]:[I2]]))","v":{"$error":"#REF!"}},{"$error":"#REF!"},{"$error":"#REF!"},{"$error":"#REF!"},{"$error":"#REF!"},{"$f":"IF(C249=\"\",\"\",IF(LEN(Tabel2[[#This Row],[Entiteit of attribuut]])=2,\"\",Tabel2[[#This Row],[Entiteit]]&\"_\"&Tabel2[[#This Row],[Entiteit of attribuut]]))","v":{"$error":"#REF!"}},{"$f":"IF(Schema!#REF!=\"\",\"\",Schema!#REF!)","v":{"$error":"#REF!"}},{"$f":"IF(Schema!#REF!=\"\",\"\",Schema!#REF!)","v":{"$error":"#REF!"}},{"$f":"IF(Schema!#REF!=\"\",\"\",Schema!#REF!)","v":{"$error":"#REF!"}},{"$f":"IF(Schema!#REF!=\"\",\"\",Schema!#REF!)","v":{"$error":"#REF!"}},{"$f":"IF(Schema!#REF!=\"\",\"\",Schema!#REF!)","v":{"$error":"#REF!"}}]
[{"$f":"Schema!#REF!&Schema!#REF!&Schema!#REF!&Schema!#REF!","v":{"$error":"#REF!"}},{"$error":"#REF!"},{"$f":"IF(A250=\"\",\"\",IF(LEN(Schema!#REF!)=2,1,IF(LEN(Schema!#REF!)=2,10,IF(LEN(Schema!#REF!)=2,100,0))))","v":{"$error":"#REF!"}},{"$error":"#REF!"},{"$f":"IF(A250=\"\",\"\",SUM(Tabel2[[#This Row],[I1]:[I2]]))","v":{"$error":"#REF!"}},{"$error":"#REF!"},{"$error":"#REF!"},{"$error":"#REF!"},{"$error":"#REF!"},{"$f":"IF(C250=\"\",\"\",IF(LEN(Tabel2[[#This Row],[Entiteit of attribuut]])=2,\"\",Tabel2[[#This Row],[Entiteit]]&\"_\"&Tabel2[[#This Row],[Entiteit of attribuut]]))","v":{"$error":"#REF!"}},{"$f":"IF(Schema!#REF!=\"\",\"\",Schema!#REF!)","v":{"$error":"#REF!"}},{"$f":"IF(Schema!#REF!=\"\",\"\",Schema!#REF!)","v":{"$error":"#REF!"}},{"$f":"IF(Schema!#REF!=\"\",\"\",Schema!#REF!)","v":{"$error":"#REF!"}},{"$f":"IF(Schema!#REF!=\"\",\"\",Schema!#REF!)","v":{"$error":"#REF!"}},{"$f":"IF(Schema!#REF!=\"\",\"\",Schema!#REF!)","v":{"$error":"#REF!"}}]
[{"$f":"Schema!#REF!&Schema!#REF!&Schema!#REF!&Schema!#REF!","v":{"$error":"#REF!"}},{"$error":"#REF!"},{"$f":"IF(A251=\"\",\"\",IF(LEN(Schema!#REF!)=2,1,IF(LEN(Schema!#REF!)=2,10,IF(LEN(Schema!#REF!)=2,100,0))))","v":{"$error":"#REF!"}},{"$error":"#REF!"},{"$f":"IF(A251=\"\",\"\",SUM(Tabel2[[#This Row],[I1]:[I2]]))","v":{"$error":"#REF!"}},{"$error":"#REF!"},{"$error":"#REF!"},{"$error":"#REF!"},{"$error":"#REF!"},{"$f":"IF(C251=\"\",\"\",IF(LEN(Tabel2[[#This Row],[Entiteit of attribuut]])=2,\"\",Tabel2[[#This Row],[Entiteit]]&\"_\"&Tabel2[[#This Row],[Entiteit of attribuut]]))","v":{"$error":"#REF!"}},{"$f":"IF(Schema!#REF!=\"\",\"\",Schema!#REF!)","v":{"$error":"#REF!"}},{"$f":"IF(Schema!#REF!=\"\",\"\",Schema!#REF!)","v":{"$error":"#REF!"}},{"$f":"IF(Schema!#REF!=\"\",\"\",Schema!#REF!)","v":{"$error":"#REF!"}},{"$f":"IF(Schema!#REF!=\"\",\"\",Schema!#REF!)","v":{"$error":"#REF!"}},{"$f":"IF(Schema!#REF!=\"\",\"\",Schema!#REF!)","v":{"$error":"#REF!"}}]
[{"$f":"Schema!#REF!&Schema!#REF!&Schema!#REF!&Schema!#REF!","v":{"$error":"#REF!"}},{"$error":"#REF!"},{"$f":"IF(A252=\"\",\"\",IF(LEN(Schema!#REF!)=2,1,IF(LEN(Schema!#REF!)=2,10,IF(LEN(Schema!#REF!)=2,100,0))))","v":{"$error":"#REF!"}},{"$error":"#REF!"},{"$f":"IF(A252=\"\",\"\",SUM(Tabel2[[#This Row],[I1]:[I2]]))","v":{"$error":"#REF!"}},{"$error":"#REF!"},{"$error":"#REF!"},{"$error":"#REF!"},{"$error":"#REF!"},{"$f":"IF(C252=\"\",\"\",IF(LEN(Tabel2[[#This Row],[Entiteit of attribuut]])=2,\"\",Tabel2[[#This Row],[Entiteit]]&\"_\"&Tabel2[[#This Row],[Entiteit of attribuut]]))","v":{"$error":"#REF!"}},{"$f":"IF(Schema!#REF!=\"\",\"\",Schema!#REF!)","v":{"$error":"#REF!"}},{"$f":"IF(Schema!#REF!=\"\",\"\",Schema!#REF!)","v":{"$error":"#REF!"}},{"$f":"IF(Schema!#REF!=\"\",\"\",Schema!#REF!)","v":{"$error":"#REF!"}},{"$f":"IF(Schema!#REF!=\"\",\"\",Schema!#REF!)","v":{"$error":"#REF!"}},{"$f":"IF(Schema!#REF!=\"\",\"\",Schema!#REF!)","v":{"$error":"#REF!"}}]
[{"$f":"Schema!#REF!&Schema!#REF!&Schema!#REF!&Schema!#REF!","v":{"$error":"#REF!"}},{"$error":"#REF!"},{"$f":"IF(A253=\"\",\"\",IF(LEN(Schema!#REF!)=2,1,IF(LEN(Schema!#REF!)=2,10,IF(LEN(Schema!#REF!)=2,100,0))))","v":{"$error":"#REF!"}},{"$error":"#REF!"},{"$f":"IF(A253=\"\",\"\",SUM(Tabel2[[#This Row],[I1]:[I2]]))","v":{"$error":"#REF!"}},{"$error":"#REF!"},{"$error":"#REF!"},{"$error":"#REF!"},{"$error":"#REF!"},{"$f":"IF(C253=\"\",\"\",IF(LEN(Tabel2[[#This Row],[Entiteit of attribuut]])=2,\"\",Tabel2[[#This Row],[Entiteit]]&\"_\"&Tabel2[[#This Row],[Entiteit of attribuut]]))","v":{"$error":"#REF!"}},{"$f":"IF(Schema!#REF!=\"\",\"\",Schema!#REF!)","v":{"$error":"#REF!"}},{"$f":"IF(Schema!#REF!=\"\",\"\",Schema!#REF!)","v":{"$error":"#REF!"}},{"$f":"IF(Schema!#REF!=\"\",\"\",Schema!#REF!)","v":{"$error":"#REF!"}},{"$f":"IF(Schema!#REF!=\"\",\"\",Schema!#REF!)","v":{"$error":"#REF!"}},{"$f":"IF(Schema!#REF!=\"\",\"\",Schema!#REF!)","v":{"$error":"#REF!"}}]
[{"$f":"Schema!#REF!&Schema!#REF!&Schema!#REF!&Schema!#REF!","v":{"$error":"#REF!"}},{"$error":"#REF!"},{"$f":"IF(A254=\"\",\"\",IF(LEN(Schema!#REF!)=2,1,IF(LEN(Schema!#REF!)=2,10,IF(LEN(Schema!#REF!)=2,100,0))))","v":{"$error":"#REF!"}},{"$error":"#REF!"},{"$f":"IF(A254=\"\",\"\",SUM(Tabel2[[#This Row],[I1]:[I2]]))","v":{"$error":"#REF!"}},{"$error":"#REF!"},{"$error":"#REF!"},{"$error":"#REF!"},{"$error":"#REF!"},{"$f":"IF(C254=\"\",\"\",IF(LEN(Tabel2[[#This Row],[Entiteit of attribuut]])=2,\"\",Tabel2[[#This Row],[Entiteit]]&\"_\"&Tabel2[[#This Row],[Entiteit of attribuut]]))","v":{"$error":"#REF!"}},{"$f":"IF(Schema!#REF!=\"\",\"\",Schema!#REF!)","v":{"$error":"#REF!"}},{"$f":"IF(Schema!#REF!=\"\",\"\",Schema!#REF!)","v":{"$error":"#REF!"}},{"$f":"IF(Schema!#REF!=\"\",\"\",Schema!#REF!)","v":{"$error":"#REF!"}},{"$f":"IF(Schema!#REF!=\"\",\"\",Schema!#REF!)","v":{"$error":"#REF!"}},{"$f":"IF(Schema!#REF!=\"\",\"\",Schema!#REF!)","v":{"$error":"#REF!"}}]
[{"$f":"Schema!#REF!&Schema!#REF!&Schema!#REF!&Schema!#REF!","v":{"$error":"#REF!"}},{"$error":"#REF!"},{"$f":"IF(A255=\"\",\"\",IF(LEN(Schema!#REF!)=2,1,IF(LEN(Schema!#REF!)=2,10,IF(LEN(Schema!#REF!)=2,100,0))))","v":{"$error":"#REF!"}},{"$error":"#REF!"},{"$f":"IF(A255=\"\",\"\",SUM(Tabel2[[#This Row],[I1]:[I2]]))","v":{"$error":"#REF!"}},{"$error":"#REF!"},{"$error":"#REF!"},{"$error":"#REF!"},{"$error":"#REF!"},{"$f":"IF(C255=\"\",\"\",IF(LEN(Tabel2[[#This Row],[Entiteit of attribuut]])=2,\"\",Tabel2[[#This Row],[Entiteit]]&\"_\"&Tabel2[[#This Row],[Entiteit of attribuut]]))","v":{"$error":"#REF!"}},{"$f":"IF(Schema!#REF!=\"\",\"\",Schema!#REF!)","v":{"$error":"#REF!"}},{"$f":"IF(Schema!#REF!=\"\",\"\",Schema!#REF!)","v":{"$error":"#REF!"}},{"$f":"IF(Schema!#REF!=\"\",\"\",Schema!#REF!)","v":{"$error":"#REF!"}},{"$f":"IF(Schema!#REF!=\"\",\"\",Schema!#REF!)","v":{"$error":"#REF!"}},{"$f":"IF(Schema!#REF!=\"\",\"\",Schema!#REF!)","v":{"$error":"#REF!"}}]
[{"$f":"Schema!#REF!&Schema!#REF!&Schema!#REF!&Schema!#REF!","v":{"$error":"#REF!"}},{"$error":"#REF!"},{"$f":"IF(A256=\"\",\"\",IF(LEN(Schema!#REF!)=2,1,IF(LEN(Schema!#REF!)=2,10,IF(LEN(Schema!#REF!)=2,100,0))))","v":{"$error":"#REF!"}},{"$error":"#REF!"},{"$f":"IF(A256=\"\",\"\",SUM(Tabel2[[#This Row],[I1]:[I2]]))","v":{"$error":"#REF!"}},{"$error":"#REF!"},{"$error":"#REF!"},{"$error":"#REF!"},{"$error":"#REF!"},{"$f":"IF(C256=\"\",\"\",IF(LEN(Tabel2[[#This Row],[Entiteit of attribuut]])=2,\"\",Tabel2[[#This Row],[Entiteit]]&\"_\"&Tabel2[[#This Row],[Entiteit of attribuut]]))","v":{"$error":"#REF!"}},{"$f":"IF(Schema!#REF!=\"\",\"\",Schema!#REF!)","v":{"$error":"#REF!"}},{"$f":"IF(Schema!#REF!=\"\",\"\",Schema!#REF!)","v":{"$error":"#REF!"}},{"$f":"IF(Schema!#REF!=\"\",\"\",Schema!#REF!)","v":{"$error":"#REF!"}},{"$f":"IF(Schema!#REF!=\"\",\"\",Schema!#REF!)","v":{"$error":"#REF!"}},{"$f":"IF(Schema!#REF!=\"\",\"\",Schema!#REF!)","v":{"$error":"#REF!"}}]
[{"$f":"Schema!#REF!&Schema!#REF!&Schema!#REF!&Schema!#REF!","v":{"$error":"#REF!"}},{"$error":"#REF!"},{"$f":"IF(A257=\"\",\"\",IF(LEN(Schema!#REF!)=2,1,IF(LEN(Schema!#REF!)=2,10,IF(LEN(Schema!#REF!)=2,100,0))))","v":{"$error":"#REF!"}},{"$error":"#REF!"},{"$f":"IF(A257=\"\",\"\",SUM(Tabel2[[#This Row],[I1]:[I2]]))","v":{"$error":"#REF!"}},{"$error":"#REF!"},{"$error":"#REF!"},{"$error":"#REF!"},{"$error":"#REF!"},{"$f":"IF(C257=\"\",\"\",IF(LEN(Tabel2[[#This Row],[Entiteit of attribuut]])=2,\"\",Tabel2[[#This Row],[Entiteit]]&\"_\"&Tabel2[[#This Row],[Entiteit of attribuut]]))","v":{"$error":"#REF!"}},{"$f":"IF(Schema!#REF!=\"\",\"\",Schema!#REF!)","v":{"$error":"#REF!"}},{"$f":"IF(Schema!#REF!=\"\",\"\",Schema!#REF!)","v":{"$error":"#REF!"}},{"$f":"IF(Schema!#REF!=\"\",\"\",Schema!#REF!)","v":{"$error":"#REF!"}},{"$f":"IF(Schema!#REF!=\"\",\"\",Schema!#REF!)","v":{"$error":"#REF!"}},{"$f":"IF(Schema!#REF!=\"\",\"\",Schema!#REF!)","v":{"$error":"#REF!"}}]
[{"$f":"Schema!#REF!&Schema!#REF!&Schema!#REF!&Schema!#REF!","v":{"$error":"#REF!"}},{"$error":"#REF!"},{"$f":"IF(A258=\"\",\"\",IF(LEN(Schema!#REF!)=2,1,IF(LEN(Schema!#REF!)=2,10,IF(LEN(Schema!#REF!)=2,100,0))))","v":{"$error":"#REF!"}},{"$error":"#REF!"},{"$f":"IF(A258=\"\",\"\",SUM(Tabel2[[#This Row],[I1]:[I2]]))","v":{"$error":"#REF!"}},{"$error":"#REF!"},{"$error":"#REF!"},{"$error":"#REF!"},{"$error":"#REF!"},{"$f":"IF(C258=\"\",\"\",IF(LEN(Tabel2[[#This Row],[Entiteit of attribuut]])=2,\"\",Tabel2[[#This Row],[Entiteit]]&\"_\"&Tabel2[[#This Row],[Entiteit of attribuut]]))","v":{"$error":"#REF!"}},{"$f":"IF(Schema!#REF!=\"\",\"\",Schema!#REF!)","v":{"$error":"#REF!"}},{"$f":"IF(Schema!#REF!=\"\",\"\",Schema!#REF!)","v":{"$error":"#REF!"}},{"$f":"IF(Schema!#REF!=\"\",\"\",Schema!#REF!)","v":{"$error":"#REF!"}},{"$f":"IF(Schema!#REF!=\"\",\"\",Schema!#REF!)","v":{"$error":"#REF!"}},{"$f":"IF(Schema!#REF!=\"\",\"\",Schema!#REF!)","v":{"$error":"#REF!"}}]
[{"$f":"Schema!#REF!&Schema!#REF!&Schema!#REF!&Schema!#REF!","v":{"$error":"#REF!"}},{"$f":"IF(LEN(A259)=2,A259,IF(A259=\"\",\"Leeg\",B258))","v":{"$error":"#REF!"}},{"$f":"IF(A259=\"\",\"\",IF(LEN(Schema!#REF!)=2,1,IF(LEN(Schema!#REF!)=2,10,IF(LEN(Schema!#REF!)=2,100,0))))","v":{"$error":"#REF!"}},{"$f":"IF(C259=0,D258,C259)","v":{"$error":"#REF!"}},{"$f":"IF(A259=\"\",\"\",SUM(Tabel2[[#This Row],[I1]:[I2]]))","v":{"$error":"#REF!"}},{"$f":"IF(A259=\"\",\"\",IF(C259=1,B259,F258))","v":{"$error":"#REF!"}},{"$f":"IF(C259=10,A259,IF(OR(C259=0,C259=100),G258,\"\"))","v":{"$error":"#REF!"}},{"$f":"IF(E259=200,B259,IF(C259=0,H258,\"\"))","v":{"$error":"#REF!"}},{"$f":"IF(C259=\"\",\"\",IF(OR(E259=1,E259=10,E259=100),I258,IF(E259=2,F259,IF(E259=20,F259&\"/\"&G259,IF(E259=200,F259&\"/\"&G259&\"/\"&H259)))))","v":{"$error":"#REF!"}},{"$f":"IF(C259=\"\",\"\",IF(LEN(Tabel2[[#This Row],[Entiteit of attribuut]])=2,\"\",Tabel2[[#This Row],[Entiteit]]&\"_\"&Tabel2[[#This Row],[Entiteit of attribuut]]))","v":{"$error":"#REF!"}},{"$f":"IF(Schema!#REF!=\"\",\"\",Schema!#REF!)","v":{"$error":"#REF!"}},{"$f":"IF(Schema!#REF!=\"\",\"\",Schema!#REF!)","v":{"$error":"#REF!"}},{"$f":"IF(Schema!#REF!=\"\",\"\",Schema!#REF!)","v":{"$error":"#REF!"}},{"$f":"IF(Schema!#REF!=\"\",\"\",Schema!#REF!)","v":{"$error":"#REF!"}},{"$f":"IF(Schema!#REF!=\"\",\"\",Schema!#REF!)","v":{"$error":"#REF!"}}]
[{"$f":"Schema!#REF!&Schema!#REF!&Schema!#REF!&Schema!#REF!","v":{"$error":"#REF!"}},{"$error":"#REF!"},{"$f":"IF(A260=\"\",\"\",IF(LEN(Schema!#REF!)=2,1,IF(LEN(Schema!#REF!)=2,10,IF(LEN(Schema!#REF!)=2,100,0))))","v":{"$error":"#REF!"}},{"$error":"#REF!"},{"$f":"IF(A260=\"\",\"\",SUM(Tabel2[[#This Row],[I1]:[I2]]))","v":{"$error":"#REF!"}},{"$error":"#REF!"},{"$error":"#REF!"},{"$error":"#REF!"},{"$error":"#REF!"},{"$f":"IF(C260=\"\",\"\",IF(LEN(Tabel2[[#This Row],[Entiteit of attribuut]])=2,\"\",Tabel2[[#This Row],[Entiteit]]&\"_\"&Tabel2[[#This Row],[Entiteit of attribuut]]))","v":{"$error":"#REF!"}},{"$f":"IF(Schema!#REF!=\"\",\"\",Schema!#REF!)","v":{"$error":"#REF!"}},{"$f":"IF(Schema!#REF!=\"\",\"\",Schema!#REF!)","v":{"$error":"#REF!"}},{"$f":"IF(Schema!#REF!=\"\",\"\",Schema!#REF!)","v":{"$error":"#REF!"}},{"$f":"IF(Schema!#REF!=\"\",\"\",Schema!#REF!)","v":{"$error":"#REF!"}},{"$f":"IF(Schema!#REF!=\"\",\"\",Schema!#REF!)","v":{"$error":"#REF!"}}]
[{"$f":"Schema!#REF!&Schema!#REF!&Schema!#REF!&Schema!#REF!","v":{"$error":"#REF!"}},{"$error":"#REF!"},{"$f":"IF(A261=\"\",\"\",IF(LEN(Schema!#REF!)=2,1,IF(LEN(Schema!#REF!)=2,10,IF(LEN(Schema!#REF!)=2,100,0))))","v":{"$error":"#REF!"}},{"$error":"#REF!"},{"$f":"IF(A261=\"\",\"\",SUM(Tabel2[[#This Row],[I1]:[I2]]))","v":{"$error":"#REF!"}},{"$error":"#REF!"},{"$error":"#REF!"},{"$error":"#REF!"},{"$error":"#REF!"},{"$f":"IF(C261=\"\",\"\",IF(LEN(Tabel2[[#This Row],[Entiteit of attribuut]])=2,\"\",Tabel2[[#This Row],[Entiteit]]&\"_\"&Tabel2[[#This Row],[Entiteit of attribuut]]))","v":{"$error":"#REF!"}},{"$f":"IF(Schema!#REF!=\"\",\"\",Schema!#REF!)","v":{"$error":"#REF!"}},{"$f":"IF(Schema!#REF!=\"\",\"\",Schema!#REF!)","v":{"$error":"#REF!"}},{"$f":"IF(Schema!#REF!=\"\",\"\",Schema!#REF!)","v":{"$error":"#REF!"}},{"$f":"IF(Schema!#REF!=\"\",\"\",Schema!#REF!)","v":{"$error":"#REF!"}},{"$f":"IF(Schema!#REF!=\"\",\"\",Schema!#REF!)","v":{"$error":"#REF!"}}]
[{"$f":"Schema!#REF!&Schema!#REF!&Schema!#REF!&Schema!#REF!","v":{"$error":"#REF!"}},{"$error":"#REF!"},{"$f":"IF(A262=\"\",\"\",IF(LEN(Schema!#REF!)=2,1,IF(LEN(Schema!#REF!)=2,10,IF(LEN(Schema!#REF!)=2,100,0))))","v":{"$error":"#REF!"}},{"$error":"#REF!"},{"$f":"IF(A262=\"\",\"\",SUM(Tabel2[[#This Row],[I1]:[I2]]))","v":{"$error":"#REF!"}},{"$error":"#REF!"},{"$error":"#REF!"},{"$error":"#REF!"},{"$error":"#REF!"},{"$f":"IF(C262=\"\",\"\",IF(LEN(Tabel2[[#This Row],[Entiteit of attribuut]])=2,\"\",Tabel2[[#This Row],[Entiteit]]&\"_\"&Tabel2[[#This Row],[Entiteit of attribuut]]))","v":{"$error":"#REF!"}},{"$f":"IF(Schema!#REF!=\"\",\"\",Schema!#REF!)","v":{"$error":"#REF!"}},{"$f":"IF(Schema!#REF!=\"\",\"\",Schema!#REF!)","v":{"$error":"#REF!"}},{"$f":"IF(Schema!#REF!=\"\",\"\",Schema!#REF!)","v":{"$error":"#REF!"}},{"$f":"IF(Schema!#REF!=\"\",\"\",Schema!#REF!)","v":{"$error":"#REF!"}},{"$f":"IF(Schema!#REF!=\"\",\"\",Schema!#REF!)","v":{"$error":"#REF!"}}]
[{"$f":"Schema!#REF!&Schema!#REF!&Schema!#REF!&Schema!#REF!","v":{"$error":"#REF!"}},{"$error":"#REF!"},{"$f":"IF(A263=\"\",\"\",IF(LEN(Schema!#REF!)=2,1,IF(LEN(Schema!#REF!)=2,10,IF(LEN(Schema!#REF!)=2,100,0))))","v":{"$error":"#REF!"}},{"$error":"#REF!"},{"$f":"IF(A263=\"\",\"\",SUM(Tabel2[[#This Row],[I1]:[I2]]))","v":{"$error":"#REF!"}},{"$error":"#REF!"},{"$error":"#REF!"},{"$error":"#REF!"},{"$error":"#REF!"},{"$f":"IF(C263=\"\",\"\",IF(LEN(Tabel2[[#This Row],[Entiteit of attribuut]])=2,\"\",Tabel2[[#This Row],[Entiteit]]&\"_\"&Tabel2[[#This Row],[Entiteit of attribuut]]))","v":{"$error":"#REF!"}},{"$f":"IF(Schema!#REF!=\"\",\"\",Schema!#REF!)","v":{"$error":"#REF!"}},{"$f":"IF(Schema!#REF!=\"\",\"\",Schema!#REF!)","v":{"$error":"#REF!"}},{"$f":"IF(Schema!#REF!=\"\",\"\",Schema!#REF!)","v":{"$error":"#REF!"}},{"$f":"IF(Schema!#REF!=\"\",\"\",Schema!#REF!)","v":{"$error":"#REF!"}},{"$f":"IF(Schema!#REF!=\"\",\"\",Schema!#REF!)","v":{"$error":"#REF!"}}]
[{"$f":"Schema!#REF!&Schema!#REF!&Schema!#REF!&Schema!#REF!","v":{"$error":"#REF!"}},{"$error":"#REF!"},{"$f":"IF(A264=\"\",\"\",IF(LEN(Schema!#REF!)=2,1,IF(LEN(Schema!#REF!)=2,10,IF(LEN(Schema!#REF!)=2,100,0))))","v":{"$error":"#REF!"}},{"$error":"#REF!"},{"$f":"IF(A264=\"\",\"\",SUM(Tabel2[[#This Row],[I1]:[I2]]))","v":{"$error":"#REF!"}},{"$error":"#REF!"},{"$error":"#REF!"},{"$error":"#REF!"},{"$error":"#REF!"},{"$f":"IF(C264=\"\",\"\",IF(LEN(Tabel2[[#This Row],[Entiteit of attribuut]])=2,\"\",Tabel2[[#This Row],[Entiteit]]&\"_\"&Tabel2[[#This Row],[Entiteit of attribuut]]))","v":{"$error":"#REF!"}},{"$f":"IF(Schema!#REF!=\"\",\"\",Schema!#REF!)","v":{"$error":"#REF!"}},{"$f":"IF(Schema!#REF!=\"\",\"\",Schema!#REF!)","v":{"$error":"#REF!"}},{"$f":"IF(Schema!#REF!=\"\",\"\",Schema!#REF!)","v":{"$error":"#REF!"}},{"$f":"IF(Schema!#REF!=\"\",\"\",Schema!#REF!)","v":{"$error":"#REF!"}},{"$f":"IF(Schema!#REF!=\"\",\"\",Schema!#REF!)","v":{"$error":"#REF!"}}]
[{"$f":"Schema!#REF!&Schema!#REF!&Schema!#REF!&Schema!#REF!","v":{"$error":"#REF!"}},{"$error":"#REF!"},{"$f":"IF(A265=\"\",\"\",IF(LEN(Schema!#REF!)=2,1,IF(LEN(Schema!#REF!)=2,10,IF(LEN(Schema!#REF!)=2,100,0))))","v":{"$error":"#REF!"}},{"$error":"#REF!"},{"$f":"IF(A265=\"\",\"\",SUM(Tabel2[[#This Row],[I1]:[I2]]))","v":{"$error":"#REF!"}},{"$error":"#REF!"},{"$error":"#REF!"},{"$error":"#REF!"},{"$error":"#REF!"},{"$f":"IF(C265=\"\",\"\",IF(LEN(Tabel2[[#This Row],[Entiteit of attribuut]])=2,\"\",Tabel2[[#This Row],[Entiteit]]&\"_\"&Tabel2[[#This Row],[Entiteit of attribuut]]))","v":{"$error":"#REF!"}},{"$f":"IF(Schema!#REF!=\"\",\"\",Schema!#REF!)","v":{"$error":"#REF!"}},{"$f":"IF(Schema!#REF!=\"\",\"\",Schema!#REF!)","v":{"$error":"#REF!"}},{"$f":"IF(Schema!#REF!=\"\",\"\",Schema!#REF!)","v":{"$error":"#REF!"}},{"$f":"IF(Schema!#REF!=\"\",\"\",Schema!#REF!)","v":{"$error":"#REF!"}},{"$f":"IF(Schema!#REF!=\"\",\"\",Schema!#REF!)","v":{"$error":"#REF!"}}]
[{"$f":"Schema!#REF!&Schema!#REF!&Schema!#REF!&Schema!#REF!","v":{"$error":"#REF!"}},{"$error":"#REF!"},{"$f":"IF(A266=\"\",\"\",IF(LEN(Schema!#REF!)=2,1,IF(LEN(Schema!#REF!)=2,10,IF(LEN(Schema!#REF!)=2,100,0))))","v":{"$error":"#REF!"}},{"$error":"#REF!"},{"$f":"IF(A266=\"\",\"\",SUM(Tabel2[[#This Row],[I1]:[I2]]))","v":{"$error":"#REF!"}},{"$error":"#REF!"},{"$error":"#REF!"},{"$error":"#REF!"},{"$error":"#REF!"},{"$f":"IF(C266=\"\",\"\",IF(LEN(Tabel2[[#This Row],[Entiteit of attribuut]])=2,\"\",Tabel2[[#This Row],[Entiteit]]&\"_\"&Tabel2[[#This Row],[Entiteit of attribuut]]))","v":{"$error":"#REF!"}},{"$f":"IF(Schema!#REF!=\"\",\"\",Schema!#REF!)","v":{"$error":"#REF!"}},{"$f":"IF(Schema!#REF!=\"\",\"\",Schema!#REF!)","v":{"$error":"#REF!"}},{"$f":"IF(Schema!#REF!=\"\",\"\",Schema!#REF!)","v":{"$error":"#REF!"}},{"$f":"IF(Schema!#REF!=\"\",\"\",Schema!#REF!)","v":{"$error":"#REF!"}},{"$f":"IF(Schema!#REF!=\"\",\"\",Schema!#REF!)","v":{"$error":"#REF!"}}]
[{"$f":"Schema!#REF!&Schema!#REF!&Schema!#REF!&Schema!#REF!","v":{"$error":"#REF!"}},{"$error":"#REF!"},{"$f":"IF(A267=\"\",\"\",IF(LEN(Schema!#REF!)=2,1,IF(LEN(Schema!#REF!)=2,10,IF(LEN(Schema!#REF!)=2,100,0))))","v":{"$error":"#REF!"}},{"$error":"#REF!"},{"$f":"IF(A267=\"\",\"\",SUM(Tabel2[[#This Row],[I1]:[I2]]))","v":{"$error":"#REF!"}},{"$error":"#REF!"},{"$error":"#REF!"},{"$error":"#REF!"},{"$error":"#REF!"},{"$f":"IF(C267=\"\",\"\",IF(LEN(Tabel2[[#This Row],[Entiteit of attribuut]])=2,\"\",Tabel2[[#This Row],[Entiteit]]&\"_\"&Tabel2[[#This Row],[Entiteit of attribuut]]))","v":{"$error":"#REF!"}},{"$f":"IF(Schema!#REF!=\"\",\"\",Schema!#REF!)","v":{"$error":"#REF!"}},{"$f":"IF(Schema!#REF!=\"\",\"\",Schema!#REF!)","v":{"$error":"#REF!"}},{"$f":"IF(Schema!#REF!=\"\",\"\",Schema!#REF!)","v":{"$error":"#REF!"}},{"$f":"IF(Schema!#REF!=\"\",\"\",Schema!#REF!)","v":{"$error":"#REF!"}},{"$f":"IF(Schema!#REF!=\"\",\"\",Schema!#REF!)","v":{"$error":"#REF!"}}]
[{"$f":"Schema!#REF!&Schema!#REF!&Schema!#REF!&Schema!#REF!","v":{"$error":"#REF!"}},{"$error":"#REF!"},{"$f":"IF(A268=\"\",\"\",IF(LEN(Schema!#REF!)=2,1,IF(LEN(Schema!#REF!)=2,10,IF(LEN(Schema!#REF!)=2,100,0))))","v":{"$error":"#REF!"}},{"$error":"#REF!"},{"$f":"IF(A268=\"\",\"\",SUM(Tabel2[[#This Row],[I1]:[I2]]))","v":{"$error":"#REF!"}},{"$error":"#REF!"},{"$error":"#REF!"},{"$error":"#REF!"},{"$error":"#REF!"},{"$f":"IF(C268=\"\",\"\",IF(LEN(Tabel2[[#This Row],[Entiteit of attribuut]])=2,\"\",Tabel2[[#This Row],[Entiteit]]&\"_\"&Tabel2[[#This Row],[Entiteit of attribuut]]))","v":{"$error":"#REF!"}},{"$f":"IF(Schema!#REF!=\"\",\"\",Schema!#REF!)","v":{"$error":"#REF!"}},{"$f":"IF(Schema!#REF!=\"\",\"\",Schema!#REF!)","v":{"$error":"#REF!"}},{"$f":"IF(Schema!#REF!=\"\",\"\",Schema!#REF!)","v":{"$error":"#REF!"}},{"$f":"IF(Schema!#REF!=\"\",\"\",Schema!#REF!)","v":{"$error":"#REF!"}},{"$f":"IF(Schema!#REF!=\"\",\"\",Schema!#REF!)","v":{"$error":"#REF!"}}]
[{"$f":"Schema!#REF!&Schema!#REF!&Schema!#REF!&Schema!#REF!","v":{"$error":"#REF!"}},{"$error":"#REF!"},{"$f":"IF(A269=\"\",\"\",IF(LEN(Schema!#REF!)=2,1,IF(LEN(Schema!#REF!)=2,10,IF(LEN(Schema!#REF!)=2,100,0))))","v":{"$error":"#REF!"}},{"$error":"#REF!"},{"$f":"IF(A269=\"\",\"\",SUM(Tabel2[[#This Row],[I1]:[I2]]))","v":{"$error":"#REF!"}},{"$error":"#REF!"},{"$error":"#REF!"},{"$error":"#REF!"},{"$error":"#REF!"},{"$f":"IF(C269=\"\",\"\",IF(LEN(Tabel2[[#This Row],[Entiteit of attribuut]])=2,\"\",Tabel2[[#This Row],[Entiteit]]&\"_\"&Tabel2[[#This Row],[Entiteit of attribuut]]))","v":{"$error":"#REF!"}},{"$f":"IF(Schema!#REF!=\"\",\"\",Schema!#REF!)","v":{"$error":"#REF!"}},{"$f":"IF(Schema!#REF!=\"\",\"\",Schema!#REF!)","v":{"$error":"#REF!"}},{"$f":"IF(Schema!#REF!=\"\",\"\",Schema!#REF!)","v":{"$error":"#REF!"}},{"$f":"IF(Schema!#REF!=\"\",\"\",Schema!#REF!)","v":{"$error":"#REF!"}},{"$f":"IF(Schema!#REF!=\"\",\"\",Schema!#REF!)","v":{"$error":"#REF!"}}]
[{"$f":"Schema!#REF!&Schema!#REF!&Schema!#REF!&Schema!#REF!","v":{"$error":"#REF!"}},{"$error":"#REF!"},{"$f":"IF(A270=\"\",\"\",IF(LEN(Schema!#REF!)=2,1,IF(LEN(Schema!#REF!)=2,10,IF(LEN(Schema!#REF!)=2,100,0))))","v":{"$error":"#REF!"}},{"$error":"#REF!"},{"$f":"IF(A270=\"\",\"\",SUM(Tabel2[[#This Row],[I1]:[I2]]))","v":{"$error":"#REF!"}},{"$error":"#REF!"},{"$error":"#REF!"},{"$error":"#REF!"},{"$error":"#REF!"},{"$f":"IF(C270=\"\",\"\",IF(LEN(Tabel2[[#This Row],[Entiteit of attribuut]])=2,\"\",Tabel2[[#This Row],[Entiteit]]&\"_\"&Tabel2[[#This Row],[Entiteit of attribuut]]))","v":{"$error":"#REF!"}},{"$f":"IF(Schema!#REF!=\"\",\"\",Schema!#REF!)","v":{"$error":"#REF!"}},{"$f":"IF(Schema!#REF!=\"\",\"\",Schema!#REF!)","v":{"$error":"#REF!"}},{"$f":"IF(Schema!#REF!=\"\",\"\",Schema!#REF!)","v":{"$error":"#REF!"}},{"$f":"IF(Schema!#REF!=\"\",\"\",Schema!#REF!)","v":{"$error":"#REF!"}},{"$f":"IF(Schema!#REF!=\"\",\"\",Schema!#REF!)","v":{"$error":"#REF!"}}]
[{"$f":"Schema!#REF!&Schema!#REF!&Schema!#REF!&Schema!#REF!","v":{"$error":"#REF!"}},{"$error":"#REF!"},{"$f":"IF(A271=\"\",\"\",IF(LEN(Schema!#REF!)=2,1,IF(LEN(Schema!#REF!)=2,10,IF(LEN(Schema!#REF!)=2,100,0))))","v":{"$error":"#REF!"}},{"$error":"#REF!"},{"$f":"IF(A271=\"\",\"\",SUM(Tabel2[[#This Row],[I1]:[I2]]))","v":{"$error":"#REF!"}},{"$error":"#REF!"},{"$error":"#REF!"},{"$error":"#REF!"},{"$error":"#REF!"},{"$f":"IF(C271=\"\",\"\",IF(LEN(Tabel2[[#This Row],[Entiteit of attribuut]])=2,\"\",Tabel2[[#This Row],[Entiteit]]&\"_\"&Tabel2[[#This Row],[Entiteit of attribuut]]))","v":{"$error":"#REF!"}},{"$f":"IF(Schema!#REF!=\"\",\"\",Schema!#REF!)","v":{"$error":"#REF!"}},{"$f":"IF(Schema!#REF!=\"\",\"\",Schema!#REF!)","v":{"$error":"#REF!"}},{"$f":"IF(Schema!#REF!=\"\",\"\",Schema!#REF!)","v":{"$error":"#REF!"}},{"$f":"IF(Schema!#REF!=\"\",\"\",Schema!#REF!)","v":{"$error":"#REF!"}},{"$f":"IF(Schema!#REF!=\"\",\"\",Schema!#REF!)","v":{"$error":"#REF!"}}]
[{"$f":"Schema!#REF!&Schema!#REF!&Schema!#REF!&Schema!#REF!","v":{"$error":"#REF!"}},{"$error":"#REF!"},{"$f":"IF(A272=\"\",\"\",IF(LEN(Schema!#REF!)=2,1,IF(LEN(Schema!#REF!)=2,10,IF(LEN(Schema!#REF!)=2,100,0))))","v":{"$error":"#REF!"}},{"$error":"#REF!"},{"$f":"IF(A272=\"\",\"\",SUM(Tabel2[[#This Row],[I1]:[I2]]))","v":{"$error":"#REF!"}},{"$error":"#REF!"},{"$error":"#REF!"},{"$error":"#REF!"},{"$error":"#REF!"},{"$f":"IF(C272=\"\",\"\",IF(LEN(Tabel2[[#This Row],[Entiteit of attribuut]])=2,\"\",Tabel2[[#This Row],[Entiteit]]&\"_\"&Tabel2[[#This Row],[Entiteit of attribuut]]))","v":{"$error":"#REF!"}},{"$f":"IF(Schema!#REF!=\"\",\"\",Schema!#REF!)","v":{"$error":"#REF!"}},{"$f":"IF(Schema!#REF!=\"\",\"\",Schema!#REF!)","v":{"$error":"#REF!"}},{"$f":"IF(Schema!#REF!=\"\",\"\",Schema!#REF!)","v":{"$error":"#REF!"}},{"$f":"IF(Schema!#REF!=\"\",\"\",Schema!#REF!)","v":{"$error":"#REF!"}},{"$f":"IF(Schema!#REF!=\"\",\"\",Schema!#REF!)","v":{"$error":"#REF!"}}]
[{"$f":"Schema!#REF!&Schema!#REF!&Schema!#REF!&Schema!#REF!","v":{"$error":"#REF!"}},{"$error":"#REF!"},{"$f":"IF(A273=\"\",\"\",IF(LEN(Schema!#REF!)=2,1,IF(LEN(Schema!#REF!)=2,10,IF(LEN(Schema!#REF!)=2,100,0))))","v":{"$error":"#REF!"}},{"$error":"#REF!"},{"$f":"IF(A273=\"\",\"\",SUM(Tabel2[[#This Row],[I1]:[I2]]))","v":{"$error":"#REF!"}},{"$error":"#REF!"},{"$error":"#REF!"},{"$error":"#REF!"},{"$error":"#REF!"},{"$f":"IF(C273=\"\",\"\",IF(LEN(Tabel2[[#This Row],[Entiteit of attribuut]])=2,\"\",Tabel2[[#This Row],[Entiteit]]&\"_\"&Tabel2[[#This Row],[Entiteit of attribuut]]))","v":{"$error":"#REF!"}},{"$f":"IF(Schema!#REF!=\"\",\"\",Schema!#REF!)","v":{"$error":"#REF!"}},{"$f":"IF(Schema!#REF!=\"\",\"\",Schema!#REF!)","v":{"$error":"#REF!"}},{"$f":"IF(Schema!#REF!=\"\",\"\",Schema!#REF!)","v":{"$error":"#REF!"}},{"$f":"IF(Schema!#REF!=\"\",\"\",Schema!#REF!)","v":{"$error":"#REF!"}},{"$f":"IF(Schema!#REF!=\"\",\"\",Schema!#REF!)","v":{"$error":"#REF!"}}]
[{"$f":"Schema!#REF!&Schema!#REF!&Schema!#REF!&Schema!#REF!","v":{"$error":"#REF!"}},{"$error":"#REF!"},{"$f":"IF(A274=\"\",\"\",IF(LEN(Schema!#REF!)=2,1,IF(LEN(Schema!#REF!)=2,10,IF(LEN(Schema!#REF!)=2,100,0))))","v":{"$error":"#REF!"}},{"$error":"#REF!"},{"$f":"IF(A274=\"\",\"\",SUM(Tabel2[[#This Row],[I1]:[I2]]))","v":{"$error":"#REF!"}},{"$error":"#REF!"},{"$error":"#REF!"},{"$error":"#REF!"},{"$error":"#REF!"},{"$f":"IF(C274=\"\",\"\",IF(LEN(Tabel2[[#This Row],[Entiteit of attribuut]])=2,\"\",Tabel2[[#This Row],[Entiteit]]&\"_\"&Tabel2[[#This Row],[Entiteit of attribuut]]))","v":{"$error":"#REF!"}},{"$f":"IF(Schema!#REF!=\"\",\"\",Schema!#REF!)","v":{"$error":"#REF!"}},{"$f":"IF(Schema!#REF!=\"\",\"\",Schema!#REF!)","v":{"$error":"#REF!"}},{"$f":"IF(Schema!#REF!=\"\",\"\",Schema!#REF!)","v":{"$error":"#REF!"}},{"$f":"IF(Schema!#REF!=\"\",\"\",Schema!#REF!)","v":{"$error":"#REF!"}},{"$f":"IF(Schema!#REF!=\"\",\"\",Schema!#REF!)","v":{"$error":"#REF!"}}]
[{"$f":"Schema!#REF!&Schema!#REF!&Schema!#REF!&Schema!#REF!","v":{"$error":"#REF!"}},{"$error":"#REF!"},{"$f":"IF(A275=\"\",\"\",IF(LEN(Schema!#REF!)=2,1,IF(LEN(Schema!#REF!)=2,10,IF(LEN(Schema!#REF!)=2,100,0))))","v":{"$error":"#REF!"}},{"$error":"#REF!"},{"$f":"IF(A275=\"\",\"\",SUM(Tabel2[[#This Row],[I1]:[I2]]))","v":{"$error":"#REF!"}},{"$error":"#REF!"},{"$error":"#REF!"},{"$error":"#REF!"},{"$error":"#REF!"},{"$f":"IF(C275=\"\",\"\",IF(LEN(Tabel2[[#This Row],[Entiteit of attribuut]])=2,\"\",Tabel2[[#This Row],[Entiteit]]&\"_\"&Tabel2[[#This Row],[Entiteit of attribuut]]))","v":{"$error":"#REF!"}},{"$f":"IF(Schema!#REF!=\"\",\"\",Schema!#REF!)","v":{"$error":"#REF!"}},{"$f":"IF(Schema!#REF!=\"\",\"\",Schema!#REF!)","v":{"$error":"#REF!"}},{"$f":"IF(Schema!#REF!=\"\",\"\",Schema!#REF!)","v":{"$error":"#REF!"}},{"$f":"IF(Schema!#REF!=\"\",\"\",Schema!#REF!)","v":{"$error":"#REF!"}},{"$f":"IF(Schema!#REF!=\"\",\"\",Schema!#REF!)","v":{"$error":"#REF!"}}]
[{"$f":"Schema!#REF!&Schema!#REF!&Schema!#REF!&Schema!#REF!","v":{"$error":"#REF!"}},{"$error":"#REF!"},{"$f":"IF(A276=\"\",\"\",IF(LEN(Schema!#REF!)=2,1,IF(LEN(Schema!#REF!)=2,10,IF(LEN(Schema!#REF!)=2,100,0))))","v":{"$error":"#REF!"}},{"$error":"#REF!"},{"$f":"IF(A276=\"\",\"\",SUM(Tabel2[[#This Row],[I1]:[I2]]))","v":{"$error":"#REF!"}},{"$error":"#REF!"},{"$error":"#REF!"},{"$error":"#REF!"},{"$error":"#REF!"},{"$f":"IF(C276=\"\",\"\",IF(LEN(Tabel2[[#This Row],[Entiteit of attribuut]])=2,\"\",Tabel2[[#This Row],[Entiteit]]&\"_\"&Tabel2[[#This Row],[Entiteit of attribuut]]))","v":{"$error":"#REF!"}},{"$f":"IF(Schema!#REF!=\"\",\"\",Schema!#REF!)","v":{"$error":"#REF!"}},{"$f":"IF(Schema!#REF!=\"\",\"\",Schema!#REF!)","v":{"$error":"#REF!"}},{"$f":"IF(Schema!#REF!=\"\",\"\",Schema!#REF!)","v":{"$error":"#REF!"}},{"$f":"IF(Schema!#REF!=\"\",\"\",Schema!#REF!)","v":{"$error":"#REF!"}},{"$f":"IF(Schema!#REF!=\"\",\"\",Schema!#REF!)","v":{"$error":"#REF!"}}]
[{"$f":"Schema!#REF!&Schema!#REF!&Schema!#REF!&Schema!#REF!","v":{"$error":"#REF!"}},{"$error":"#REF!"},{"$f":"IF(A277=\"\",\"\",IF(LEN(Schema!#REF!)=2,1,IF(LEN(Schema!#REF!)=2,10,IF(LEN(Schema!#REF!)=2,100,0))))","v":{"$error":"#REF!"}},{"$error":"#REF!"},{"$f":"IF(A277=\"\",\"\",SUM(Tabel2[[#This Row],[I1]:[I2]]))","v":{"$error":"#REF!"}},{"$error":"#REF!"},{"$error":"#REF!"},{"$error":"#REF!"},{"$error":"#REF!"},{"$f":"IF(C277=\"\",\"\",IF(LEN(Tabel2[[#This Row],[Entiteit of attribuut]])=2,\"\",Tabel2[[#This Row],[Entiteit]]&\"_\"&Tabel2[[#This Row],[Entiteit of attribuut]]))","v":{"$error":"#REF!"}},{"$f":"IF(Schema!#REF!=\"\",\"\",Schema!#REF!)","v":{"$error":"#REF!"}},{"$f":"IF(Schema!#REF!=\"\",\"\",Schema!#REF!)","v":{"$error":"#REF!"}},{"$f":"IF(Schema!#REF!=\"\",\"\",Schema!#REF!)","v":{"$error":"#REF!"}},{"$f":"IF(Schema!#REF!=\"\",\"\",Schema!#REF!)","v":{"$error":"#REF!"}},{"$f":"IF(Schema!#REF!=\"\",\"\",Schema!#REF!)","v":{"$error":"#REF!"}}]
[{"$f":"Schema!#REF!&Schema!#REF!&Schema!#REF!&Schema!#REF!","v":{"$error":"#REF!"}},{"$error":"#REF!"},{"$f":"IF(A278=\"\",\"\",IF(LEN(Schema!#REF!)=2,1,IF(LEN(Schema!#REF!)=2,10,IF(LEN(Schema!#REF!)=2,100,0))))","v":{"$error":"#REF!"}},{"$error":"#REF!"},{"$f":"IF(A278=\"\",\"\",SUM(Tabel2[[#This Row],[I1]:[I2]]))","v":{"$error":"#REF!"}},{"$error":"#REF!"},{"$error":"#REF!"},{"$error":"#REF!"},{"$error":"#REF!"},{"$f":"IF(C278=\"\",\"\",IF(LEN(Tabel2[[#This Row],[Entiteit of attribuut]])=2,\"\",Tabel2[[#This Row],[Entiteit]]&\"_\"&Tabel2[[#This Row],[Entiteit of attribuut]]))","v":{"$error":"#REF!"}},{"$f":"IF(Schema!#REF!=\"\",\"\",Schema!#REF!)","v":{"$error":"#REF!"}},{"$f":"IF(Schema!#REF!=\"\",\"\",Schema!#REF!)","v":{"$error":"#REF!"}},{"$f":"IF(Schema!#REF!=\"\",\"\",Schema!#REF!)","v":{"$error":"#REF!"}},{"$f":"IF(Schema!#REF!=\"\",\"\",Schema!#REF!)","v":{"$error":"#REF!"}},{"$f":"IF(Schema!#REF!=\"\",\"\",Schema!#REF!)","v":{"$error":"#REF!"}}]
[{"$f":"Schema!#REF!&Schema!#REF!&Schema!#REF!&Schema!#REF!","v":{"$error":"#REF!"}},{"$error":"#REF!"},{"$f":"IF(A279=\"\",\"\",IF(LEN(Schema!#REF!)=2,1,IF(LEN(Schema!#REF!)=2,10,IF(LEN(Schema!#REF!)=2,100,0))))","v":{"$error":"#REF!"}},{"$error":"#REF!"},{"$f":"IF(A279=\"\",\"\",SUM(Tabel2[[#This Row],[I1]:[I2]]))","v":{"$error":"#REF!"}},{"$error":"#REF!"},{"$error":"#REF!"},{"$error":"#REF!"},{"$error":"#REF!"},{"$f":"IF(C279=\"\",\"\",IF(LEN(Tabel2[[#This Row],[Entiteit of attribuut]])=2,\"\",Tabel2[[#This Row],[Entiteit]]&\"_\"&Tabel2[[#This Row],[Entiteit of attribuut]]))","v":{"$error":"#REF!"}},{"$f":"IF(Schema!#REF!=\"\",\"\",Schema!#REF!)","v":{"$error":"#REF!"}},{"$f":"IF(Schema!#REF!=\"\",\"\",Schema!#REF!)","v":{"$error":"#REF!"}},{"$f":"IF(Schema!#REF!=\"\",\"\",Schema!#REF!)","v":{"$error":"#REF!"}},{"$f":"IF(Schema!#REF!=\"\",\"\",Schema!#REF!)","v":{"$error":"#REF!"}},{"$f":"IF(Schema!#REF!=\"\",\"\",Schema!#REF!)","v":{"$error":"#REF!"}}]
[{"$f":"Schema!#REF!&Schema!#REF!&Schema!#REF!&Schema!#REF!","v":{"$error":"#REF!"}},{"$error":"#REF!"},{"$f":"IF(A280=\"\",\"\",IF(LEN(Schema!#REF!)=2,1,IF(LEN(Schema!#REF!)=2,10,IF(LEN(Schema!#REF!)=2,100,0))))","v":{"$error":"#REF!"}},{"$error":"#REF!"},{"$f":"IF(A280=\"\",\"\",SUM(Tabel2[[#This Row],[I1]:[I2]]))","v":{"$error":"#REF!"}},{"$error":"#REF!"},{"$error":"#REF!"},{"$error":"#REF!"},{"$error":"#REF!"},{"$f":"IF(C280=\"\",\"\",IF(LEN(Tabel2[[#This Row],[Entiteit of attribuut]])=2,\"\",Tabel2[[#This Row],[Entiteit]]&\"_\"&Tabel2[[#This Row],[Entiteit of attribuut]]))","v":{"$error":"#REF!"}},{"$f":"IF(Schema!#REF!=\"\",\"\",Schema!#REF!)","v":{"$error":"#REF!"}},{"$f":"IF(Schema!#REF!=\"\",\"\",Schema!#REF!)","v":{"$error":"#REF!"}},{"$f":"IF(Schema!#REF!=\"\",\"\",Schema!#REF!)","v":{"$error":"#REF!"}},{"$f":"IF(Schema!#REF!=\"\",\"\",Schema!#REF!)","v":{"$error":"#REF!"}},{"$f":"IF(Schema!#REF!=\"\",\"\",Schema!#REF!)","v":{"$error":"#REF!"}}]
[{"$f":"Schema!#REF!&Schema!#REF!&Schema!#REF!&Schema!#REF!","v":{"$error":"#REF!"}},{"$error":"#REF!"},{"$f":"IF(A281=\"\",\"\",IF(LEN(Schema!#REF!)=2,1,IF(LEN(Schema!#REF!)=2,10,IF(LEN(Schema!#REF!)=2,100,0))))","v":{"$error":"#REF!"}},{"$error":"#REF!"},{"$f":"IF(A281=\"\",\"\",SUM(Tabel2[[#This Row],[I1]:[I2]]))","v":{"$error":"#REF!"}},{"$error":"#REF!"},{"$error":"#REF!"},{"$error":"#REF!"},{"$error":"#REF!"},{"$f":"IF(C281=\"\",\"\",IF(LEN(Tabel2[[#This Row],[Entiteit of attribuut]])=2,\"\",Tabel2[[#This Row],[Entiteit]]&\"_\"&Tabel2[[#This Row],[Entiteit of attribuut]]))","v":{"$error":"#REF!"}},{"$f":"IF(Schema!#REF!=\"\",\"\",Schema!#REF!)","v":{"$error":"#REF!"}},{"$f":"IF(Schema!#REF!=\"\",\"\",Schema!#REF!)","v":{"$error":"#REF!"}},{"$f":"IF(Schema!#REF!=\"\",\"\",Schema!#REF!)","v":{"$error":"#REF!"}},{"$f":"IF(Schema!#REF!=\"\",\"\",Schema!#REF!)","v":{"$error":"#REF!"}},{"$f":"IF(Schema!#REF!=\"\",\"\",Schema!#REF!)","v":{"$error":"#REF!"}}]
[{"$f":"Schema!#REF!&Schema!#REF!&Schema!#REF!&Schema!#REF!","v":{"$error":"#REF!"}},{"$error":"#REF!"},{"$f":"IF(A282=\"\",\"\",IF(LEN(Schema!#REF!)=2,1,IF(LEN(Schema!#REF!)=2,10,IF(LEN(Schema!#REF!)=2,100,0))))","v":{"$error":"#REF!"}},{"$error":"#REF!"},{"$f":"IF(A282=\"\",\"\",SUM(Tabel2[[#This Row],[I1]:[I2]]))","v":{"$error":"#REF!"}},{"$error":"#REF!"},{"$error":"#REF!"},{"$error":"#REF!"},{"$error":"#REF!"},{"$f":"IF(C282=\"\",\"\",IF(LEN(Tabel2[[#This Row],[Entiteit of attribuut]])=2,\"\",Tabel2[[#This Row],[Entiteit]]&\"_\"&Tabel2[[#This Row],[Entiteit of attribuut]]))","v":{"$error":"#REF!"}},{"$f":"IF(Schema!#REF!=\"\",\"\",Schema!#REF!)","v":{"$error":"#REF!"}},{"$f":"IF(Schema!#REF!=\"\",\"\",Schema!#REF!)","v":{"$error":"#REF!"}},{"$f":"IF(Schema!#REF!=\"\",\"\",Schema!#REF!)","v":{"$error":"#REF!"}},{"$f":"IF(Schema!#REF!=\"\",\"\",Schema!#REF!)","v":{"$error":"#REF!"}},{"$f":"IF(Schema!#REF!=\"\",\"\",Schema!#REF!)","v":{"$error":"#REF!"}}]
[{"$f":"Schema!#REF!&Schema!#REF!&Schema!#REF!&Schema!#REF!","v":{"$error":"#REF!"}},{"$error":"#REF!"},{"$f":"IF(A283=\"\",\"\",IF(LEN(Schema!#REF!)=2,1,IF(LEN(Schema!#REF!)=2,10,IF(LEN(Schema!#REF!)=2,100,0))))","v":{"$error":"#REF!"}},{"$error":"#REF!"},{"$f":"IF(A283=\"\",\"\",SUM(Tabel2[[#This Row],[I1]:[I2]]))","v":{"$error":"#REF!"}},{"$error":"#REF!"},{"$error":"#REF!"},{"$error":"#REF!"},{"$error":"#REF!"},{"$f":"IF(C283=\"\",\"\",IF(LEN(Tabel2[[#This Row],[Entiteit of attribuut]])=2,\"\",Tabel2[[#This Row],[Entiteit]]&\"_\"&Tabel2[[#This Row],[Entiteit of attribuut]]))","v":{"$error":"#REF!"}},{"$f":"IF(Schema!#REF!=\"\",\"\",Schema!#REF!)","v":{"$error":"#REF!"}},{"$f":"IF(Schema!#REF!=\"\",\"\",Schema!#REF!)","v":{"$error":"#REF!"}},{"$f":"IF(Schema!#REF!=\"\",\"\",Schema!#REF!)","v":{"$error":"#REF!"}},{"$f":"IF(Schema!#REF!=\"\",\"\",Schema!#REF!)","v":{"$error":"#REF!"}},{"$f":"IF(Schema!#REF!=\"\",\"\",Schema!#REF!)","v":{"$error":"#REF!"}}]
[{"$f":"Schema!#REF!&Schema!#REF!&Schema!#REF!&Schema!#REF!","v":{"$error":"#REF!"}},{"$error":"#REF!"},{"$f":"IF(A284=\"\",\"\",IF(LEN(Schema!#REF!)=2,1,IF(LEN(Schema!#REF!)=2,10,IF(LEN(Schema!#REF!)=2,100,0))))","v":{"$error":"#REF!"}},{"$error":"#REF!"},{"$f":"IF(A284=\"\",\"\",SUM(Tabel2[[#This Row],[I1]:[I2]]))","v":{"$error":"#REF!"}},{"$error":"#REF!"},{"$error":"#REF!"},{"$error":"#REF!"},{"$error":"#REF!"},{"$f":"IF(C284=\"\",\"\",IF(LEN(Tabel2[[#This Row],[Entiteit of attribuut]])=2,\"\",Tabel2[[#This Row],[Entiteit]]&\"_\"&Tabel2[[#This Row],[Entiteit of attribuut]]))","v":{"$error":"#REF!"}},{"$f":"IF(Schema!#REF!=\"\",\"\",Schema!#REF!)","v":{"$error":"#REF!"}},{"$f":"IF(Schema!#REF!=\"\",\"\",Schema!#REF!)","v":{"$error":"#REF!"}},{"$f":"IF(Schema!#REF!=\"\",\"\",Schema!#REF!)","v":{"$error":"#REF!"}},{"$f":"IF(Schema!#REF!=\"\",\"\",Schema!#REF!)","v":{"$error":"#REF!"}},{"$f":"IF(Schema!#REF!=\"\",\"\",Schema!#REF!)","v":{"$error":"#REF!"}}]
[{"$f":"Schema!#REF!&Schema!#REF!&Schema!#REF!&Schema!#REF!","v":{"$error":"#REF!"}},{"$error":"#REF!"},{"$f":"IF(A285=\"\",\"\",IF(LEN(Schema!#REF!)=2,1,IF(LEN(Schema!#REF!)=2,10,IF(LEN(Schema!#REF!)=2,100,0))))","v":{"$error":"#REF!"}},{"$error":"#REF!"},{"$f":"IF(A285=\"\",\"\",SUM(Tabel2[[#This Row],[I1]:[I2]]))","v":{"$error":"#REF!"}},{"$error":"#REF!"},{"$error":"#REF!"},{"$error":"#REF!"},{"$error":"#REF!"},{"$f":"IF(C285=\"\",\"\",IF(LEN(Tabel2[[#This Row],[Entiteit of attribuut]])=2,\"\",Tabel2[[#This Row],[Entiteit]]&\"_\"&Tabel2[[#This Row],[Entiteit of attribuut]]))","v":{"$error":"#REF!"}},{"$f":"IF(Schema!#REF!=\"\",\"\",Schema!#REF!)","v":{"$error":"#REF!"}},{"$f":"IF(Schema!#REF!=\"\",\"\",Schema!#REF!)","v":{"$error":"#REF!"}},{"$f":"IF(Schema!#REF!=\"\",\"\",Schema!#REF!)","v":{"$error":"#REF!"}},{"$f":"IF(Schema!#REF!=\"\",\"\",Schema!#REF!)","v":{"$error":"#REF!"}},{"$f":"IF(Schema!#REF!=\"\",\"\",Schema!#REF!)","v":{"$error":"#REF!"}}]
[{"$f":"Schema!#REF!&Schema!#REF!&Schema!#REF!&Schema!#REF!","v":{"$error":"#REF!"}},{"$error":"#REF!"},{"$f":"IF(A286=\"\",\"\",IF(LEN(Schema!#REF!)=2,1,IF(LEN(Schema!#REF!)=2,10,IF(LEN(Schema!#REF!)=2,100,0))))","v":{"$error":"#REF!"}},{"$error":"#REF!"},{"$f":"IF(A286=\"\",\"\",SUM(Tabel2[[#This Row],[I1]:[I2]]))","v":{"$error":"#REF!"}},{"$error":"#REF!"},{"$error":"#REF!"},{"$error":"#REF!"},{"$error":"#REF!"},{"$f":"IF(C286=\"\",\"\",IF(LEN(Tabel2[[#This Row],[Entiteit of attribuut]])=2,\"\",Tabel2[[#This Row],[Entiteit]]&\"_\"&Tabel2[[#This Row],[Entiteit of attribuut]]))","v":{"$error":"#REF!"}},{"$f":"IF(Schema!#REF!=\"\",\"\",Schema!#REF!)","v":{"$error":"#REF!"}},{"$f":"IF(Schema!#REF!=\"\",\"\",Schema!#REF!)","v":{"$error":"#REF!"}},{"$f":"IF(Schema!#REF!=\"\",\"\",Schema!#REF!)","v":{"$error":"#REF!"}},{"$f":"IF(Schema!#REF!=\"\",\"\",Schema!#REF!)","v":{"$error":"#REF!"}},{"$f":"IF(Schema!#REF!=\"\",\"\",Schema!#REF!)","v":{"$error":"#REF!"}}]
[{"$f":"Schema!#REF!&Schema!#REF!&Schema!#REF!&Schema!#REF!","v":{"$error":"#REF!"}},{"$error":"#REF!"},{"$f":"IF(A287=\"\",\"\",IF(LEN(Schema!#REF!)=2,1,IF(LEN(Schema!#REF!)=2,10,IF(LEN(Schema!#REF!)=2,100,0))))","v":{"$error":"#REF!"}},{"$error":"#REF!"},{"$f":"IF(A287=\"\",\"\",SUM(Tabel2[[#This Row],[I1]:[I2]]))","v":{"$error":"#REF!"}},{"$error":"#REF!"},{"$error":"#REF!"},{"$error":"#REF!"},{"$error":"#REF!"},{"$f":"IF(C287=\"\",\"\",IF(LEN(Tabel2[[#This Row],[Entiteit of attribuut]])=2,\"\",Tabel2[[#This Row],[Entiteit]]&\"_\"&Tabel2[[#This Row],[Entiteit of attribuut]]))","v":{"$error":"#REF!"}},{"$f":"IF(Schema!#REF!=\"\",\"\",Schema!#REF!)","v":{"$error":"#REF!"}},{"$f":"IF(Schema!#REF!=\"\",\"\",Schema!#REF!)","v":{"$error":"#REF!"}},{"$f":"IF(Schema!#REF!=\"\",\"\",Schema!#REF!)","v":{"$error":"#REF!"}},{"$f":"IF(Schema!#REF!=\"\",\"\",Schema!#REF!)","v":{"$error":"#REF!"}},{"$f":"IF(Schema!#REF!=\"\",\"\",Schema!#REF!)","v":{"$error":"#REF!"}}]
[{"$f":"Schema!#REF!&Schema!#REF!&Schema!#REF!&Schema!#REF!","v":{"$error":"#REF!"}},{"$error":"#REF!"},{"$f":"IF(A288=\"\",\"\",IF(LEN(Schema!#REF!)=2,1,IF(LEN(Schema!#REF!)=2,10,IF(LEN(Schema!#REF!)=2,100,0))))","v":{"$error":"#REF!"}},{"$error":"#REF!"},{"$f":"IF(A288=\"\",\"\",SUM(Tabel2[[#This Row],[I1]:[I2]]))","v":{"$error":"#REF!"}},{"$error":"#REF!"},{"$error":"#REF!"},{"$error":"#REF!"},{"$error":"#REF!"},{"$f":"IF(C288=\"\",\"\",IF(LEN(Tabel2[[#This Row],[Entiteit of attribuut]])=2,\"\",Tabel2[[#This Row],[Entiteit]]&\"_\"&Tabel2[[#This Row],[Entiteit of attribuut]]))","v":{"$error":"#REF!"}},{"$f":"IF(Schema!#REF!=\"\",\"\",Schema!#REF!)","v":{"$error":"#REF!"}},{"$f":"IF(Schema!#REF!=\"\",\"\",Schema!#REF!)","v":{"$error":"#REF!"}},{"$f":"IF(Schema!#REF!=\"\",\"\",Schema!#REF!)","v":{"$error":"#REF!"}},{"$f":"IF(Schema!#REF!=\"\",\"\",Schema!#REF!)","v":{"$error":"#REF!"}},{"$f":"IF(Schema!#REF!=\"\",\"\",Schema!#REF!)","v":{"$error":"#REF!"}}]
[{"$f":"Schema!#REF!&Schema!#REF!&Schema!#REF!&Schema!#REF!","v":{"$error":"#REF!"}},{"$error":"#REF!"},{"$f":"IF(A289=\"\",\"\",IF(LEN(Schema!#REF!)=2,1,IF(LEN(Schema!#REF!)=2,10,IF(LEN(Schema!#REF!)=2,100,0))))","v":{"$error":"#REF!"}},{"$error":"#REF!"},{"$f":"IF(A289=\"\",\"\",SUM(Tabel2[[#This Row],[I1]:[I2]]))","v":{"$error":"#REF!"}},{"$error":"#REF!"},{"$error":"#REF!"},{"$error":"#REF!"},{"$error":"#REF!"},{"$f":"IF(C289=\"\",\"\",IF(LEN(Tabel2[[#This Row],[Entiteit of attribuut]])=2,\"\",Tabel2[[#This Row],[Entiteit]]&\"_\"&Tabel2[[#This Row],[Entiteit of attribuut]]))","v":{"$error":"#REF!"}},{"$f":"IF(Schema!#REF!=\"\",\"\",Schema!#REF!)","v":{"$error":"#REF!"}},{"$f":"IF(Schema!#REF!=\"\",\"\",Schema!#REF!)","v":{"$error":"#REF!"}},{"$f":"IF(Schema!#REF!=\"\",\"\",Schema!#REF!)","v":{"$error":"#REF!"}},{"$f":"IF(Schema!#REF!=\"\",\"\",Schema!#REF!)","v":{"$error":"#REF!"}},{"$f":"IF(Schema!#REF!=\"\",\"\",Schema!#REF!)","v":{"$error":"#REF!"}}]
[{"$f":"Schema!#REF!&Schema!#REF!&Schema!#REF!&Schema!#REF!","v":{"$error":"#REF!"}},{"$error":"#REF!"},{"$f":"IF(A290=\"\",\"\",IF(LEN(Schema!#REF!)=2,1,IF(LEN(Schema!#REF!)=2,10,IF(LEN(Schema!#REF!)=2,100,0))))","v":{"$error":"#REF!"}},{"$error":"#REF!"},{"$f":"IF(A290=\"\",\"\",SUM(Tabel2[[#This Row],[I1]:[I2]]))","v":{"$error":"#REF!"}},{"$error":"#REF!"},{"$error":"#REF!"},{"$error":"#REF!"},{"$error":"#REF!"},{"$f":"IF(C290=\"\",\"\",IF(LEN(Tabel2[[#This Row],[Entiteit of attribuut]])=2,\"\",Tabel2[[#This Row],[Entiteit]]&\"_\"&Tabel2[[#This Row],[Entiteit of attribuut]]))","v":{"$error":"#REF!"}},{"$f":"IF(Schema!#REF!=\"\",\"\",Schema!#REF!)","v":{"$error":"#REF!"}},{"$f":"IF(Schema!#REF!=\"\",\"\",Schema!#REF!)","v":{"$error":"#REF!"}},{"$f":"IF(Schema!#REF!=\"\",\"\",Schema!#REF!)","v":{"$error":"#REF!"}},{"$f":"IF(Schema!#REF!=\"\",\"\",Schema!#REF!)","v":{"$error":"#REF!"}},{"$f":"IF(Schema!#REF!=\"\",\"\",Schema!#REF!)","v":{"$error":"#REF!"}}]
[{"$f":"Schema!#REF!&Schema!#REF!&Schema!#REF!&Schema!#REF!","v":{"$error":"#REF!"}},{"$error":"#REF!"},{"$f":"IF(A291=\"\",\"\",IF(LEN(Schema!#REF!)=2,1,IF(LEN(Schema!#REF!)=2,10,IF(LEN(Schema!#REF!)=2,100,0))))","v":{"$error":"#REF!"}},{"$error":"#REF!"},{"$f":"IF(A291=\"\",\"\",SUM(Tabel2[[#This Row],[I1]:[I2]]))","v":{"$error":"#REF!"}},{"$error":"#REF!"},{"$error":"#REF!"},{"$error":"#REF!"},{"$error":"#REF!"},{"$f":"IF(C291=\"\",\"\",IF(LEN(Tabel2[[#This Row],[Entiteit of attribuut]])=2,\"\",Tabel2[[#This Row],[Entiteit]]&\"_\"&Tabel2[[#This Row],[Entiteit of attribuut]]))","v":{"$error":"#REF!"}},{"$f":"IF(Schema!#REF!=\"\",\"\",Schema!#REF!)","v":{"$error":"#REF!"}},{"$f":"IF(Schema!#REF!=\"\",\"\",Schema!#REF!)","v":{"$error":"#REF!"}},{"$f":"IF(Schema!#REF!=\"\",\"\",Schema!#REF!)","v":{"$error":"#REF!"}},{"$f":"IF(Schema!#REF!=\"\",\"\",Schema!#REF!)","v":{"$error":"#REF!"}},{"$f":"IF(Schema!#REF!=\"\",\"\",Schema!#REF!)","v":{"$error":"#REF!"}}]
[{"$f":"Schema!#REF!&Schema!#REF!&Schema!#REF!&Schema!#REF!","v":{"$error":"#REF!"}},{"$error":"#REF!"},{"$f":"IF(A292=\"\",\"\",IF(LEN(Schema!#REF!)=2,1,IF(LEN(Schema!#REF!)=2,10,IF(LEN(Schema!#REF!)=2,100,0))))","v":{"$error":"#REF!"}},{"$error":"#REF!"},{"$f":"IF(A292=\"\",\"\",SUM(Tabel2[[#This Row],[I1]:[I2]]))","v":{"$error":"#REF!"}},{"$error":"#REF!"},{"$error":"#REF!"},{"$error":"#REF!"},{"$error":"#REF!"},{"$f":"IF(C292=\"\",\"\",IF(LEN(Tabel2[[#This Row],[Entiteit of attribuut]])=2,\"\",Tabel2[[#This Row],[Entiteit]]&\"_\"&Tabel2[[#This Row],[Entiteit of attribuut]]))","v":{"$error":"#REF!"}},{"$f":"IF(Schema!#REF!=\"\",\"\",Schema!#REF!)","v":{"$error":"#REF!"}},{"$f":"IF(Schema!#REF!=\"\",\"\",Schema!#REF!)","v":{"$error":"#REF!"}},{"$f":"IF(Schema!#REF!=\"\",\"\",Schema!#REF!)","v":{"$error":"#REF!"}},{"$f":"IF(Schema!#REF!=\"\",\"\",Schema!#REF!)","v":{"$error":"#REF!"}},{"$f":"IF(Schema!#REF!=\"\",\"\",Schema!#REF!)","v":{"$error":"#REF!"}}]
[{"$f":"Schema!#REF!&Schema!#REF!&Schema!#REF!&Schema!#REF!","v":{"$error":"#REF!"}},{"$error":"#REF!"},{"$f":"IF(A293=\"\",\"\",IF(LEN(Schema!#REF!)=2,1,IF(LEN(Schema!#REF!)=2,10,IF(LEN(Schema!#REF!)=2,100,0))))","v":{"$error":"#REF!"}},{"$error":"#REF!"},{"$f":"IF(A293=\"\",\"\",SUM(Tabel2[[#This Row],[I1]:[I2]]))","v":{"$error":"#REF!"}},{"$error":"#REF!"},{"$error":"#REF!"},{"$error":"#REF!"},{"$error":"#REF!"},{"$f":"IF(C293=\"\",\"\",IF(LEN(Tabel2[[#This Row],[Entiteit of attribuut]])=2,\"\",Tabel2[[#This Row],[Entiteit]]&\"_\"&Tabel2[[#This Row],[Entiteit of attribuut]]))","v":{"$error":"#REF!"}},{"$f":"IF(Schema!#REF!=\"\",\"\",Schema!#REF!)","v":{"$error":"#REF!"}},{"$f":"IF(Schema!#REF!=\"\",\"\",Schema!#REF!)","v":{"$error":"#REF!"}},{"$f":"IF(Schema!#REF!=\"\",\"\",Schema!#REF!)","v":{"$error":"#REF!"}},{"$f":"IF(Schema!#REF!=\"\",\"\",Schema!#REF!)","v":{"$error":"#REF!"}},{"$f":"IF(Schema!#REF!=\"\",\"\",Schema!#REF!)","v":{"$error":"#REF!"}}]
[{"$f":"Schema!#REF!&Schema!#REF!&Schema!#REF!&Schema!#REF!","v":{"$error":"#REF!"}},{"$error":"#REF!"},{"$f":"IF(A294=\"\",\"\",IF(LEN(Schema!#REF!)=2,1,IF(LEN(Schema!#REF!)=2,10,IF(LEN(Schema!#REF!)=2,100,0))))","v":{"$error":"#REF!"}},{"$error":"#REF!"},{"$f":"IF(A294=\"\",\"\",SUM(Tabel2[[#This Row],[I1]:[I2]]))","v":{"$error":"#REF!"}},{"$error":"#REF!"},{"$error":"#REF!"},{"$error":"#REF!"},{"$error":"#REF!"},{"$f":"IF(C294=\"\",\"\",IF(LEN(Tabel2[[#This Row],[Entiteit of attribuut]])=2,\"\",Tabel2[[#This Row],[Entiteit]]&\"_\"&Tabel2[[#This Row],[Entiteit of attribuut]]))","v":{"$error":"#REF!"}},{"$f":"IF(Schema!#REF!=\"\",\"\",Schema!#REF!)","v":{"$error":"#REF!"}},{"$f":"IF(Schema!#REF!=\"\",\"\",Schema!#REF!)","v":{"$error":"#REF!"}},{"$f":"IF(Schema!#REF!=\"\",\"\",Schema!#REF!)","v":{"$error":"#REF!"}},{"$f":"IF(Schema!#REF!=\"\",\"\",Schema!#REF!)","v":{"$error":"#REF!"}},{"$f":"IF(Schema!#REF!=\"\",\"\",Schema!#REF!)","v":{"$error":"#REF!"}}]
[{"$f":"Schema!#REF!&Schema!#REF!&Schema!#REF!&Schema!#REF!","v":{"$error":"#REF!"}},{"$error":"#REF!"},{"$f":"IF(A295=\"\",\"\",IF(LEN(Schema!#REF!)=2,1,IF(LEN(Schema!#REF!)=2,10,IF(LEN(Schema!#REF!)=2,100,0))))","v":{"$error":"#REF!"}},{"$error":"#REF!"},{"$f":"IF(A295=\"\",\"\",SUM(Tabel2[[#This Row],[I1]:[I2]]))","v":{"$error":"#REF!"}},{"$error":"#REF!"},{"$error":"#REF!"},{"$error":"#REF!"},{"$error":"#REF!"},{"$f":"IF(C295=\"\",\"\",IF(LEN(Tabel2[[#This Row],[Entiteit of attribuut]])=2,\"\",Tabel2[[#This Row],[Entiteit]]&\"_\"&Tabel2[[#This Row],[Entiteit of attribuut]]))","v":{"$error":"#REF!"}},{"$f":"IF(Schema!#REF!=\"\",\"\",Schema!#REF!)","v":{"$error":"#REF!"}},{"$f":"IF(Schema!#REF!=\"\",\"\",Schema!#REF!)","v":{"$error":"#REF!"}},{"$f":"IF(Schema!#REF!=\"\",\"\",Schema!#REF!)","v":{"$error":"#REF!"}},{"$f":"IF(Schema!#REF!=\"\",\"\",Schema!#REF!)","v":{"$error":"#REF!"}},{"$f":"IF(Schema!#REF!=\"\",\"\",Schema!#REF!)","v":{"$error":"#REF!"}}]
[{"$f":"Schema!#REF!&Schema!#REF!&Schema!#REF!&Schema!#REF!","v":{"$error":"#REF!"}},{"$error":"#REF!"},{"$f":"IF(A296=\"\",\"\",IF(LEN(Schema!#REF!)=2,1,IF(LEN(Schema!#REF!)=2,10,IF(LEN(Schema!#REF!)=2,100,0))))","v":{"$error":"#REF!"}},{"$error":"#REF!"},{"$f":"IF(A296=\"\",\"\",SUM(Tabel2[[#This Row],[I1]:[I2]]))","v":{"$error":"#REF!"}},{"$error":"#REF!"},{"$error":"#REF!"},{"$error":"#REF!"},{"$error":"#REF!"},{"$f":"IF(C296=\"\",\"\",IF(LEN(Tabel2[[#This Row],[Entiteit of attribuut]])=2,\"\",Tabel2[[#This Row],[Entiteit]]&\"_\"&Tabel2[[#This Row],[Entiteit of attribuut]]))","v":{"$error":"#REF!"}},{"$f":"IF(Schema!#REF!=\"\",\"\",Schema!#REF!)","v":{"$error":"#REF!"}},{"$f":"IF(Schema!#REF!=\"\",\"\",Schema!#REF!)","v":{"$error":"#REF!"}},{"$f":"IF(Schema!#REF!=\"\",\"\",Schema!#REF!)","v":{"$error":"#REF!"}},{"$f":"IF(Schema!#REF!=\"\",\"\",Schema!#REF!)","v":{"$error":"#REF!"}},{"$f":"IF(Schema!#REF!=\"\",\"\",Schema!#REF!)","v":{"$error":"#REF!"}}]
[{"$f":"Schema!#REF!&Schema!#REF!&Schema!#REF!&Schema!#REF!","v":{"$error":"#REF!"}},{"$error":"#REF!"},{"$f":"IF(A297=\"\",\"\",IF(LEN(Schema!#REF!)=2,1,IF(LEN(Schema!#REF!)=2,10,IF(LEN(Schema!#REF!)=2,100,0))))","v":{"$error":"#REF!"}},{"$error":"#REF!"},{"$f":"IF(A297=\"\",\"\",SUM(Tabel2[[#This Row],[I1]:[I2]]))","v":{"$error":"#REF!"}},{"$error":"#REF!"},{"$error":"#REF!"},{"$error":"#REF!"},{"$error":"#REF!"},{"$f":"IF(C297=\"\",\"\",IF(LEN(Tabel2[[#This Row],[Entiteit of attribuut]])=2,\"\",Tabel2[[#This Row],[Entiteit]]&\"_\"&Tabel2[[#This Row],[Entiteit of attribuut]]))","v":{"$error":"#REF!"}},{"$f":"IF(Schema!#REF!=\"\",\"\",Schema!#REF!)","v":{"$error":"#REF!"}},{"$f":"IF(Schema!#REF!=\"\",\"\",Schema!#REF!)","v":{"$error":"#REF!"}},{"$f":"IF(Schema!#REF!=\"\",\"\",Schema!#REF!)","v":{"$error":"#REF!"}},{"$f":"IF(Schema!#REF!=\"\",\"\",Schema!#REF!)","v":{"$error":"#REF!"}},{"$f":"IF(Schema!#REF!=\"\",\"\",Schema!#REF!)","v":{"$error":"#REF!"}}]
[{"$f":"Schema!#REF!&Schema!#REF!&Schema!#REF!&Schema!#REF!","v":{"$error":"#REF!"}},{"$error":"#REF!"},{"$f":"IF(A298=\"\",\"\",IF(LEN(Schema!#REF!)=2,1,IF(LEN(Schema!#REF!)=2,10,IF(LEN(Schema!#REF!)=2,100,0))))","v":{"$error":"#REF!"}},{"$error":"#REF!"},{"$f":"IF(A298=\"\",\"\",SUM(Tabel2[[#This Row],[I1]:[I2]]))","v":{"$error":"#REF!"}},{"$error":"#REF!"},{"$error":"#REF!"},{"$error":"#REF!"},{"$error":"#REF!"},{"$f":"IF(C298=\"\",\"\",IF(LEN(Tabel2[[#This Row],[Entiteit of attribuut]])=2,\"\",Tabel2[[#This Row],[Entiteit]]&\"_\"&Tabel2[[#This Row],[Entiteit of attribuut]]))","v":{"$error":"#REF!"}},{"$f":"IF(Schema!#REF!=\"\",\"\",Schema!#REF!)","v":{"$error":"#REF!"}},{"$f":"IF(Schema!#REF!=\"\",\"\",Schema!#REF!)","v":{"$error":"#REF!"}},{"$f":"IF(Schema!#REF!=\"\",\"\",Schema!#REF!)","v":{"$error":"#REF!"}},{"$f":"IF(Schema!#REF!=\"\",\"\",Schema!#REF!)","v":{"$error":"#REF!"}},{"$f":"IF(Schema!#REF!=\"\",\"\",Schema!#REF!)","v":{"$error":"#REF!"}}]
[{"$f":"Schema!#REF!&Schema!#REF!&Schema!#REF!&Schema!#REF!","v":{"$error":"#REF!"}},{"$error":"#REF!"},{"$f":"IF(A299=\"\",\"\",IF(LEN(Schema!#REF!)=2,1,IF(LEN(Schema!#REF!)=2,10,IF(LEN(Schema!#REF!)=2,100,0))))","v":{"$error":"#REF!"}},{"$error":"#REF!"},{"$f":"IF(A299=\"\",\"\",SUM(Tabel2[[#This Row],[I1]:[I2]]))","v":{"$error":"#REF!"}},{"$error":"#REF!"},{"$error":"#REF!"},{"$error":"#REF!"},{"$error":"#REF!"},{"$f":"IF(C299=\"\",\"\",IF(LEN(Tabel2[[#This Row],[Entiteit of attribuut]])=2,\"\",Tabel2[[#This Row],[Entiteit]]&\"_\"&Tabel2[[#This Row],[Entiteit of attribuut]]))","v":{"$error":"#REF!"}},{"$f":"IF(Schema!#REF!=\"\",\"\",Schema!#REF!)","v":{"$error":"#REF!"}},{"$f":"IF(Schema!#REF!=\"\",\"\",Schema!#REF!)","v":{"$error":"#REF!"}},{"$f":"IF(Schema!#REF!=\"\",\"\",Schema!#REF!)","v":{"$error":"#REF!"}},{"$f":"IF(Schema!#REF!=\"\",\"\",Schema!#REF!)","v":{"$error":"#REF!"}},{"$f":"IF(Schema!#REF!=\"\",\"\",Schema!#REF!)","v":{"$error":"#REF!"}}]
[{"$f":"Schema!#REF!&Schema!#REF!&Schema!#REF!&Schema!#REF!","v":{"$error":"#REF!"}},{"$error":"#REF!"},{"$f":"IF(A300=\"\",\"\",IF(LEN(Schema!#REF!)=2,1,IF(LEN(Schema!#REF!)=2,10,IF(LEN(Schema!#REF!)=2,100,0))))","v":{"$error":"#REF!"}},{"$error":"#REF!"},{"$f":"IF(A300=\"\",\"\",SUM(Tabel2[[#This Row],[I1]:[I2]]))","v":{"$error":"#REF!"}},{"$error":"#REF!"},{"$error":"#REF!"},{"$error":"#REF!"},{"$error":"#REF!"},{"$f":"IF(C300=\"\",\"\",IF(LEN(Tabel2[[#This Row],[Entiteit of attribuut]])=2,\"\",Tabel2[[#This Row],[Entiteit]]&\"_\"&Tabel2[[#This Row],[Entiteit of attribuut]]))","v":{"$error":"#REF!"}},{"$f":"IF(Schema!#REF!=\"\",\"\",Schema!#REF!)","v":{"$error":"#REF!"}},{"$f":"IF(Schema!#REF!=\"\",\"\",Schema!#REF!)","v":{"$error":"#REF!"}},{"$f":"IF(Schema!#REF!=\"\",\"\",Schema!#REF!)","v":{"$error":"#REF!"}},{"$f":"IF(Schema!#REF!=\"\",\"\",Schema!#REF!)","v":{"$error":"#REF!"}},{"$f":"IF(Schema!#REF!=\"\",\"\",Schema!#REF!)","v":{"$error":"#REF!"}}]
[{"$f":"Schema!#REF!&Schema!#REF!&Schema!#REF!&Schema!#REF!","v":{"$error":"#REF!"}},{"$error":"#REF!"},{"$f":"IF(A301=\"\",\"\",IF(LEN(Schema!#REF!)=2,1,IF(LEN(Schema!#REF!)=2,10,IF(LEN(Schema!#REF!)=2,100,0))))","v":{"$error":"#REF!"}},{"$error":"#REF!"},{"$f":"IF(A301=\"\",\"\",SUM(Tabel2[[#This Row],[I1]:[I2]]))","v":{"$error":"#REF!"}},{"$error":"#REF!"},{"$error":"#REF!"},{"$error":"#REF!"},{"$error":"#REF!"},{"$f":"IF(C301=\"\",\"\",IF(LEN(Tabel2[[#This Row],[Entiteit of attribuut]])=2,\"\",Tabel2[[#This Row],[Entiteit]]&\"_\"&Tabel2[[#This Row],[Entiteit of attribuut]]))","v":{"$error":"#REF!"}},{"$f":"IF(Schema!#REF!=\"\",\"\",Schema!#REF!)","v":{"$error":"#REF!"}},{"$f":"IF(Schema!#REF!=\"\",\"\",Schema!#REF!)","v":{"$error":"#REF!"}},{"$f":"IF(Schema!#REF!=\"\",\"\",Schema!#REF!)","v":{"$error":"#REF!"}},{"$f":"IF(Schema!#REF!=\"\",\"\",Schema!#REF!)","v":{"$error":"#REF!"}},{"$f":"IF(Schema!#REF!=\"\",\"\",Schema!#REF!)","v":{"$error":"#REF!"}}]
[{"$f":"Schema!#REF!&Schema!#REF!&Schema!#REF!&Schema!#REF!","v":{"$error":"#REF!"}},{"$error":"#REF!"},{"$f":"IF(A302=\"\",\"\",IF(LEN(Schema!#REF!)=2,1,IF(LEN(Schema!#REF!)=2,10,IF(LEN(Schema!#REF!)=2,100,0))))","v":{"$error":"#REF!"}},{"$error":"#REF!"},{"$f":"IF(A302=\"\",\"\",SUM(Tabel2[[#This Row],[I1]:[I2]]))","v":{"$error":"#REF!"}},{"$error":"#REF!"},{"$error":"#REF!"},{"$error":"#REF!"},{"$error":"#REF!"},{"$f":"IF(C302=\"\",\"\",IF(LEN(Tabel2[[#This Row],[Entiteit of attribuut]])=2,\"\",Tabel2[[#This Row],[Entiteit]]&\"_\"&Tabel2[[#This Row],[Entiteit of attribuut]]))","v":{"$error":"#REF!"}},{"$f":"IF(Schema!#REF!=\"\",\"\",Schema!#REF!)","v":{"$error":"#REF!"}},{"$f":"IF(Schema!#REF!=\"\",\"\",Schema!#REF!)","v":{"$error":"#REF!"}},{"$f":"IF(Schema!#REF!=\"\",\"\",Schema!#REF!)","v":{"$error":"#REF!"}},{"$f":"IF(Schema!#REF!=\"\",\"\",Schema!#REF!)","v":{"$error":"#REF!"}},{"$f":"IF(Schema!#REF!=\"\",\"\",Schema!#REF!)","v":{"$error":"#REF!"}}]
[{"$f":"Schema!#REF!&Schema!#REF!&Schema!#REF!&Schema!#REF!","v":{"$error":"#REF!"}},{"$error":"#REF!"},{"$f":"IF(A303=\"\",\"\",IF(LEN(Schema!#REF!)=2,1,IF(LEN(Schema!#REF!)=2,10,IF(LEN(Schema!#REF!)=2,100,0))))","v":{"$error":"#REF!"}},{"$error":"#REF!"},{"$f":"IF(A303=\"\",\"\",SUM(Tabel2[[#This Row],[I1]:[I2]]))","v":{"$error":"#REF!"}},{"$error":"#REF!"},{"$error":"#REF!"},{"$error":"#REF!"},{"$error":"#REF!"},{"$f":"IF(C303=\"\",\"\",IF(LEN(Tabel2[[#This Row],[Entiteit of attribuut]])=2,\"\",Tabel2[[#This Row],[Entiteit]]&\"_\"&Tabel2[[#This Row],[Entiteit of attribuut]]))","v":{"$error":"#REF!"}},{"$f":"IF(Schema!#REF!=\"\",\"\",Schema!#REF!)","v":{"$error":"#REF!"}},{"$f":"IF(Schema!#REF!=\"\",\"\",Schema!#REF!)","v":{"$error":"#REF!"}},{"$f":"IF(Schema!#REF!=\"\",\"\",Schema!#REF!)","v":{"$error":"#REF!"}},{"$f":"IF(Schema!#REF!=\"\",\"\",Schema!#REF!)","v":{"$error":"#REF!"}},{"$f":"IF(Schema!#REF!=\"\",\"\",Schema!#REF!)","v":{"$error":"#REF!"}}]
[{"$f":"Schema!#REF!&Schema!#REF!&Schema!#REF!&Schema!#REF!","v":{"$error":"#REF!"}},{"$error":"#REF!"},{"$f":"IF(A304=\"\",\"\",IF(LEN(Schema!#REF!)=2,1,IF(LEN(Schema!#REF!)=2,10,IF(LEN(Schema!#REF!)=2,100,0))))","v":{"$error":"#REF!"}},{"$error":"#REF!"},{"$f":"IF(A304=\"\",\"\",SUM(Tabel2[[#This Row],[I1]:[I2]]))","v":{"$error":"#REF!"}},{"$error":"#REF!"},{"$error":"#REF!"},{"$error":"#REF!"},{"$error":"#REF!"},{"$f":"IF(C304=\"\",\"\",IF(LEN(Tabel2[[#This Row],[Entiteit of attribuut]])=2,\"\",Tabel2[[#This Row],[Entiteit]]&\"_\"&Tabel2[[#This Row],[Entiteit of attribuut]]))","v":{"$error":"#REF!"}},{"$f":"IF(Schema!#REF!=\"\",\"\",Schema!#REF!)","v":{"$error":"#REF!"}},{"$f":"IF(Schema!#REF!=\"\",\"\",Schema!#REF!)","v":{"$error":"#REF!"}},{"$f":"IF(Schema!#REF!=\"\",\"\",Schema!#REF!)","v":{"$error":"#REF!"}},{"$f":"IF(Schema!#REF!=\"\",\"\",Schema!#REF!)","v":{"$error":"#REF!"}},{"$f":"IF(Schema!#REF!=\"\",\"\",Schema!#REF!)","v":{"$error":"#REF!"}}]
[{"$f":"Schema!#REF!&Schema!#REF!&Schema!#REF!&Schema!#REF!","v":{"$error":"#REF!"}},{"$error":"#REF!"},{"$f":"IF(A305=\"\",\"\",IF(LEN(Schema!#REF!)=2,1,IF(LEN(Schema!#REF!)=2,10,IF(LEN(Schema!#REF!)=2,100,0))))","v":{"$error":"#REF!"}},{"$error":"#REF!"},{"$f":"IF(A305=\"\",\"\",SUM(Tabel2[[#This Row],[I1]:[I2]]))","v":{"$error":"#REF!"}},{"$error":"#REF!"},{"$error":"#REF!"},{"$error":"#REF!"},{"$error":"#REF!"},{"$f":"IF(C305=\"\",\"\",IF(LEN(Tabel2[[#This Row],[Entiteit of attribuut]])=2,\"\",Tabel2[[#This Row],[Entiteit]]&\"_\"&Tabel2[[#This Row],[Entiteit of attribuut]]))","v":{"$error":"#REF!"}},{"$f":"IF(Schema!#REF!=\"\",\"\",Schema!#REF!)","v":{"$error":"#REF!"}},{"$f":"IF(Schema!#REF!=\"\",\"\",Schema!#REF!)","v":{"$error":"#REF!"}},{"$f":"IF(Schema!#REF!=\"\",\"\",Schema!#REF!)","v":{"$error":"#REF!"}},{"$f":"IF(Schema!#REF!=\"\",\"\",Schema!#REF!)","v":{"$error":"#REF!"}},{"$f":"IF(Schema!#REF!=\"\",\"\",Schema!#REF!)","v":{"$error":"#REF!"}}]
[{"$f":"Schema!#REF!&Schema!#REF!&Schema!#REF!&Schema!#REF!","v":{"$error":"#REF!"}},{"$error":"#REF!"},{"$f":"IF(A306=\"\",\"\",IF(LEN(Schema!#REF!)=2,1,IF(LEN(Schema!#REF!)=2,10,IF(LEN(Schema!#REF!)=2,100,0))))","v":{"$error":"#REF!"}},{"$error":"#REF!"},{"$f":"IF(A306=\"\",\"\",SUM(Tabel2[[#This Row],[I1]:[I2]]))","v":{"$error":"#REF!"}},{"$error":"#REF!"},{"$error":"#REF!"},{"$error":"#REF!"},{"$error":"#REF!"},{"$f":"IF(C306=\"\",\"\",IF(LEN(Tabel2[[#This Row],[Entiteit of attribuut]])=2,\"\",Tabel2[[#This Row],[Entiteit]]&\"_\"&Tabel2[[#This Row],[Entiteit of attribuut]]))","v":{"$error":"#REF!"}},{"$f":"IF(Schema!#REF!=\"\",\"\",Schema!#REF!)","v":{"$error":"#REF!"}},{"$f":"IF(Schema!#REF!=\"\",\"\",Schema!#REF!)","v":{"$error":"#REF!"}},{"$f":"IF(Schema!#REF!=\"\",\"\",Schema!#REF!)","v":{"$error":"#REF!"}},{"$f":"IF(Schema!#REF!=\"\",\"\",Schema!#REF!)","v":{"$error":"#REF!"}},{"$f":"IF(Schema!#REF!=\"\",\"\",Schema!#REF!)","v":{"$error":"#REF!"}}]
[{"$f":"Schema!#REF!&Schema!#REF!&Schema!#REF!&Schema!#REF!","v":{"$error":"#REF!"}},{"$error":"#REF!"},{"$f":"IF(A307=\"\",\"\",IF(LEN(Schema!#REF!)=2,1,IF(LEN(Schema!#REF!)=2,10,IF(LEN(Schema!#REF!)=2,100,0))))","v":{"$error":"#REF!"}},{"$error":"#REF!"},{"$f":"IF(A307=\"\",\"\",SUM(Tabel2[[#This Row],[I1]:[I2]]))","v":{"$error":"#REF!"}},{"$error":"#REF!"},{"$error":"#REF!"},{"$error":"#REF!"},{"$error":"#REF!"},{"$f":"IF(C307=\"\",\"\",IF(LEN(Tabel2[[#This Row],[Entiteit of attribuut]])=2,\"\",Tabel2[[#This Row],[Entiteit]]&\"_\"&Tabel2[[#This Row],[Entiteit of attribuut]]))","v":{"$error":"#REF!"}},{"$f":"IF(Schema!#REF!=\"\",\"\",Schema!#REF!)","v":{"$error":"#REF!"}},{"$f":"IF(Schema!#REF!=\"\",\"\",Schema!#REF!)","v":{"$error":"#REF!"}},{"$f":"IF(Schema!#REF!=\"\",\"\",Schema!#REF!)","v":{"$error":"#REF!"}},{"$f":"IF(Schema!#REF!=\"\",\"\",Schema!#REF!)","v":{"$error":"#REF!"}},{"$f":"IF(Schema!#REF!=\"\",\"\",Schema!#REF!)","v":{"$error":"#REF!"}}]
[{"$f":"Schema!#REF!&Schema!#REF!&Schema!#REF!&Schema!#REF!","v":{"$error":"#REF!"}},{"$error":"#REF!"},{"$f":"IF(A308=\"\",\"\",IF(LEN(Schema!#REF!)=2,1,IF(LEN(Schema!#REF!)=2,10,IF(LEN(Schema!#REF!)=2,100,0))))","v":{"$error":"#REF!"}},{"$error":"#REF!"},{"$f":"IF(A308=\"\",\"\",SUM(Tabel2[[#This Row],[I1]:[I2]]))","v":{"$error":"#REF!"}},{"$error":"#REF!"},{"$error":"#REF!"},{"$error":"#REF!"},{"$error":"#REF!"},{"$f":"IF(C308=\"\",\"\",IF(LEN(Tabel2[[#This Row],[Entiteit of attribuut]])=2,\"\",Tabel2[[#This Row],[Entiteit]]&\"_\"&Tabel2[[#This Row],[Entiteit of attribuut]]))","v":{"$error":"#REF!"}},{"$f":"IF(Schema!#REF!=\"\",\"\",Schema!#REF!)","v":{"$error":"#REF!"}},{"$f":"IF(Schema!#REF!=\"\",\"\",Schema!#REF!)","v":{"$error":"#REF!"}},{"$f":"IF(Schema!#REF!=\"\",\"\",Schema!#REF!)","v":{"$error":"#REF!"}},{"$f":"IF(Schema!#REF!=\"\",\"\",Schema!#REF!)","v":{"$error":"#REF!"}},{"$f":"IF(Schema!#REF!=\"\",\"\",Schema!#REF!)","v":{"$error":"#REF!"}}]
[{"$f":"Schema!#REF!&Schema!#REF!&Schema!#REF!&Schema!#REF!","v":{"$error":"#REF!"}},{"$error":"#REF!"},{"$f":"IF(A309=\"\",\"\",IF(LEN(Schema!#REF!)=2,1,IF(LEN(Schema!#REF!)=2,10,IF(LEN(Schema!#REF!)=2,100,0))))","v":{"$error":"#REF!"}},{"$error":"#REF!"},{"$f":"IF(A309=\"\",\"\",SUM(Tabel2[[#This Row],[I1]:[I2]]))","v":{"$error":"#REF!"}},{"$error":"#REF!"},{"$error":"#REF!"},{"$error":"#REF!"},{"$error":"#REF!"},{"$f":"IF(C309=\"\",\"\",IF(LEN(Tabel2[[#This Row],[Entiteit of attribuut]])=2,\"\",Tabel2[[#This Row],[Entiteit]]&\"_\"&Tabel2[[#This Row],[Entiteit of attribuut]]))","v":{"$error":"#REF!"}},{"$f":"IF(Schema!#REF!=\"\",\"\",Schema!#REF!)","v":{"$error":"#REF!"}},{"$f":"IF(Schema!#REF!=\"\",\"\",Schema!#REF!)","v":{"$error":"#REF!"}},{"$f":"IF(Schema!#REF!=\"\",\"\",Schema!#REF!)","v":{"$error":"#REF!"}},{"$f":"IF(Schema!#REF!=\"\",\"\",Schema!#REF!)","v":{"$error":"#REF!"}},{"$f":"IF(Schema!#REF!=\"\",\"\",Schema!#REF!)","v":{"$error":"#REF!"}}]
[{"$f":"Schema!#REF!&Schema!#REF!&Schema!#REF!&Schema!#REF!","v":{"$error":"#REF!"}},{"$error":"#REF!"},{"$f":"IF(A310=\"\",\"\",IF(LEN(Schema!#REF!)=2,1,IF(LEN(Schema!#REF!)=2,10,IF(LEN(Schema!#REF!)=2,100,0))))","v":{"$error":"#REF!"}},{"$error":"#REF!"},{"$f":"IF(A310=\"\",\"\",SUM(Tabel2[[#This Row],[I1]:[I2]]))","v":{"$error":"#REF!"}},{"$error":"#REF!"},{"$error":"#REF!"},{"$error":"#REF!"},{"$error":"#REF!"},{"$f":"IF(C310=\"\",\"\",IF(LEN(Tabel2[[#This Row],[Entiteit of attribuut]])=2,\"\",Tabel2[[#This Row],[Entiteit]]&\"_\"&Tabel2[[#This Row],[Entiteit of attribuut]]))","v":{"$error":"#REF!"}},{"$f":"IF(Schema!#REF!=\"\",\"\",Schema!#REF!)","v":{"$error":"#REF!"}},{"$f":"IF(Schema!#REF!=\"\",\"\",Schema!#REF!)","v":{"$error":"#REF!"}},{"$f":"IF(Schema!#REF!=\"\",\"\",Schema!#REF!)","v":{"$error":"#REF!"}},{"$f":"IF(Schema!#REF!=\"\",\"\",Schema!#REF!)","v":{"$error":"#REF!"}},{"$f":"IF(Schema!#REF!=\"\",\"\",Schema!#REF!)","v":{"$error":"#REF!"}}]
[{"$f":"Schema!#REF!&Schema!#REF!&Schema!#REF!&Schema!#REF!","v":{"$error":"#REF!"}},{"$error":"#REF!"},{"$f":"IF(A311=\"\",\"\",IF(LEN(Schema!#REF!)=2,1,IF(LEN(Schema!#REF!)=2,10,IF(LEN(Schema!#REF!)=2,100,0))))","v":{"$error":"#REF!"}},{"$error":"#REF!"},{"$f":"IF(A311=\"\",\"\",SUM(Tabel2[[#This Row],[I1]:[I2]]))","v":{"$error":"#REF!"}},{"$error":"#REF!"},{"$error":"#REF!"},{"$error":"#REF!"},{"$error":"#REF!"},{"$f":"IF(C311=\"\",\"\",IF(LEN(Tabel2[[#This Row],[Entiteit of attribuut]])=2,\"\",Tabel2[[#This Row],[Entiteit]]&\"_\"&Tabel2[[#This Row],[Entiteit of attribuut]]))","v":{"$error":"#REF!"}},{"$f":"IF(Schema!#REF!=\"\",\"\",Schema!#REF!)","v":{"$error":"#REF!"}},{"$f":"IF(Schema!#REF!=\"\",\"\",Schema!#REF!)","v":{"$error":"#REF!"}},{"$f":"IF(Schema!#REF!=\"\",\"\",Schema!#REF!)","v":{"$error":"#REF!"}},{"$f":"IF(Schema!#REF!=\"\",\"\",Schema!#REF!)","v":{"$error":"#REF!"}},{"$f":"IF(Schema!#REF!=\"\",\"\",Schema!#REF!)","v":{"$error":"#REF!"}}]
[{"$f":"Schema!#REF!&Schema!#REF!&Schema!#REF!&Schema!#REF!","v":{"$error":"#REF!"}},{"$error":"#REF!"},{"$f":"IF(A312=\"\",\"\",IF(LEN(Schema!#REF!)=2,1,IF(LEN(Schema!#REF!)=2,10,IF(LEN(Schema!#REF!)=2,100,0))))","v":{"$error":"#REF!"}},{"$error":"#REF!"},{"$f":"IF(A312=\"\",\"\",SUM(Tabel2[[#This Row],[I1]:[I2]]))","v":{"$error":"#REF!"}},{"$error":"#REF!"},{"$error":"#REF!"},{"$error":"#REF!"},{"$error":"#REF!"},{"$f":"IF(C312=\"\",\"\",IF(LEN(Tabel2[[#This Row],[Entiteit of attribuut]])=2,\"\",Tabel2[[#This Row],[Entiteit]]&\"_\"&Tabel2[[#This Row],[Entiteit of attribuut]]))","v":{"$error":"#REF!"}},{"$f":"IF(Schema!#REF!=\"\",\"\",Schema!#REF!)","v":{"$error":"#REF!"}},{"$f":"IF(Schema!#REF!=\"\",\"\",Schema!#REF!)","v":{"$error":"#REF!"}},{"$f":"IF(Schema!#REF!=\"\",\"\",Schema!#REF!)","v":{"$error":"#REF!"}},{"$f":"IF(Schema!#REF!=\"\",\"\",Schema!#REF!)","v":{"$error":"#REF!"}},{"$f":"IF(Schema!#REF!=\"\",\"\",Schema!#REF!)","v":{"$error":"#REF!"}}]
[{"$f":"Schema!#REF!&Schema!#REF!&Schema!#REF!&Schema!#REF!","v":{"$error":"#REF!"}},{"$error":"#REF!"},{"$f":"IF(A313=\"\",\"\",IF(LEN(Schema!#REF!)=2,1,IF(LEN(Schema!#REF!)=2,10,IF(LEN(Schema!#REF!)=2,100,0))))","v":{"$error":"#REF!"}},{"$error":"#REF!"},{"$f":"IF(A313=\"\",\"\",SUM(Tabel2[[#This Row],[I1]:[I2]]))","v":{"$error":"#REF!"}},{"$error":"#REF!"},{"$error":"#REF!"},{"$error":"#REF!"},{"$error":"#REF!"},{"$f":"IF(C313=\"\",\"\",IF(LEN(Tabel2[[#This Row],[Entiteit of attribuut]])=2,\"\",Tabel2[[#This Row],[Entiteit]]&\"_\"&Tabel2[[#This Row],[Entiteit of attribuut]]))","v":{"$error":"#REF!"}},{"$f":"IF(Schema!#REF!=\"\",\"\",Schema!#REF!)","v":{"$error":"#REF!"}},{"$f":"IF(Schema!#REF!=\"\",\"\",Schema!#REF!)","v":{"$error":"#REF!"}},{"$f":"IF(Schema!#REF!=\"\",\"\",Schema!#REF!)","v":{"$error":"#REF!"}},{"$f":"IF(Schema!#REF!=\"\",\"\",Schema!#REF!)","v":{"$error":"#REF!"}},{"$f":"IF(Schema!#REF!=\"\",\"\",Schema!#REF!)","v":{"$error":"#REF!"}}]
[{"$f":"Schema!#REF!&Schema!#REF!&Schema!#REF!&Schema!#REF!","v":{"$error":"#REF!"}},{"$error":"#REF!"},{"$f":"IF(A314=\"\",\"\",IF(LEN(Schema!#REF!)=2,1,IF(LEN(Schema!#REF!)=2,10,IF(LEN(Schema!#REF!)=2,100,0))))","v":{"$error":"#REF!"}},{"$error":"#REF!"},{"$f":"IF(A314=\"\",\"\",SUM(Tabel2[[#This Row],[I1]:[I2]]))","v":{"$error":"#REF!"}},{"$error":"#REF!"},{"$error":"#REF!"},{"$error":"#REF!"},{"$error":"#REF!"},{"$f":"IF(C314=\"\",\"\",IF(LEN(Tabel2[[#This Row],[Entiteit of attribuut]])=2,\"\",Tabel2[[#This Row],[Entiteit]]&\"_\"&Tabel2[[#This Row],[Entiteit of attribuut]]))","v":{"$error":"#REF!"}},{"$f":"IF(Schema!#REF!=\"\",\"\",Schema!#REF!)","v":{"$error":"#REF!"}},{"$f":"IF(Schema!#REF!=\"\",\"\",Schema!#REF!)","v":{"$error":"#REF!"}},{"$f":"IF(Schema!#REF!=\"\",\"\",Schema!#REF!)","v":{"$error":"#REF!"}},{"$f":"IF(Schema!#REF!=\"\",\"\",Schema!#REF!)","v":{"$error":"#REF!"}},{"$f":"IF(Schema!#REF!=\"\",\"\",Schema!#REF!)","v":{"$error":"#REF!"}}]
[{"$f":"Schema!#REF!&Schema!#REF!&Schema!#REF!&Schema!#REF!","v":{"$error":"#REF!"}},{"$error":"#REF!"},{"$f":"IF(A315=\"\",\"\",IF(LEN(Schema!#REF!)=2,1,IF(LEN(Schema!#REF!)=2,10,IF(LEN(Schema!#REF!)=2,100,0))))","v":{"$error":"#REF!"}},{"$error":"#REF!"},{"$f":"IF(A315=\"\",\"\",SUM(Tabel2[[#This Row],[I1]:[I2]]))","v":{"$error":"#REF!"}},{"$error":"#REF!"},{"$error":"#REF!"},{"$error":"#REF!"},{"$error":"#REF!"},{"$f":"IF(C315=\"\",\"\",IF(LEN(Tabel2[[#This Row],[Entiteit of attribuut]])=2,\"\",Tabel2[[#This Row],[Entiteit]]&\"_\"&Tabel2[[#This Row],[Entiteit of attribuut]]))","v":{"$error":"#REF!"}},{"$f":"IF(Schema!#REF!=\"\",\"\",Schema!#REF!)","v":{"$error":"#REF!"}},{"$f":"IF(Schema!#REF!=\"\",\"\",Schema!#REF!)","v":{"$error":"#REF!"}},{"$f":"IF(Schema!#REF!=\"\",\"\",Schema!#REF!)","v":{"$error":"#REF!"}},{"$f":"IF(Schema!#REF!=\"\",\"\",Schema!#REF!)","v":{"$error":"#REF!"}},{"$f":"IF(Schema!#REF!=\"\",\"\",Schema!#REF!)","v":{"$error":"#REF!"}}]
[{"$f":"Schema!#REF!&Schema!#REF!&Schema!#REF!&Schema!#REF!","v":{"$error":"#REF!"}},{"$error":"#REF!"},{"$f":"IF(A316=\"\",\"\",IF(LEN(Schema!#REF!)=2,1,IF(LEN(Schema!#REF!)=2,10,IF(LEN(Schema!#REF!)=2,100,0))))","v":{"$error":"#REF!"}},{"$error":"#REF!"},{"$f":"IF(A316=\"\",\"\",SUM(Tabel2[[#This Row],[I1]:[I2]]))","v":{"$error":"#REF!"}},{"$error":"#REF!"},{"$error":"#REF!"},{"$error":"#REF!"},{"$error":"#REF!"},{"$f":"IF(C316=\"\",\"\",IF(LEN(Tabel2[[#This Row],[Entiteit of attribuut]])=2,\"\",Tabel2[[#This Row],[Entiteit]]&\"_\"&Tabel2[[#This Row],[Entiteit of attribuut]]))","v":{"$error":"#REF!"}},{"$f":"IF(Schema!#REF!=\"\",\"\",Schema!#REF!)","v":{"$error":"#REF!"}},{"$f":"IF(Schema!#REF!=\"\",\"\",Schema!#REF!)","v":{"$error":"#REF!"}},{"$f":"IF(Schema!#REF!=\"\",\"\",Schema!#REF!)","v":{"$error":"#REF!"}},{"$f":"IF(Schema!#REF!=\"\",\"\",Schema!#REF!)","v":{"$error":"#REF!"}},{"$f":"IF(Schema!#REF!=\"\",\"\",Schema!#REF!)","v":{"$error":"#REF!"}}]
[{"$f":"Schema!#REF!&Schema!#REF!&Schema!#REF!&Schema!#REF!","v":{"$error":"#REF!"}},{"$error":"#REF!"},{"$f":"IF(A317=\"\",\"\",IF(LEN(Schema!#REF!)=2,1,IF(LEN(Schema!#REF!)=2,10,IF(LEN(Schema!#REF!)=2,100,0))))","v":{"$error":"#REF!"}},{"$error":"#REF!"},{"$f":"IF(A317=\"\",\"\",SUM(Tabel2[[#This Row],[I1]:[I2]]))","v":{"$error":"#REF!"}},{"$error":"#REF!"},{"$error":"#REF!"},{"$error":"#REF!"},{"$error":"#REF!"},{"$f":"IF(C317=\"\",\"\",IF(LEN(Tabel2[[#This Row],[Entiteit of attribuut]])=2,\"\",Tabel2[[#This Row],[Entiteit]]&\"_\"&Tabel2[[#This Row],[Entiteit of attribuut]]))","v":{"$error":"#REF!"}},{"$f":"IF(Schema!#REF!=\"\",\"\",Schema!#REF!)","v":{"$error":"#REF!"}},{"$f":"IF(Schema!#REF!=\"\",\"\",Schema!#REF!)","v":{"$error":"#REF!"}},{"$f":"IF(Schema!#REF!=\"\",\"\",Schema!#REF!)","v":{"$error":"#REF!"}},{"$f":"IF(Schema!#REF!=\"\",\"\",Schema!#REF!)","v":{"$error":"#REF!"}},{"$f":"IF(Schema!#REF!=\"\",\"\",Schema!#REF!)","v":{"$error":"#REF!"}}]
[{"$f":"Schema!#REF!&Schema!#REF!&Schema!#REF!&Schema!#REF!","v":{"$error":"#REF!"}},{"$error":"#REF!"},{"$f":"IF(A318=\"\",\"\",IF(LEN(Schema!#REF!)=2,1,IF(LEN(Schema!#REF!)=2,10,IF(LEN(Schema!#REF!)=2,100,0))))","v":{"$error":"#REF!"}},{"$error":"#REF!"},{"$f":"IF(A318=\"\",\"\",SUM(Tabel2[[#This Row],[I1]:[I2]]))","v":{"$error":"#REF!"}},{"$error":"#REF!"},{"$error":"#REF!"},{"$error":"#REF!"},{"$error":"#REF!"},{"$f":"IF(C318=\"\",\"\",IF(LEN(Tabel2[[#This Row],[Entiteit of attribuut]])=2,\"\",Tabel2[[#This Row],[Entiteit]]&\"_\"&Tabel2[[#This Row],[Entiteit of attribuut]]))","v":{"$error":"#REF!"}},{"$f":"IF(Schema!#REF!=\"\",\"\",Schema!#REF!)","v":{"$error":"#REF!"}},{"$f":"IF(Schema!#REF!=\"\",\"\",Schema!#REF!)","v":{"$error":"#REF!"}},{"$f":"IF(Schema!#REF!=\"\",\"\",Schema!#REF!)","v":{"$error":"#REF!"}},{"$f":"IF(Schema!#REF!=\"\",\"\",Schema!#REF!)","v":{"$error":"#REF!"}},{"$f":"IF(Schema!#REF!=\"\",\"\",Schema!#REF!)","v":{"$error":"#REF!"}}]
[{"$f":"Schema!#REF!&Schema!#REF!&Schema!#REF!&Schema!#REF!","v":{"$error":"#REF!"}},{"$error":"#REF!"},{"$f":"IF(A319=\"\",\"\",IF(LEN(Schema!#REF!)=2,1,IF(LEN(Schema!#REF!)=2,10,IF(LEN(Schema!#REF!)=2,100,0))))","v":{"$error":"#REF!"}},{"$error":"#REF!"},{"$f":"IF(A319=\"\",\"\",SUM(Tabel2[[#This Row],[I1]:[I2]]))","v":{"$error":"#REF!"}},{"$error":"#REF!"},{"$error":"#REF!"},{"$error":"#REF!"},{"$error":"#REF!"},{"$f":"IF(C319=\"\",\"\",IF(LEN(Tabel2[[#This Row],[Entiteit of attribuut]])=2,\"\",Tabel2[[#This Row],[Entiteit]]&\"_\"&Tabel2[[#This Row],[Entiteit of attribuut]]))","v":{"$error":"#REF!"}},{"$f":"IF(Schema!#REF!=\"\",\"\",Schema!#REF!)","v":{"$error":"#REF!"}},{"$f":"IF(Schema!#REF!=\"\",\"\",Schema!#REF!)","v":{"$error":"#REF!"}},{"$f":"IF(Schema!#REF!=\"\",\"\",Schema!#REF!)","v":{"$error":"#REF!"}},{"$f":"IF(Schema!#REF!=\"\",\"\",Schema!#REF!)","v":{"$error":"#REF!"}},{"$f":"IF(Schema!#REF!=\"\",\"\",Schema!#REF!)","v":{"$error":"#REF!"}}]
[{"$f":"Schema!#REF!&Schema!#REF!&Schema!#REF!&Schema!#REF!","v":{"$error":"#REF!"}},{"$error":"#REF!"},{"$f":"IF(A320=\"\",\"\",IF(LEN(Schema!#REF!)=2,1,IF(LEN(Schema!#REF!)=2,10,IF(LEN(Schema!#REF!)=2,100,0))))","v":{"$error":"#REF!"}},{"$error":"#REF!"},{"$f":"IF(A320=\"\",\"\",SUM(Tabel2[[#This Row],[I1]:[I2]]))","v":{"$error":"#REF!"}},{"$error":"#REF!"},{"$error":"#REF!"},{"$error":"#REF!"},{"$error":"#REF!"},{"$f":"IF(C320=\"\",\"\",IF(LEN(Tabel2[[#This Row],[Entiteit of attribuut]])=2,\"\",Tabel2[[#This Row],[Entiteit]]&\"_\"&Tabel2[[#This Row],[Entiteit of attribuut]]))","v":{"$error":"#REF!"}},{"$f":"IF(Schema!#REF!=\"\",\"\",Schema!#REF!)","v":{"$error":"#REF!"}},{"$f":"IF(Schema!#REF!=\"\",\"\",Schema!#REF!)","v":{"$error":"#REF!"}},{"$f":"IF(Schema!#REF!=\"\",\"\",Schema!#REF!)","v":{"$error":"#REF!"}},{"$f":"IF(Schema!#REF!=\"\",\"\",Schema!#REF!)","v":{"$error":"#REF!"}},{"$f":"IF(Schema!#REF!=\"\",\"\",Schema!#REF!)","v":{"$error":"#REF!"}}]
[{"$f":"Schema!#REF!&Schema!#REF!&Schema!#REF!&Schema!#REF!","v":{"$error":"#REF!"}},{"$error":"#REF!"},{"$f":"IF(A321=\"\",\"\",IF(LEN(Schema!#REF!)=2,1,IF(LEN(Schema!#REF!)=2,10,IF(LEN(Schema!#REF!)=2,100,0))))","v":{"$error":"#REF!"}},{"$error":"#REF!"},{"$f":"IF(A321=\"\",\"\",SUM(Tabel2[[#This Row],[I1]:[I2]]))","v":{"$error":"#REF!"}},{"$error":"#REF!"},{"$error":"#REF!"},{"$error":"#REF!"},{"$error":"#REF!"},{"$f":"IF(C321=\"\",\"\",IF(LEN(Tabel2[[#This Row],[Entiteit of attribuut]])=2,\"\",Tabel2[[#This Row],[Entiteit]]&\"_\"&Tabel2[[#This Row],[Entiteit of attribuut]]))","v":{"$error":"#REF!"}},{"$f":"IF(Schema!#REF!=\"\",\"\",Schema!#REF!)","v":{"$error":"#REF!"}},{"$f":"IF(Schema!#REF!=\"\",\"\",Schema!#REF!)","v":{"$error":"#REF!"}},{"$f":"IF(Schema!#REF!=\"\",\"\",Schema!#REF!)","v":{"$error":"#REF!"}},{"$f":"IF(Schema!#REF!=\"\",\"\",Schema!#REF!)","v":{"$error":"#REF!"}},{"$f":"IF(Schema!#REF!=\"\",\"\",Schema!#REF!)","v":{"$error":"#REF!"}}]
[{"$f":"Schema!#REF!&Schema!#REF!&Schema!#REF!&Schema!#REF!","v":{"$error":"#REF!"}},{"$error":"#REF!"},{"$f":"IF(A322=\"\",\"\",IF(LEN(Schema!#REF!)=2,1,IF(LEN(Schema!#REF!)=2,10,IF(LEN(Schema!#REF!)=2,100,0))))","v":{"$error":"#REF!"}},{"$error":"#REF!"},{"$f":"IF(A322=\"\",\"\",SUM(Tabel2[[#This Row],[I1]:[I2]]))","v":{"$error":"#REF!"}},{"$error":"#REF!"},{"$error":"#REF!"},{"$error":"#REF!"},{"$error":"#REF!"},{"$f":"IF(C322=\"\",\"\",IF(LEN(Tabel2[[#This Row],[Entiteit of attribuut]])=2,\"\",Tabel2[[#This Row],[Entiteit]]&\"_\"&Tabel2[[#This Row],[Entiteit of attribuut]]))","v":{"$error":"#REF!"}},{"$f":"IF(Schema!#REF!=\"\",\"\",Schema!#REF!)","v":{"$error":"#REF!"}},{"$f":"IF(Schema!#REF!=\"\",\"\",Schema!#REF!)","v":{"$error":"#REF!"}},{"$f":"IF(Schema!#REF!=\"\",\"\",Schema!#REF!)","v":{"$error":"#REF!"}},{"$f":"IF(Schema!#REF!=\"\",\"\",Schema!#REF!)","v":{"$error":"#REF!"}},{"$f":"IF(Schema!#REF!=\"\",\"\",Schema!#REF!)","v":{"$error":"#REF!"}}]
[{"$f":"Schema!#REF!&Schema!#REF!&Schema!#REF!&Schema!#REF!","v":{"$error":"#REF!"}},{"$f":"IF(LEN(A323)=2,A323,IF(A323=\"\",\"Leeg\",B322))","v":{"$error":"#REF!"}},{"$f":"IF(A323=\"\",\"\",IF(LEN(Schema!#REF!)=2,1,IF(LEN(Schema!#REF!)=2,10,IF(LEN(Schema!#REF!)=2,100,0))))","v":{"$error":"#REF!"}},{"$f":"IF(C323=0,D322,C323)","v":{"$error":"#REF!"}},{"$f":"IF(A323=\"\",\"\",SUM(Tabel2[[#This Row],[I1]:[I2]]))","v":{"$error":"#REF!"}},{"$f":"IF(A323=\"\",\"\",IF(C323=1,B323,F322))","v":{"$error":"#REF!"}},{"$f":"IF(C323=10,A323,IF(OR(C323=0,C323=100),G322,\"\"))","v":{"$error":"#REF!"}},{"$f":"IF(E323=200,B323,IF(C323=0,H322,\"\"))","v":{"$error":"#REF!"}},{"$f":"IF(C323=\"\",\"\",IF(OR(E323=1,E323=10,E323=100),I322,IF(E323=2,F323,IF(E323=20,F323&\"/\"&G323,IF(E323=200,F323&\"/\"&G323&\"/\"&H323)))))","v":{"$error":"#REF!"}},{"$f":"IF(C323=\"\",\"\",IF(LEN(Tabel2[[#This Row],[Entiteit of attribuut]])=2,\"\",Tabel2[[#This Row],[Entiteit]]&\"_\"&Tabel2[[#This Row],[Entiteit of attribuut]]))","v":{"$error":"#REF!"}},{"$f":"IF(Schema!#REF!=\"\",\"\",Schema!#REF!)","v":{"$error":"#REF!"}},{"$f":"IF(Schema!#REF!=\"\",\"\",Schema!#REF!)","v":{"$error":"#REF!"}},{"$f":"IF(Schema!#REF!=\"\",\"\",Schema!#REF!)","v":{"$error":"#REF!"}},{"$f":"IF(Schema!#REF!=\"\",\"\",Schema!#REF!)","v":{"$error":"#REF!"}},{"$f":"IF(Schema!#REF!=\"\",\"\",Schema!#REF!)","v":{"$error":"#REF!"}}]
[{"$f":"Schema!#REF!&Schema!#REF!&Schema!#REF!&Schema!#REF!","v":{"$error":"#REF!"}},{"$error":"#REF!"},{"$f":"IF(A324=\"\",\"\",IF(LEN(Schema!#REF!)=2,1,IF(LEN(Schema!#REF!)=2,10,IF(LEN(Schema!#REF!)=2,100,0))))","v":{"$error":"#REF!"}},{"$error":"#REF!"},{"$f":"IF(A324=\"\",\"\",SUM(Tabel2[[#This Row],[I1]:[I2]]))","v":{"$error":"#REF!"}},{"$error":"#REF!"},{"$error":"#REF!"},{"$error":"#REF!"},{"$error":"#REF!"},{"$f":"IF(C324=\"\",\"\",IF(LEN(Tabel2[[#This Row],[Entiteit of attribuut]])=2,\"\",Tabel2[[#This Row],[Entiteit]]&\"_\"&Tabel2[[#This Row],[Entiteit of attribuut]]))","v":{"$error":"#REF!"}},{"$f":"IF(Schema!#REF!=\"\",\"\",Schema!#REF!)","v":{"$error":"#REF!"}},{"$f":"IF(Schema!#REF!=\"\",\"\",Schema!#REF!)","v":{"$error":"#REF!"}},{"$f":"IF(Schema!#REF!=\"\",\"\",Schema!#REF!)","v":{"$error":"#REF!"}},{"$f":"IF(Schema!#REF!=\"\",\"\",Schema!#REF!)","v":{"$error":"#REF!"}},{"$f":"IF(Schema!#REF!=\"\",\"\",Schema!#REF!)","v":{"$error":"#REF!"}}]
[{"$f":"Schema!#REF!&Schema!#REF!&Schema!#REF!&Schema!#REF!","v":{"$error":"#REF!"}},{"$error":"#REF!"},{"$f":"IF(A325=\"\",\"\",IF(LEN(Schema!#REF!)=2,1,IF(LEN(Schema!#REF!)=2,10,IF(LEN(Schema!#REF!)=2,100,0))))","v":{"$error":"#REF!"}},{"$error":"#REF!"},{"$f":"IF(A325=\"\",\"\",SUM(Tabel2[[#This Row],[I1]:[I2]]))","v":{"$error":"#REF!"}},{"$error":"#REF!"},{"$error":"#REF!"},{"$error":"#REF!"},{"$error":"#REF!"},{"$f":"IF(C325=\"\",\"\",IF(LEN(Tabel2[[#This Row],[Entiteit of attribuut]])=2,\"\",Tabel2[[#This Row],[Entiteit]]&\"_\"&Tabel2[[#This Row],[Entiteit of attribuut]]))","v":{"$error":"#REF!"}},{"$f":"IF(Schema!#REF!=\"\",\"\",Schema!#REF!)","v":{"$error":"#REF!"}},{"$f":"IF(Schema!#REF!=\"\",\"\",Schema!#REF!)","v":{"$error":"#REF!"}},{"$f":"IF(Schema!#REF!=\"\",\"\",Schema!#REF!)","v":{"$error":"#REF!"}},{"$f":"IF(Schema!#REF!=\"\",\"\",Schema!#REF!)","v":{"$error":"#REF!"}},{"$f":"IF(Schema!#REF!=\"\",\"\",Schema!#REF!)","v":{"$error":"#REF!"}}]
[{"$f":"Schema!#REF!&Schema!#REF!&Schema!#REF!&Schema!#REF!","v":{"$error":"#REF!"}},{"$error":"#REF!"},{"$f":"IF(A326=\"\",\"\",IF(LEN(Schema!#REF!)=2,1,IF(LEN(Schema!#REF!)=2,10,IF(LEN(Schema!#REF!)=2,100,0))))","v":{"$error":"#REF!"}},{"$error":"#REF!"},{"$f":"IF(A326=\"\",\"\",SUM(Tabel2[[#This Row],[I1]:[I2]]))","v":{"$error":"#REF!"}},{"$error":"#REF!"},{"$error":"#REF!"},{"$error":"#REF!"},{"$error":"#REF!"},{"$f":"IF(C326=\"\",\"\",IF(LEN(Tabel2[[#This Row],[Entiteit of attribuut]])=2,\"\",Tabel2[[#This Row],[Entiteit]]&\"_\"&Tabel2[[#This Row],[Entiteit of attribuut]]))","v":{"$error":"#REF!"}},{"$f":"IF(Schema!#REF!=\"\",\"\",Schema!#REF!)","v":{"$error":"#REF!"}},{"$f":"IF(Schema!#REF!=\"\",\"\",Schema!#REF!)","v":{"$error":"#REF!"}},{"$f":"IF(Schema!#REF!=\"\",\"\",Schema!#REF!)","v":{"$error":"#REF!"}},{"$f":"IF(Schema!#REF!=\"\",\"\",Schema!#REF!)","v":{"$error":"#REF!"}},{"$f":"IF(Schema!#REF!=\"\",\"\",Schema!#REF!)","v":{"$error":"#REF!"}}]
[{"$f":"Schema!#REF!&Schema!#REF!&Schema!#REF!&Schema!#REF!","v":{"$error":"#REF!"}},{"$error":"#REF!"},{"$f":"IF(A327=\"\",\"\",IF(LEN(Schema!#REF!)=2,1,IF(LEN(Schema!#REF!)=2,10,IF(LEN(Schema!#REF!)=2,100,0))))","v":{"$error":"#REF!"}},{"$error":"#REF!"},{"$f":"IF(A327=\"\",\"\",SUM(Tabel2[[#This Row],[I1]:[I2]]))","v":{"$error":"#REF!"}},{"$error":"#REF!"},{"$error":"#REF!"},{"$error":"#REF!"},{"$error":"#REF!"},{"$f":"IF(C327=\"\",\"\",IF(LEN(Tabel2[[#This Row],[Entiteit of attribuut]])=2,\"\",Tabel2[[#This Row],[Entiteit]]&\"_\"&Tabel2[[#This Row],[Entiteit of attribuut]]))","v":{"$error":"#REF!"}},{"$f":"IF(Schema!#REF!=\"\",\"\",Schema!#REF!)","v":{"$error":"#REF!"}},{"$f":"IF(Schema!#REF!=\"\",\"\",Schema!#REF!)","v":{"$error":"#REF!"}},{"$f":"IF(Schema!#REF!=\"\",\"\",Schema!#REF!)","v":{"$error":"#REF!"}},{"$f":"IF(Schema!#REF!=\"\",\"\",Schema!#REF!)","v":{"$error":"#REF!"}},{"$f":"IF(Schema!#REF!=\"\",\"\",Schema!#REF!)","v":{"$error":"#REF!"}}]
[{"$f":"Schema!#REF!&Schema!#REF!&Schema!#REF!&Schema!#REF!","v":{"$error":"#REF!"}},{"$error":"#REF!"},{"$f":"IF(A328=\"\",\"\",IF(LEN(Schema!#REF!)=2,1,IF(LEN(Schema!#REF!)=2,10,IF(LEN(Schema!#REF!)=2,100,0))))","v":{"$error":"#REF!"}},{"$error":"#REF!"},{"$f":"IF(A328=\"\",\"\",SUM(Tabel2[[#This Row],[I1]:[I2]]))","v":{"$error":"#REF!"}},{"$error":"#REF!"},{"$error":"#REF!"},{"$error":"#REF!"},{"$error":"#REF!"},{"$f":"IF(C328=\"\",\"\",IF(LEN(Tabel2[[#This Row],[Entiteit of attribuut]])=2,\"\",Tabel2[[#This Row],[Entiteit]]&\"_\"&Tabel2[[#This Row],[Entiteit of attribuut]]))","v":{"$error":"#REF!"}},{"$f":"IF(Schema!#REF!=\"\",\"\",Schema!#REF!)","v":{"$error":"#REF!"}},{"$f":"IF(Schema!#REF!=\"\",\"\",Schema!#REF!)","v":{"$error":"#REF!"}},{"$f":"IF(Schema!#REF!=\"\",\"\",Schema!#REF!)","v":{"$error":"#REF!"}},{"$f":"IF(Schema!#REF!=\"\",\"\",Schema!#REF!)","v":{"$error":"#REF!"}},{"$f":"IF(Schema!#REF!=\"\",\"\",Schema!#REF!)","v":{"$error":"#REF!"}}]
[{"$f":"Schema!#REF!&Schema!#REF!&Schema!#REF!&Schema!#REF!","v":{"$error":"#REF!"}},{"$error":"#REF!"},{"$f":"IF(A329=\"\",\"\",IF(LEN(Schema!#REF!)=2,1,IF(LEN(Schema!#REF!)=2,10,IF(LEN(Schema!#REF!)=2,100,0))))","v":{"$error":"#REF!"}},{"$error":"#REF!"},{"$f":"IF(A329=\"\",\"\",SUM(Tabel2[[#This Row],[I1]:[I2]]))","v":{"$error":"#REF!"}},{"$error":"#REF!"},{"$error":"#REF!"},{"$error":"#REF!"},{"$error":"#REF!"},{"$f":"IF(C329=\"\",\"\",IF(LEN(Tabel2[[#This Row],[Entiteit of attribuut]])=2,\"\",Tabel2[[#This Row],[Entiteit]]&\"_\"&Tabel2[[#This Row],[Entiteit of attribuut]]))","v":{"$error":"#REF!"}},{"$f":"IF(Schema!#REF!=\"\",\"\",Schema!#REF!)","v":{"$error":"#REF!"}},{"$f":"IF(Schema!#REF!=\"\",\"\",Schema!#REF!)","v":{"$error":"#REF!"}},{"$f":"IF(Schema!#REF!=\"\",\"\",Schema!#REF!)","v":{"$error":"#REF!"}},{"$f":"IF(Schema!#REF!=\"\",\"\",Schema!#REF!)","v":{"$error":"#REF!"}},{"$f":"IF(Schema!#REF!=\"\",\"\",Schema!#REF!)","v":{"$error":"#REF!"}}]
[{"$f":"Schema!#REF!&Schema!#REF!&Schema!#REF!&Schema!#REF!","v":{"$error":"#REF!"}},{"$error":"#REF!"},{"$f":"IF(A330=\"\",\"\",IF(LEN(Schema!#REF!)=2,1,IF(LEN(Schema!#REF!)=2,10,IF(LEN(Schema!#REF!)=2,100,0))))","v":{"$error":"#REF!"}},{"$error":"#REF!"},{"$f":"IF(A330=\"\",\"\",SUM(Tabel2[[#This Row],[I1]:[I2]]))","v":{"$error":"#REF!"}},{"$error":"#REF!"},{"$error":"#REF!"},{"$error":"#REF!"},{"$error":"#REF!"},{"$f":"IF(C330=\"\",\"\",IF(LEN(Tabel2[[#This Row],[Entiteit of attribuut]])=2,\"\",Tabel2[[#This Row],[Entiteit]]&\"_\"&Tabel2[[#This Row],[Entiteit of attribuut]]))","v":{"$error":"#REF!"}},{"$f":"IF(Schema!#REF!=\"\",\"\",Schema!#REF!)","v":{"$error":"#REF!"}},{"$f":"IF(Schema!#REF!=\"\",\"\",Schema!#REF!)","v":{"$error":"#REF!"}},{"$f":"IF(Schema!#REF!=\"\",\"\",Schema!#REF!)","v":{"$error":"#REF!"}},{"$f":"IF(Schema!#REF!=\"\",\"\",Schema!#REF!)","v":{"$error":"#REF!"}},{"$f":"IF(Schema!#REF!=\"\",\"\",Schema!#REF!)","v":{"$error":"#REF!"}}]
[{"$f":"Schema!#REF!&Schema!#REF!&Schema!#REF!&Schema!#REF!","v":{"$error":"#REF!"}},{"$error":"#REF!"},{"$f":"IF(A331=\"\",\"\",IF(LEN(Schema!#REF!)=2,1,IF(LEN(Schema!#REF!)=2,10,IF(LEN(Schema!#REF!)=2,100,0))))","v":{"$error":"#REF!"}},{"$error":"#REF!"},{"$f":"IF(A331=\"\",\"\",SUM(Tabel2[[#This Row],[I1]:[I2]]))","v":{"$error":"#REF!"}},{"$error":"#REF!"},{"$error":"#REF!"},{"$error":"#REF!"},{"$error":"#REF!"},{"$f":"IF(C331=\"\",\"\",IF(LEN(Tabel2[[#This Row],[Entiteit of attribuut]])=2,\"\",Tabel2[[#This Row],[Entiteit]]&\"_\"&Tabel2[[#This Row],[Entiteit of attribuut]]))","v":{"$error":"#REF!"}},{"$f":"IF(Schema!#REF!=\"\",\"\",Schema!#REF!)","v":{"$error":"#REF!"}},{"$f":"IF(Schema!#REF!=\"\",\"\",Schema!#REF!)","v":{"$error":"#REF!"}},{"$f":"IF(Schema!#REF!=\"\",\"\",Schema!#REF!)","v":{"$error":"#REF!"}},{"$f":"IF(Schema!#REF!=\"\",\"\",Schema!#REF!)","v":{"$error":"#REF!"}},{"$f":"IF(Schema!#REF!=\"\",\"\",Schema!#REF!)","v":{"$error":"#REF!"}}]
[{"$f":"Schema!#REF!&Schema!#REF!&Schema!#REF!&Schema!#REF!","v":{"$error":"#REF!"}},{"$error":"#REF!"},{"$f":"IF(A332=\"\",\"\",IF(LEN(Schema!#REF!)=2,1,IF(LEN(Schema!#REF!)=2,10,IF(LEN(Schema!#REF!)=2,100,0))))","v":{"$error":"#REF!"}},{"$error":"#REF!"},{"$f":"IF(A332=\"\",\"\",SUM(Tabel2[[#This Row],[I1]:[I2]]))","v":{"$error":"#REF!"}},{"$error":"#REF!"},{"$error":"#REF!"},{"$error":"#REF!"},{"$error":"#REF!"},{"$f":"IF(C332=\"\",\"\",IF(LEN(Tabel2[[#This Row],[Entiteit of attribuut]])=2,\"\",Tabel2[[#This Row],[Entiteit]]&\"_\"&Tabel2[[#This Row],[Entiteit of attribuut]]))","v":{"$error":"#REF!"}},{"$f":"IF(Schema!#REF!=\"\",\"\",Schema!#REF!)","v":{"$error":"#REF!"}},{"$f":"IF(Schema!#REF!=\"\",\"\",Schema!#REF!)","v":{"$error":"#REF!"}},{"$f":"IF(Schema!#REF!=\"\",\"\",Schema!#REF!)","v":{"$error":"#REF!"}},{"$f":"IF(Schema!#REF!=\"\",\"\",Schema!#REF!)","v":{"$error":"#REF!"}},{"$f":"IF(Schema!#REF!=\"\",\"\",Schema!#REF!)","v":{"$error":"#REF!"}}]
[{"$f":"Schema!#REF!&Schema!#REF!&Schema!#REF!&Schema!#REF!","v":{"$error":"#REF!"}},{"$error":"#REF!"},{"$f":"IF(A333=\"\",\"\",IF(LEN(Schema!#REF!)=2,1,IF(LEN(Schema!#REF!)=2,10,IF(LEN(Schema!#REF!)=2,100,0))))","v":{"$error":"#REF!"}},{"$error":"#REF!"},{"$f":"IF(A333=\"\",\"\",SUM(Tabel2[[#This Row],[I1]:[I2]]))","v":{"$error":"#REF!"}},{"$error":"#REF!"},{"$error":"#REF!"},{"$error":"#REF!"},{"$error":"#REF!"},{"$f":"IF(C333=\"\",\"\",IF(LEN(Tabel2[[#This Row],[Entiteit of attribuut]])=2,\"\",Tabel2[[#This Row],[Entiteit]]&\"_\"&Tabel2[[#This Row],[Entiteit of attribuut]]))","v":{"$error":"#REF!"}},{"$f":"IF(Schema!#REF!=\"\",\"\",Schema!#REF!)","v":{"$error":"#REF!"}},{"$f":"IF(Schema!#REF!=\"\",\"\",Schema!#REF!)","v":{"$error":"#REF!"}},{"$f":"IF(Schema!#REF!=\"\",\"\",Schema!#REF!)","v":{"$error":"#REF!"}},{"$f":"IF(Schema!#REF!=\"\",\"\",Schema!#REF!)","v":{"$error":"#REF!"}},{"$f":"IF(Schema!#REF!=\"\",\"\",Schema!#REF!)","v":{"$error":"#REF!"}}]
[{"$f":"Schema!#REF!&Schema!#REF!&Schema!#REF!&Schema!#REF!","v":{"$error":"#REF!"}},{"$error":"#REF!"},{"$f":"IF(A334=\"\",\"\",IF(LEN(Schema!#REF!)=2,1,IF(LEN(Schema!#REF!)=2,10,IF(LEN(Schema!#REF!)=2,100,0))))","v":{"$error":"#REF!"}},{"$error":"#REF!"},{"$f":"IF(A334=\"\",\"\",SUM(Tabel2[[#This Row],[I1]:[I2]]))","v":{"$error":"#REF!"}},{"$error":"#REF!"},{"$error":"#REF!"},{"$error":"#REF!"},{"$error":"#REF!"},{"$f":"IF(C334=\"\",\"\",IF(LEN(Tabel2[[#This Row],[Entiteit of attribuut]])=2,\"\",Tabel2[[#This Row],[Entiteit]]&\"_\"&Tabel2[[#This Row],[Entiteit of attribuut]]))","v":{"$error":"#REF!"}},{"$f":"IF(Schema!#REF!=\"\",\"\",Schema!#REF!)","v":{"$error":"#REF!"}},{"$f":"IF(Schema!#REF!=\"\",\"\",Schema!#REF!)","v":{"$error":"#REF!"}},{"$f":"IF(Schema!#REF!=\"\",\"\",Schema!#REF!)","v":{"$error":"#REF!"}},{"$f":"IF(Schema!#REF!=\"\",\"\",Schema!#REF!)","v":{"$error":"#REF!"}},{"$f":"IF(Schema!#REF!=\"\",\"\",Schema!#REF!)","v":{"$error":"#REF!"}}]
[{"$f":"Schema!#REF!&Schema!#REF!&Schema!#REF!&Schema!#REF!","v":{"$error":"#REF!"}},{"$error":"#REF!"},{"$f":"IF(A335=\"\",\"\",IF(LEN(Schema!#REF!)=2,1,IF(LEN(Schema!#REF!)=2,10,IF(LEN(Schema!#REF!)=2,100,0))))","v":{"$error":"#REF!"}},{"$error":"#REF!"},{"$f":"IF(A335=\"\",\"\",SUM(Tabel2[[#This Row],[I1]:[I2]]))","v":{"$error":"#REF!"}},{"$error":"#REF!"},{"$error":"#REF!"},{"$error":"#REF!"},{"$error":"#REF!"},{"$f":"IF(C335=\"\",\"\",IF(LEN(Tabel2[[#This Row],[Entiteit of attribuut]])=2,\"\",Tabel2[[#This Row],[Entiteit]]&\"_\"&Tabel2[[#This Row],[Entiteit of attribuut]]))","v":{"$error":"#REF!"}},{"$f":"IF(Schema!#REF!=\"\",\"\",Schema!#REF!)","v":{"$error":"#REF!"}},{"$f":"IF(Schema!#REF!=\"\",\"\",Schema!#REF!)","v":{"$error":"#REF!"}},{"$f":"IF(Schema!#REF!=\"\",\"\",Schema!#REF!)","v":{"$error":"#REF!"}},{"$f":"IF(Schema!#REF!=\"\",\"\",Schema!#REF!)","v":{"$error":"#REF!"}},{"$f":"IF(Schema!#REF!=\"\",\"\",Schema!#REF!)","v":{"$error":"#REF!"}}]
[{"$f":"Schema!#REF!&Schema!#REF!&Schema!#REF!&Schema!#REF!","v":{"$error":"#REF!"}},{"$error":"#REF!"},{"$f":"IF(A336=\"\",\"\",IF(LEN(Schema!#REF!)=2,1,IF(LEN(Schema!#REF!)=2,10,IF(LEN(Schema!#REF!)=2,100,0))))","v":{"$error":"#REF!"}},{"$error":"#REF!"},{"$f":"IF(A336=\"\",\"\",SUM(Tabel2[[#This Row],[I1]:[I2]]))","v":{"$error":"#REF!"}},{"$error":"#REF!"},{"$error":"#REF!"},{"$error":"#REF!"},{"$error":"#REF!"},{"$f":"IF(C336=\"\",\"\",IF(LEN(Tabel2[[#This Row],[Entiteit of attribuut]])=2,\"\",Tabel2[[#This Row],[Entiteit]]&\"_\"&Tabel2[[#This Row],[Entiteit of attribuut]]))","v":{"$error":"#REF!"}},{"$f":"IF(Schema!#REF!=\"\",\"\",Schema!#REF!)","v":{"$error":"#REF!"}},{"$f":"IF(Schema!#REF!=\"\",\"\",Schema!#REF!)","v":{"$error":"#REF!"}},{"$f":"IF(Schema!#REF!=\"\",\"\",Schema!#REF!)","v":{"$error":"#REF!"}},{"$f":"IF(Schema!#REF!=\"\",\"\",Schema!#REF!)","v":{"$error":"#REF!"}},{"$f":"IF(Schema!#REF!=\"\",\"\",Schema!#REF!)","v":{"$error":"#REF!"}}]
[{"$f":"Schema!#REF!&Schema!#REF!&Schema!#REF!&Schema!#REF!","v":{"$error":"#REF!"}},{"$error":"#REF!"},{"$f":"IF(A337=\"\",\"\",IF(LEN(Schema!#REF!)=2,1,IF(LEN(Schema!#REF!)=2,10,IF(LEN(Schema!#REF!)=2,100,0))))","v":{"$error":"#REF!"}},{"$error":"#REF!"},{"$f":"IF(A337=\"\",\"\",SUM(Tabel2[[#This Row],[I1]:[I2]]))","v":{"$error":"#REF!"}},{"$error":"#REF!"},{"$error":"#REF!"},{"$error":"#REF!"},{"$error":"#REF!"},{"$f":"IF(C337=\"\",\"\",IF(LEN(Tabel2[[#This Row],[Entiteit of attribuut]])=2,\"\",Tabel2[[#This Row],[Entiteit]]&\"_\"&Tabel2[[#This Row],[Entiteit of attribuut]]))","v":{"$error":"#REF!"}},{"$f":"IF(Schema!#REF!=\"\",\"\",Schema!#REF!)","v":{"$error":"#REF!"}},{"$f":"IF(Schema!#REF!=\"\",\"\",Schema!#REF!)","v":{"$error":"#REF!"}},{"$f":"IF(Schema!#REF!=\"\",\"\",Schema!#REF!)","v":{"$error":"#REF!"}},{"$f":"IF(Schema!#REF!=\"\",\"\",Schema!#REF!)","v":{"$error":"#REF!"}},{"$f":"IF(Schema!#REF!=\"\",\"\",Schema!#REF!)","v":{"$error":"#REF!"}}]
[{"$f":"Schema!#REF!&Schema!#REF!&Schema!#REF!&Schema!#REF!","v":{"$error":"#REF!"}},{"$error":"#REF!"},{"$f":"IF(A338=\"\",\"\",IF(LEN(Schema!#REF!)=2,1,IF(LEN(Schema!#REF!)=2,10,IF(LEN(Schema!#REF!)=2,100,0))))","v":{"$error":"#REF!"}},{"$error":"#REF!"},{"$f":"IF(A338=\"\",\"\",SUM(Tabel2[[#This Row],[I1]:[I2]]))","v":{"$error":"#REF!"}},{"$error":"#REF!"},{"$error":"#REF!"},{"$error":"#REF!"},{"$error":"#REF!"},{"$f":"IF(C338=\"\",\"\",IF(LEN(Tabel2[[#This Row],[Entiteit of attribuut]])=2,\"\",Tabel2[[#This Row],[Entiteit]]&\"_\"&Tabel2[[#This Row],[Entiteit of attribuut]]))","v":{"$error":"#REF!"}},{"$f":"IF(Schema!#REF!=\"\",\"\",Schema!#REF!)","v":{"$error":"#REF!"}},{"$f":"IF(Schema!#REF!=\"\",\"\",Schema!#REF!)","v":{"$error":"#REF!"}},{"$f":"IF(Schema!#REF!=\"\",\"\",Schema!#REF!)","v":{"$error":"#REF!"}},{"$f":"IF(Schema!#REF!=\"\",\"\",Schema!#REF!)","v":{"$error":"#REF!"}},{"$f":"IF(Schema!#REF!=\"\",\"\",Schema!#REF!)","v":{"$error":"#REF!"}}]
[{"$f":"Schema!#REF!&Schema!#REF!&Schema!#REF!&Schema!#REF!","v":{"$error":"#REF!"}},{"$error":"#REF!"},{"$f":"IF(A339=\"\",\"\",IF(LEN(Schema!#REF!)=2,1,IF(LEN(Schema!#REF!)=2,10,IF(LEN(Schema!#REF!)=2,100,0))))","v":{"$error":"#REF!"}},{"$error":"#REF!"},{"$f":"IF(A339=\"\",\"\",SUM(Tabel2[[#This Row],[I1]:[I2]]))","v":{"$error":"#REF!"}},{"$error":"#REF!"},{"$error":"#REF!"},{"$error":"#REF!"},{"$error":"#REF!"},{"$f":"IF(C339=\"\",\"\",IF(LEN(Tabel2[[#This Row],[Entiteit of attribuut]])=2,\"\",Tabel2[[#This Row],[Entiteit]]&\"_\"&Tabel2[[#This Row],[Entiteit of attribuut]]))","v":{"$error":"#REF!"}},{"$f":"IF(Schema!#REF!=\"\",\"\",Schema!#REF!)","v":{"$error":"#REF!"}},{"$f":"IF(Schema!#REF!=\"\",\"\",Schema!#REF!)","v":{"$error":"#REF!"}},{"$f":"IF(Schema!#REF!=\"\",\"\",Schema!#REF!)","v":{"$error":"#REF!"}},{"$f":"IF(Schema!#REF!=\"\",\"\",Schema!#REF!)","v":{"$error":"#REF!"}},{"$f":"IF(Schema!#REF!=\"\",\"\",Schema!#REF!)","v":{"$error":"#REF!"}}]
[{"$f":"Schema!#REF!&Schema!#REF!&Schema!#REF!&Schema!#REF!","v":{"$error":"#REF!"}},{"$error":"#REF!"},{"$f":"IF(A340=\"\",\"\",IF(LEN(Schema!#REF!)=2,1,IF(LEN(Schema!#REF!)=2,10,IF(LEN(Schema!#REF!)=2,100,0))))","v":{"$error":"#REF!"}},{"$error":"#REF!"},{"$f":"IF(A340=\"\",\"\",SUM(Tabel2[[#This Row],[I1]:[I2]]))","v":{"$error":"#REF!"}},{"$error":"#REF!"},{"$error":"#REF!"},{"$error":"#REF!"},{"$error":"#REF!"},{"$f":"IF(C340=\"\",\"\",IF(LEN(Tabel2[[#This Row],[Entiteit of attribuut]])=2,\"\",Tabel2[[#This Row],[Entiteit]]&\"_\"&Tabel2[[#This Row],[Entiteit of attribuut]]))","v":{"$error":"#REF!"}},{"$f":"IF(Schema!#REF!=\"\",\"\",Schema!#REF!)","v":{"$error":"#REF!"}},{"$f":"IF(Schema!#REF!=\"\",\"\",Schema!#REF!)","v":{"$error":"#REF!"}},{"$f":"IF(Schema!#REF!=\"\",\"\",Schema!#REF!)","v":{"$error":"#REF!"}},{"$f":"IF(Schema!#REF!=\"\",\"\",Schema!#REF!)","v":{"$error":"#REF!"}},{"$f":"IF(Schema!#REF!=\"\",\"\",Schema!#REF!)","v":{"$error":"#REF!"}}]
[{"$f":"Schema!#REF!&Schema!#REF!&Schema!#REF!&Schema!#REF!","v":{"$error":"#REF!"}},{"$error":"#REF!"},{"$f":"IF(A341=\"\",\"\",IF(LEN(Schema!#REF!)=2,1,IF(LEN(Schema!#REF!)=2,10,IF(LEN(Schema!#REF!)=2,100,0))))","v":{"$error":"#REF!"}},{"$error":"#REF!"},{"$f":"IF(A341=\"\",\"\",SUM(Tabel2[[#This Row],[I1]:[I2]]))","v":{"$error":"#REF!"}},{"$error":"#REF!"},{"$error":"#REF!"},{"$error":"#REF!"},{"$error":"#REF!"},{"$f":"IF(C341=\"\",\"\",IF(LEN(Tabel2[[#This Row],[Entiteit of attribuut]])=2,\"\",Tabel2[[#This Row],[Entiteit]]&\"_\"&Tabel2[[#This Row],[Entiteit of attribuut]]))","v":{"$error":"#REF!"}},{"$f":"IF(Schema!#REF!=\"\",\"\",Schema!#REF!)","v":{"$error":"#REF!"}},{"$f":"IF(Schema!#REF!=\"\",\"\",Schema!#REF!)","v":{"$error":"#REF!"}},{"$f":"IF(Schema!#REF!=\"\",\"\",Schema!#REF!)","v":{"$error":"#REF!"}},{"$f":"IF(Schema!#REF!=\"\",\"\",Schema!#REF!)","v":{"$error":"#REF!"}},{"$f":"IF(Schema!#REF!=\"\",\"\",Schema!#REF!)","v":{"$error":"#REF!"}}]
[{"$f":"Schema!#REF!&Schema!#REF!&Schema!#REF!&Schema!#REF!","v":{"$error":"#REF!"}},{"$error":"#REF!"},{"$f":"IF(A342=\"\",\"\",IF(LEN(Schema!#REF!)=2,1,IF(LEN(Schema!#REF!)=2,10,IF(LEN(Schema!#REF!)=2,100,0))))","v":{"$error":"#REF!"}},{"$error":"#REF!"},{"$f":"IF(A342=\"\",\"\",SUM(Tabel2[[#This Row],[I1]:[I2]]))","v":{"$error":"#REF!"}},{"$error":"#REF!"},{"$error":"#REF!"},{"$error":"#REF!"},{"$error":"#REF!"},{"$f":"IF(C342=\"\",\"\",IF(LEN(Tabel2[[#This Row],[Entiteit of attribuut]])=2,\"\",Tabel2[[#This Row],[Entiteit]]&\"_\"&Tabel2[[#This Row],[Entiteit of attribuut]]))","v":{"$error":"#REF!"}},{"$f":"IF(Schema!#REF!=\"\",\"\",Schema!#REF!)","v":{"$error":"#REF!"}},{"$f":"IF(Schema!#REF!=\"\",\"\",Schema!#REF!)","v":{"$error":"#REF!"}},{"$f":"IF(Schema!#REF!=\"\",\"\",Schema!#REF!)","v":{"$error":"#REF!"}},{"$f":"IF(Schema!#REF!=\"\",\"\",Schema!#REF!)","v":{"$error":"#REF!"}},{"$f":"IF(Schema!#REF!=\"\",\"\",Schema!#REF!)","v":{"$error":"#REF!"}}]
[{"$f":"Schema!#REF!&Schema!#REF!&Schema!#REF!&Schema!#REF!","v":{"$error":"#REF!"}},{"$error":"#REF!"},{"$f":"IF(A343=\"\",\"\",IF(LEN(Schema!#REF!)=2,1,IF(LEN(Schema!#REF!)=2,10,IF(LEN(Schema!#REF!)=2,100,0))))","v":{"$error":"#REF!"}},{"$error":"#REF!"},{"$f":"IF(A343=\"\",\"\",SUM(Tabel2[[#This Row],[I1]:[I2]]))","v":{"$error":"#REF!"}},{"$error":"#REF!"},{"$error":"#REF!"},{"$error":"#REF!"},{"$error":"#REF!"},{"$f":"IF(C343=\"\",\"\",IF(LEN(Tabel2[[#This Row],[Entiteit of attribuut]])=2,\"\",Tabel2[[#This Row],[Entiteit]]&\"_\"&Tabel2[[#This Row],[Entiteit of attribuut]]))","v":{"$error":"#REF!"}},{"$f":"IF(Schema!#REF!=\"\",\"\",Schema!#REF!)","v":{"$error":"#REF!"}},{"$f":"IF(Schema!#REF!=\"\",\"\",Schema!#REF!)","v":{"$error":"#REF!"}},{"$f":"IF(Schema!#REF!=\"\",\"\",Schema!#REF!)","v":{"$error":"#REF!"}},{"$f":"IF(Schema!#REF!=\"\",\"\",Schema!#REF!)","v":{"$error":"#REF!"}},{"$f":"IF(Schema!#REF!=\"\",\"\",Schema!#REF!)","v":{"$error":"#REF!"}}]
[{"$f":"Schema!#REF!&Schema!#REF!&Schema!#REF!&Schema!#REF!","v":{"$error":"#REF!"}},{"$error":"#REF!"},{"$f":"IF(A344=\"\",\"\",IF(LEN(Schema!#REF!)=2,1,IF(LEN(Schema!#REF!)=2,10,IF(LEN(Schema!#REF!)=2,100,0))))","v":{"$error":"#REF!"}},{"$error":"#REF!"},{"$f":"IF(A344=\"\",\"\",SUM(Tabel2[[#This Row],[I1]:[I2]]))","v":{"$error":"#REF!"}},{"$error":"#REF!"},{"$error":"#REF!"},{"$error":"#REF!"},{"$error":"#REF!"},{"$f":"IF(C344=\"\",\"\",IF(LEN(Tabel2[[#This Row],[Entiteit of attribuut]])=2,\"\",Tabel2[[#This Row],[Entiteit]]&\"_\"&Tabel2[[#This Row],[Entiteit of attribuut]]))","v":{"$error":"#REF!"}},{"$f":"IF(Schema!#REF!=\"\",\"\",Schema!#REF!)","v":{"$error":"#REF!"}},{"$f":"IF(Schema!#REF!=\"\",\"\",Schema!#REF!)","v":{"$error":"#REF!"}},{"$f":"IF(Schema!#REF!=\"\",\"\",Schema!#REF!)","v":{"$error":"#REF!"}},{"$f":"IF(Schema!#REF!=\"\",\"\",Schema!#REF!)","v":{"$error":"#REF!"}},{"$f":"IF(Schema!#REF!=\"\",\"\",Schema!#REF!)","v":{"$error":"#REF!"}}]
[{"$f":"Schema!#REF!&Schema!#REF!&Schema!#REF!&Schema!#REF!","v":{"$error":"#REF!"}},{"$error":"#REF!"},{"$f":"IF(A345=\"\",\"\",IF(LEN(Schema!#REF!)=2,1,IF(LEN(Schema!#REF!)=2,10,IF(LEN(Schema!#REF!)=2,100,0))))","v":{"$error":"#REF!"}},{"$error":"#REF!"},{"$f":"IF(A345=\"\",\"\",SUM(Tabel2[[#This Row],[I1]:[I2]]))","v":{"$error":"#REF!"}},{"$error":"#REF!"},{"$error":"#REF!"},{"$error":"#REF!"},{"$error":"#REF!"},{"$f":"IF(C345=\"\",\"\",IF(LEN(Tabel2[[#This Row],[Entiteit of attribuut]])=2,\"\",Tabel2[[#This Row],[Entiteit]]&\"_\"&Tabel2[[#This Row],[Entiteit of attribuut]]))","v":{"$error":"#REF!"}},{"$f":"IF(Schema!#REF!=\"\",\"\",Schema!#REF!)","v":{"$error":"#REF!"}},{"$f":"IF(Schema!#REF!=\"\",\"\",Schema!#REF!)","v":{"$error":"#REF!"}},{"$f":"IF(Schema!#REF!=\"\",\"\",Schema!#REF!)","v":{"$error":"#REF!"}},{"$f":"IF(Schema!#REF!=\"\",\"\",Schema!#REF!)","v":{"$error":"#REF!"}},{"$f":"IF(Schema!#REF!=\"\",\"\",Schema!#REF!)","v":{"$error":"#REF!"}}]
[{"$f":"Schema!#REF!&Schema!#REF!&Schema!#REF!&Schema!#REF!","v":{"$error":"#REF!"}},{"$error":"#REF!"},{"$f":"IF(A346=\"\",\"\",IF(LEN(Schema!#REF!)=2,1,IF(LEN(Schema!#REF!)=2,10,IF(LEN(Schema!#REF!)=2,100,0))))","v":{"$error":"#REF!"}},{"$error":"#REF!"},{"$f":"IF(A346=\"\",\"\",SUM(Tabel2[[#This Row],[I1]:[I2]]))","v":{"$error":"#REF!"}},{"$error":"#REF!"},{"$error":"#REF!"},{"$error":"#REF!"},{"$error":"#REF!"},{"$f":"IF(C346=\"\",\"\",IF(LEN(Tabel2[[#This Row],[Entiteit of attribuut]])=2,\"\",Tabel2[[#This Row],[Entiteit]]&\"_\"&Tabel2[[#This Row],[Entiteit of attribuut]]))","v":{"$error":"#REF!"}},{"$f":"IF(Schema!#REF!=\"\",\"\",Schema!#REF!)","v":{"$error":"#REF!"}},{"$f":"IF(Schema!#REF!=\"\",\"\",Schema!#REF!)","v":{"$error":"#REF!"}},{"$f":"IF(Schema!#REF!=\"\",\"\",Schema!#REF!)","v":{"$error":"#REF!"}},{"$f":"IF(Schema!#REF!=\"\",\"\",Schema!#REF!)","v":{"$error":"#REF!"}},{"$f":"IF(Schema!#REF!=\"\",\"\",Schema!#REF!)","v":{"$error":"#REF!"}}]
[{"$f":"Schema!#REF!&Schema!#REF!&Schema!#REF!&Schema!#REF!","v":{"$error":"#REF!"}},{"$error":"#REF!"},{"$f":"IF(A347=\"\",\"\",IF(LEN(Schema!#REF!)=2,1,IF(LEN(Schema!#REF!)=2,10,IF(LEN(Schema!#REF!)=2,100,0))))","v":{"$error":"#REF!"}},{"$error":"#REF!"},{"$f":"IF(A347=\"\",\"\",SUM(Tabel2[[#This Row],[I1]:[I2]]))","v":{"$error":"#REF!"}},{"$error":"#REF!"},{"$error":"#REF!"},{"$error":"#REF!"},{"$error":"#REF!"},{"$f":"IF(C347=\"\",\"\",IF(LEN(Tabel2[[#This Row],[Entiteit of attribuut]])=2,\"\",Tabel2[[#This Row],[Entiteit]]&\"_\"&Tabel2[[#This Row],[Entiteit of attribuut]]))","v":{"$error":"#REF!"}},{"$f":"IF(Schema!#REF!=\"\",\"\",Schema!#REF!)","v":{"$error":"#REF!"}},{"$f":"IF(Schema!#REF!=\"\",\"\",Schema!#REF!)","v":{"$error":"#REF!"}},{"$f":"IF(Schema!#REF!=\"\",\"\",Schema!#REF!)","v":{"$error":"#REF!"}},{"$f":"IF(Schema!#REF!=\"\",\"\",Schema!#REF!)","v":{"$error":"#REF!"}},{"$f":"IF(Schema!#REF!=\"\",\"\",Schema!#REF!)","v":{"$error":"#REF!"}}]
[{"$f":"Schema!#REF!&Schema!#REF!&Schema!#REF!&Schema!#REF!","v":{"$error":"#REF!"}},{"$error":"#REF!"},{"$f":"IF(A348=\"\",\"\",IF(LEN(Schema!#REF!)=2,1,IF(LEN(Schema!#REF!)=2,10,IF(LEN(Schema!#REF!)=2,100,0))))","v":{"$error":"#REF!"}},{"$error":"#REF!"},{"$f":"IF(A348=\"\",\"\",SUM(Tabel2[[#This Row],[I1]:[I2]]))","v":{"$error":"#REF!"}},{"$error":"#REF!"},{"$error":"#REF!"},{"$error":"#REF!"},{"$error":"#REF!"},{"$f":"IF(C348=\"\",\"\",IF(LEN(Tabel2[[#This Row],[Entiteit of attribuut]])=2,\"\",Tabel2[[#This Row],[Entiteit]]&\"_\"&Tabel2[[#This Row],[Entiteit of attribuut]]))","v":{"$error":"#REF!"}},{"$f":"IF(Schema!#REF!=\"\",\"\",Schema!#REF!)","v":{"$error":"#REF!"}},{"$f":"IF(Schema!#REF!=\"\",\"\",Schema!#REF!)","v":{"$error":"#REF!"}},{"$f":"IF(Schema!#REF!=\"\",\"\",Schema!#REF!)","v":{"$error":"#REF!"}},{"$f":"IF(Schema!#REF!=\"\",\"\",Schema!#REF!)","v":{"$error":"#REF!"}},{"$f":"IF(Schema!#REF!=\"\",\"\",Schema!#REF!)","v":{"$error":"#REF!"}}]
[{"$f":"Schema!#REF!&Schema!#REF!&Schema!#REF!&Schema!#REF!","v":{"$error":"#REF!"}},{"$error":"#REF!"},{"$f":"IF(A349=\"\",\"\",IF(LEN(Schema!#REF!)=2,1,IF(LEN(Schema!#REF!)=2,10,IF(LEN(Schema!#REF!)=2,100,0))))","v":{"$error":"#REF!"}},{"$error":"#REF!"},{"$f":"IF(A349=\"\",\"\",SUM(Tabel2[[#This Row],[I1]:[I2]]))","v":{"$error":"#REF!"}},{"$error":"#REF!"},{"$error":"#REF!"},{"$error":"#REF!"},{"$error":"#REF!"},{"$f":"IF(C349=\"\",\"\",IF(LEN(Tabel2[[#This Row],[Entiteit of attribuut]])=2,\"\",Tabel2[[#This Row],[Entiteit]]&\"_\"&Tabel2[[#This Row],[Entiteit of attribuut]]))","v":{"$error":"#REF!"}},{"$f":"IF(Schema!#REF!=\"\",\"\",Schema!#REF!)","v":{"$error":"#REF!"}},{"$f":"IF(Schema!#REF!=\"\",\"\",Schema!#REF!)","v":{"$error":"#REF!"}},{"$f":"IF(Schema!#REF!=\"\",\"\",Schema!#REF!)","v":{"$error":"#REF!"}},{"$f":"IF(Schema!#REF!=\"\",\"\",Schema!#REF!)","v":{"$error":"#REF!"}},{"$f":"IF(Schema!#REF!=\"\",\"\",Schema!#REF!)","v":{"$error":"#REF!"}}]
[{"$f":"Schema!#REF!&Schema!#REF!&Schema!#REF!&Schema!#REF!","v":{"$error":"#REF!"}},{"$error":"#REF!"},{"$f":"IF(A350=\"\",\"\",IF(LEN(Schema!#REF!)=2,1,IF(LEN(Schema!#REF!)=2,10,IF(LEN(Schema!#REF!)=2,100,0))))","v":{"$error":"#REF!"}},{"$error":"#REF!"},{"$f":"IF(A350=\"\",\"\",SUM(Tabel2[[#This Row],[I1]:[I2]]))","v":{"$error":"#REF!"}},{"$error":"#REF!"},{"$error":"#REF!"},{"$error":"#REF!"},{"$error":"#REF!"},{"$f":"IF(C350=\"\",\"\",IF(LEN(Tabel2[[#This Row],[Entiteit of attribuut]])=2,\"\",Tabel2[[#This Row],[Entiteit]]&\"_\"&Tabel2[[#This Row],[Entiteit of attribuut]]))","v":{"$error":"#REF!"}},{"$f":"IF(Schema!#REF!=\"\",\"\",Schema!#REF!)","v":{"$error":"#REF!"}},{"$f":"IF(Schema!#REF!=\"\",\"\",Schema!#REF!)","v":{"$error":"#REF!"}},{"$f":"IF(Schema!#REF!=\"\",\"\",Schema!#REF!)","v":{"$error":"#REF!"}},{"$f":"IF(Schema!#REF!=\"\",\"\",Schema!#REF!)","v":{"$error":"#REF!"}},{"$f":"IF(Schema!#REF!=\"\",\"\",Schema!#REF!)","v":{"$error":"#REF!"}}]
[{"$f":"Schema!#REF!&Schema!#REF!&Schema!#REF!&Schema!#REF!","v":{"$error":"#REF!"}},{"$error":"#REF!"},{"$f":"IF(A351=\"\",\"\",IF(LEN(Schema!#REF!)=2,1,IF(LEN(Schema!#REF!)=2,10,IF(LEN(Schema!#REF!)=2,100,0))))","v":{"$error":"#REF!"}},{"$error":"#REF!"},{"$f":"IF(A351=\"\",\"\",SUM(Tabel2[[#This Row],[I1]:[I2]]))","v":{"$error":"#REF!"}},{"$error":"#REF!"},{"$error":"#REF!"},{"$error":"#REF!"},{"$error":"#REF!"},{"$f":"IF(C351=\"\",\"\",IF(LEN(Tabel2[[#This Row],[Entiteit of attribuut]])=2,\"\",Tabel2[[#This Row],[Entiteit]]&\"_\"&Tabel2[[#This Row],[Entiteit of attribuut]]))","v":{"$error":"#REF!"}},{"$f":"IF(Schema!#REF!=\"\",\"\",Schema!#REF!)","v":{"$error":"#REF!"}},{"$f":"IF(Schema!#REF!=\"\",\"\",Schema!#REF!)","v":{"$error":"#REF!"}},{"$f":"IF(Schema!#REF!=\"\",\"\",Schema!#REF!)","v":{"$error":"#REF!"}},{"$f":"IF(Schema!#REF!=\"\",\"\",Schema!#REF!)","v":{"$error":"#REF!"}},{"$f":"IF(Schema!#REF!=\"\",\"\",Schema!#REF!)","v":{"$error":"#REF!"}}]
[{"$f":"Schema!#REF!&Schema!#REF!&Schema!#REF!&Schema!#REF!","v":{"$error":"#REF!"}},{"$error":"#REF!"},{"$f":"IF(A352=\"\",\"\",IF(LEN(Schema!#REF!)=2,1,IF(LEN(Schema!#REF!)=2,10,IF(LEN(Schema!#REF!)=2,100,0))))","v":{"$error":"#REF!"}},{"$error":"#REF!"},{"$f":"IF(A352=\"\",\"\",SUM(Tabel2[[#This Row],[I1]:[I2]]))","v":{"$error":"#REF!"}},{"$error":"#REF!"},{"$error":"#REF!"},{"$error":"#REF!"},{"$error":"#REF!"},{"$f":"IF(C352=\"\",\"\",IF(LEN(Tabel2[[#This Row],[Entiteit of attribuut]])=2,\"\",Tabel2[[#This Row],[Entiteit]]&\"_\"&Tabel2[[#This Row],[Entiteit of attribuut]]))","v":{"$error":"#REF!"}},{"$f":"IF(Schema!#REF!=\"\",\"\",Schema!#REF!)","v":{"$error":"#REF!"}},{"$f":"IF(Schema!#REF!=\"\",\"\",Schema!#REF!)","v":{"$error":"#REF!"}},{"$f":"IF(Schema!#REF!=\"\",\"\",Schema!#REF!)","v":{"$error":"#REF!"}},{"$f":"IF(Schema!#REF!=\"\",\"\",Schema!#REF!)","v":{"$error":"#REF!"}},{"$f":"IF(Schema!#REF!=\"\",\"\",Schema!#REF!)","v":{"$error":"#REF!"}}]
[{"$f":"Schema!#REF!&Schema!#REF!&Schema!#REF!&Schema!#REF!","v":{"$error":"#REF!"}},{"$error":"#REF!"},{"$f":"IF(A353=\"\",\"\",IF(LEN(Schema!#REF!)=2,1,IF(LEN(Schema!#REF!)=2,10,IF(LEN(Schema!#REF!)=2,100,0))))","v":{"$error":"#REF!"}},{"$error":"#REF!"},{"$f":"IF(A353=\"\",\"\",SUM(Tabel2[[#This Row],[I1]:[I2]]))","v":{"$error":"#REF!"}},{"$error":"#REF!"},{"$error":"#REF!"},{"$error":"#REF!"},{"$error":"#REF!"},{"$f":"IF(C353=\"\",\"\",IF(LEN(Tabel2[[#This Row],[Entiteit of attribuut]])=2,\"\",Tabel2[[#This Row],[Entiteit]]&\"_\"&Tabel2[[#This Row],[Entiteit of attribuut]]))","v":{"$error":"#REF!"}},{"$f":"IF(Schema!#REF!=\"\",\"\",Schema!#REF!)","v":{"$error":"#REF!"}},{"$f":"IF(Schema!#REF!=\"\",\"\",Schema!#REF!)","v":{"$error":"#REF!"}},{"$f":"IF(Schema!#REF!=\"\",\"\",Schema!#REF!)","v":{"$error":"#REF!"}},{"$f":"IF(Schema!#REF!=\"\",\"\",Schema!#REF!)","v":{"$error":"#REF!"}},{"$f":"IF(Schema!#REF!=\"\",\"\",Schema!#REF!)","v":{"$error":"#REF!"}}]
[{"$f":"Schema!#REF!&Schema!#REF!&Schema!#REF!&Schema!#REF!","v":{"$error":"#REF!"}},{"$error":"#REF!"},{"$f":"IF(A354=\"\",\"\",IF(LEN(Schema!#REF!)=2,1,IF(LEN(Schema!#REF!)=2,10,IF(LEN(Schema!#REF!)=2,100,0))))","v":{"$error":"#REF!"}},{"$error":"#REF!"},{"$f":"IF(A354=\"\",\"\",SUM(Tabel2[[#This Row],[I1]:[I2]]))","v":{"$error":"#REF!"}},{"$error":"#REF!"},{"$error":"#REF!"},{"$error":"#REF!"},{"$error":"#REF!"},{"$f":"IF(C354=\"\",\"\",IF(LEN(Tabel2[[#This Row],[Entiteit of attribuut]])=2,\"\",Tabel2[[#This Row],[Entiteit]]&\"_\"&Tabel2[[#This Row],[Entiteit of attribuut]]))","v":{"$error":"#REF!"}},{"$f":"IF(Schema!#REF!=\"\",\"\",Schema!#REF!)","v":{"$error":"#REF!"}},{"$f":"IF(Schema!#REF!=\"\",\"\",Schema!#REF!)","v":{"$error":"#REF!"}},{"$f":"IF(Schema!#REF!=\"\",\"\",Schema!#REF!)","v":{"$error":"#REF!"}},{"$f":"IF(Schema!#REF!=\"\",\"\",Schema!#REF!)","v":{"$error":"#REF!"}},{"$f":"IF(Schema!#REF!=\"\",\"\",Schema!#REF!)","v":{"$error":"#REF!"}}]
[{"$f":"Schema!#REF!&Schema!#REF!&Schema!#REF!&Schema!#REF!","v":{"$error":"#REF!"}},{"$error":"#REF!"},{"$f":"IF(A355=\"\",\"\",IF(LEN(Schema!#REF!)=2,1,IF(LEN(Schema!#REF!)=2,10,IF(LEN(Schema!#REF!)=2,100,0))))","v":{"$error":"#REF!"}},{"$error":"#REF!"},{"$f":"IF(A355=\"\",\"\",SUM(Tabel2[[#This Row],[I1]:[I2]]))","v":{"$error":"#REF!"}},{"$error":"#REF!"},{"$error":"#REF!"},{"$error":"#REF!"},{"$error":"#REF!"},{"$f":"IF(C355=\"\",\"\",IF(LEN(Tabel2[[#This Row],[Entiteit of attribuut]])=2,\"\",Tabel2[[#This Row],[Entiteit]]&\"_\"&Tabel2[[#This Row],[Entiteit of attribuut]]))","v":{"$error":"#REF!"}},{"$f":"IF(Schema!#REF!=\"\",\"\",Schema!#REF!)","v":{"$error":"#REF!"}},{"$f":"IF(Schema!#REF!=\"\",\"\",Schema!#REF!)","v":{"$error":"#REF!"}},{"$f":"IF(Schema!#REF!=\"\",\"\",Schema!#REF!)","v":{"$error":"#REF!"}},{"$f":"IF(Schema!#REF!=\"\",\"\",Schema!#REF!)","v":{"$error":"#REF!"}},{"$f":"IF(Schema!#REF!=\"\",\"\",Schema!#REF!)","v":{"$error":"#REF!"}}]
[{"$f":"Schema!#REF!&Schema!#REF!&Schema!#REF!&Schema!#REF!","v":{"$error":"#REF!"}},{"$error":"#REF!"},{"$f":"IF(A356=\"\",\"\",IF(LEN(Schema!#REF!)=2,1,IF(LEN(Schema!#REF!)=2,10,IF(LEN(Schema!#REF!)=2,100,0))))","v":{"$error":"#REF!"}},{"$error":"#REF!"},{"$f":"IF(A356=\"\",\"\",SUM(Tabel2[[#This Row],[I1]:[I2]]))","v":{"$error":"#REF!"}},{"$error":"#REF!"},{"$error":"#REF!"},{"$error":"#REF!"},{"$error":"#REF!"},{"$f":"IF(C356=\"\",\"\",IF(LEN(Tabel2[[#This Row],[Entiteit of attribuut]])=2,\"\",Tabel2[[#This Row],[Entiteit]]&\"_\"&Tabel2[[#This Row],[Entiteit of attribuut]]))","v":{"$error":"#REF!"}},{"$f":"IF(Schema!#REF!=\"\",\"\",Schema!#REF!)","v":{"$error":"#REF!"}},{"$f":"IF(Schema!#REF!=\"\",\"\",Schema!#REF!)","v":{"$error":"#REF!"}},{"$f":"IF(Schema!#REF!=\"\",\"\",Schema!#REF!)","v":{"$error":"#REF!"}},{"$f":"IF(Schema!#REF!=\"\",\"\",Schema!#REF!)","v":{"$error":"#REF!"}},{"$f":"IF(Schema!#REF!=\"\",\"\",Schema!#REF!)","v":{"$error":"#REF!"}}]
[{"$f":"Schema!#REF!&Schema!#REF!&Schema!#REF!&Schema!#REF!","v":{"$error":"#REF!"}},{"$error":"#REF!"},{"$f":"IF(A357=\"\",\"\",IF(LEN(Schema!#REF!)=2,1,IF(LEN(Schema!#REF!)=2,10,IF(LEN(Schema!#REF!)=2,100,0))))","v":{"$error":"#REF!"}},{"$error":"#REF!"},{"$f":"IF(A357=\"\",\"\",SUM(Tabel2[[#This Row],[I1]:[I2]]))","v":{"$error":"#REF!"}},{"$error":"#REF!"},{"$error":"#REF!"},{"$error":"#REF!"},{"$error":"#REF!"},{"$f":"IF(C357=\"\",\"\",IF(LEN(Tabel2[[#This Row],[Entiteit of attribuut]])=2,\"\",Tabel2[[#This Row],[Entiteit]]&\"_\"&Tabel2[[#This Row],[Entiteit of attribuut]]))","v":{"$error":"#REF!"}},{"$f":"IF(Schema!#REF!=\"\",\"\",Schema!#REF!)","v":{"$error":"#REF!"}},{"$f":"IF(Schema!#REF!=\"\",\"\",Schema!#REF!)","v":{"$error":"#REF!"}},{"$f":"IF(Schema!#REF!=\"\",\"\",Schema!#REF!)","v":{"$error":"#REF!"}},{"$f":"IF(Schema!#REF!=\"\",\"\",Schema!#REF!)","v":{"$error":"#REF!"}},{"$f":"IF(Schema!#REF!=\"\",\"\",Schema!#REF!)","v":{"$error":"#REF!"}}]
[{"$f":"Schema!#REF!&Schema!#REF!&Schema!#REF!&Schema!#REF!","v":{"$error":"#REF!"}},{"$error":"#REF!"},{"$f":"IF(A358=\"\",\"\",IF(LEN(Schema!#REF!)=2,1,IF(LEN(Schema!#REF!)=2,10,IF(LEN(Schema!#REF!)=2,100,0))))","v":{"$error":"#REF!"}},{"$error":"#REF!"},{"$f":"IF(A358=\"\",\"\",SUM(Tabel2[[#This Row],[I1]:[I2]]))","v":{"$error":"#REF!"}},{"$error":"#REF!"},{"$error":"#REF!"},{"$error":"#REF!"},{"$error":"#REF!"},{"$f":"IF(C358=\"\",\"\",IF(LEN(Tabel2[[#This Row],[Entiteit of attribuut]])=2,\"\",Tabel2[[#This Row],[Entiteit]]&\"_\"&Tabel2[[#This Row],[Entiteit of attribuut]]))","v":{"$error":"#REF!"}},{"$f":"IF(Schema!#REF!=\"\",\"\",Schema!#REF!)","v":{"$error":"#REF!"}},{"$f":"IF(Schema!#REF!=\"\",\"\",Schema!#REF!)","v":{"$error":"#REF!"}},{"$f":"IF(Schema!#REF!=\"\",\"\",Schema!#REF!)","v":{"$error":"#REF!"}},{"$f":"IF(Schema!#REF!=\"\",\"\",Schema!#REF!)","v":{"$error":"#REF!"}},{"$f":"IF(Schema!#REF!=\"\",\"\",Schema!#REF!)","v":{"$error":"#REF!"}}]
[{"$f":"Schema!#REF!&Schema!#REF!&Schema!#REF!&Schema!#REF!","v":{"$error":"#REF!"}},{"$error":"#REF!"},{"$f":"IF(A359=\"\",\"\",IF(LEN(Schema!#REF!)=2,1,IF(LEN(Schema!#REF!)=2,10,IF(LEN(Schema!#REF!)=2,100,0))))","v":{"$error":"#REF!"}},{"$error":"#REF!"},{"$f":"IF(A359=\"\",\"\",SUM(Tabel2[[#This Row],[I1]:[I2]]))","v":{"$error":"#REF!"}},{"$error":"#REF!"},{"$error":"#REF!"},{"$error":"#REF!"},{"$error":"#REF!"},{"$f":"IF(C359=\"\",\"\",IF(LEN(Tabel2[[#This Row],[Entiteit of attribuut]])=2,\"\",Tabel2[[#This Row],[Entiteit]]&\"_\"&Tabel2[[#This Row],[Entiteit of attribuut]]))","v":{"$error":"#REF!"}},{"$f":"IF(Schema!#REF!=\"\",\"\",Schema!#REF!)","v":{"$error":"#REF!"}},{"$f":"IF(Schema!#REF!=\"\",\"\",Schema!#REF!)","v":{"$error":"#REF!"}},{"$f":"IF(Schema!#REF!=\"\",\"\",Schema!#REF!)","v":{"$error":"#REF!"}},{"$f":"IF(Schema!#REF!=\"\",\"\",Schema!#REF!)","v":{"$error":"#REF!"}},{"$f":"IF(Schema!#REF!=\"\",\"\",Schema!#REF!)","v":{"$error":"#REF!"}}]
[{"$f":"Schema!#REF!&Schema!#REF!&Schema!#REF!&Schema!#REF!","v":{"$error":"#REF!"}},{"$error":"#REF!"},{"$f":"IF(A360=\"\",\"\",IF(LEN(Schema!#REF!)=2,1,IF(LEN(Schema!#REF!)=2,10,IF(LEN(Schema!#REF!)=2,100,0))))","v":{"$error":"#REF!"}},{"$error":"#REF!"},{"$f":"IF(A360=\"\",\"\",SUM(Tabel2[[#This Row],[I1]:[I2]]))","v":{"$error":"#REF!"}},{"$error":"#REF!"},{"$error":"#REF!"},{"$error":"#REF!"},{"$error":"#REF!"},{"$f":"IF(C360=\"\",\"\",IF(LEN(Tabel2[[#This Row],[Entiteit of attribuut]])=2,\"\",Tabel2[[#This Row],[Entiteit]]&\"_\"&Tabel2[[#This Row],[Entiteit of attribuut]]))","v":{"$error":"#REF!"}},{"$f":"IF(Schema!#REF!=\"\",\"\",Schema!#REF!)","v":{"$error":"#REF!"}},{"$f":"IF(Schema!#REF!=\"\",\"\",Schema!#REF!)","v":{"$error":"#REF!"}},{"$f":"IF(Schema!#REF!=\"\",\"\",Schema!#REF!)","v":{"$error":"#REF!"}},{"$f":"IF(Schema!#REF!=\"\",\"\",Schema!#REF!)","v":{"$error":"#REF!"}},{"$f":"IF(Schema!#REF!=\"\",\"\",Schema!#REF!)","v":{"$error":"#REF!"}}]
[{"$f":"Schema!#REF!&Schema!#REF!&Schema!#REF!&Schema!#REF!","v":{"$error":"#REF!"}},{"$error":"#REF!"},{"$f":"IF(A361=\"\",\"\",IF(LEN(Schema!#REF!)=2,1,IF(LEN(Schema!#REF!)=2,10,IF(LEN(Schema!#REF!)=2,100,0))))","v":{"$error":"#REF!"}},{"$error":"#REF!"},{"$f":"IF(A361=\"\",\"\",SUM(Tabel2[[#This Row],[I1]:[I2]]))","v":{"$error":"#REF!"}},{"$error":"#REF!"},{"$error":"#REF!"},{"$error":"#REF!"},{"$error":"#REF!"},{"$f":"IF(C361=\"\",\"\",IF(LEN(Tabel2[[#This Row],[Entiteit of attribuut]])=2,\"\",Tabel2[[#This Row],[Entiteit]]&\"_\"&Tabel2[[#This Row],[Entiteit of attribuut]]))","v":{"$error":"#REF!"}},{"$f":"IF(Schema!#REF!=\"\",\"\",Schema!#REF!)","v":{"$error":"#REF!"}},{"$f":"IF(Schema!#REF!=\"\",\"\",Schema!#REF!)","v":{"$error":"#REF!"}},{"$f":"IF(Schema!#REF!=\"\",\"\",Schema!#REF!)","v":{"$error":"#REF!"}},{"$f":"IF(Schema!#REF!=\"\",\"\",Schema!#REF!)","v":{"$error":"#REF!"}},{"$f":"IF(Schema!#REF!=\"\",\"\",Schema!#REF!)","v":{"$error":"#REF!"}}]
[{"$f":"Schema!#REF!&Schema!#REF!&Schema!#REF!&Schema!#REF!","v":{"$error":"#REF!"}},{"$error":"#REF!"},{"$f":"IF(A362=\"\",\"\",IF(LEN(Schema!#REF!)=2,1,IF(LEN(Schema!#REF!)=2,10,IF(LEN(Schema!#REF!)=2,100,0))))","v":{"$error":"#REF!"}},{"$error":"#REF!"},{"$f":"IF(A362=\"\",\"\",SUM(Tabel2[[#This Row],[I1]:[I2]]))","v":{"$error":"#REF!"}},{"$error":"#REF!"},{"$error":"#REF!"},{"$error":"#REF!"},{"$error":"#REF!"},{"$f":"IF(C362=\"\",\"\",IF(LEN(Tabel2[[#This Row],[Entiteit of attribuut]])=2,\"\",Tabel2[[#This Row],[Entiteit]]&\"_\"&Tabel2[[#This Row],[Entiteit of attribuut]]))","v":{"$error":"#REF!"}},{"$f":"IF(Schema!#REF!=\"\",\"\",Schema!#REF!)","v":{"$error":"#REF!"}},{"$f":"IF(Schema!#REF!=\"\",\"\",Schema!#REF!)","v":{"$error":"#REF!"}},{"$f":"IF(Schema!#REF!=\"\",\"\",Schema!#REF!)","v":{"$error":"#REF!"}},{"$f":"IF(Schema!#REF!=\"\",\"\",Schema!#REF!)","v":{"$error":"#REF!"}},{"$f":"IF(Schema!#REF!=\"\",\"\",Schema!#REF!)","v":{"$error":"#REF!"}}]
[{"$f":"Schema!#REF!&Schema!#REF!&Schema!#REF!&Schema!#REF!","v":{"$error":"#REF!"}},{"$error":"#REF!"},{"$f":"IF(A363=\"\",\"\",IF(LEN(Schema!#REF!)=2,1,IF(LEN(Schema!#REF!)=2,10,IF(LEN(Schema!#REF!)=2,100,0))))","v":{"$error":"#REF!"}},{"$error":"#REF!"},{"$f":"IF(A363=\"\",\"\",SUM(Tabel2[[#This Row],[I1]:[I2]]))","v":{"$error":"#REF!"}},{"$error":"#REF!"},{"$error":"#REF!"},{"$error":"#REF!"},{"$error":"#REF!"},{"$f":"IF(C363=\"\",\"\",IF(LEN(Tabel2[[#This Row],[Entiteit of attribuut]])=2,\"\",Tabel2[[#This Row],[Entiteit]]&\"_\"&Tabel2[[#This Row],[Entiteit of attribuut]]))","v":{"$error":"#REF!"}},{"$f":"IF(Schema!#REF!=\"\",\"\",Schema!#REF!)","v":{"$error":"#REF!"}},{"$f":"IF(Schema!#REF!=\"\",\"\",Schema!#REF!)","v":{"$error":"#REF!"}},{"$f":"IF(Schema!#REF!=\"\",\"\",Schema!#REF!)","v":{"$error":"#REF!"}},{"$f":"IF(Schema!#REF!=\"\",\"\",Schema!#REF!)","v":{"$error":"#REF!"}},{"$f":"IF(Schema!#REF!=\"\",\"\",Schema!#REF!)","v":{"$error":"#REF!"}}]
[{"$f":"Schema!#REF!&Schema!#REF!&Schema!#REF!&Schema!#REF!","v":{"$error":"#REF!"}},{"$error":"#REF!"},{"$f":"IF(A364=\"\",\"\",IF(LEN(Schema!#REF!)=2,1,IF(LEN(Schema!#REF!)=2,10,IF(LEN(Schema!#REF!)=2,100,0))))","v":{"$error":"#REF!"}},{"$error":"#REF!"},{"$f":"IF(A364=\"\",\"\",SUM(Tabel2[[#This Row],[I1]:[I2]]))","v":{"$error":"#REF!"}},{"$error":"#REF!"},{"$error":"#REF!"},{"$error":"#REF!"},{"$error":"#REF!"},{"$f":"IF(C364=\"\",\"\",IF(LEN(Tabel2[[#This Row],[Entiteit of attribuut]])=2,\"\",Tabel2[[#This Row],[Entiteit]]&\"_\"&Tabel2[[#This Row],[Entiteit of attribuut]]))","v":{"$error":"#REF!"}},{"$f":"IF(Schema!#REF!=\"\",\"\",Schema!#REF!)","v":{"$error":"#REF!"}},{"$f":"IF(Schema!#REF!=\"\",\"\",Schema!#REF!)","v":{"$error":"#REF!"}},{"$f":"IF(Schema!#REF!=\"\",\"\",Schema!#REF!)","v":{"$error":"#REF!"}},{"$f":"IF(Schema!#REF!=\"\",\"\",Schema!#REF!)","v":{"$error":"#REF!"}},{"$f":"IF(Schema!#REF!=\"\",\"\",Schema!#REF!)","v":{"$error":"#REF!"}}]
[{"$f":"Schema!#REF!&Schema!#REF!&Schema!#REF!&Schema!#REF!","v":{"$error":"#REF!"}},{"$error":"#REF!"},{"$f":"IF(A365=\"\",\"\",IF(LEN(Schema!#REF!)=2,1,IF(LEN(Schema!#REF!)=2,10,IF(LEN(Schema!#REF!)=2,100,0))))","v":{"$error":"#REF!"}},{"$error":"#REF!"},{"$f":"IF(A365=\"\",\"\",SUM(Tabel2[[#This Row],[I1]:[I2]]))","v":{"$error":"#REF!"}},{"$error":"#REF!"},{"$error":"#REF!"},{"$error":"#REF!"},{"$error":"#REF!"},{"$f":"IF(C365=\"\",\"\",IF(LEN(Tabel2[[#This Row],[Entiteit of attribuut]])=2,\"\",Tabel2[[#This Row],[Entiteit]]&\"_\"&Tabel2[[#This Row],[Entiteit of attribuut]]))","v":{"$error":"#REF!"}},{"$f":"IF(Schema!#REF!=\"\",\"\",Schema!#REF!)","v":{"$error":"#REF!"}},{"$f":"IF(Schema!#REF!=\"\",\"\",Schema!#REF!)","v":{"$error":"#REF!"}},{"$f":"IF(Schema!#REF!=\"\",\"\",Schema!#REF!)","v":{"$error":"#REF!"}},{"$f":"IF(Schema!#REF!=\"\",\"\",Schema!#REF!)","v":{"$error":"#REF!"}},{"$f":"IF(Schema!#REF!=\"\",\"\",Schema!#REF!)","v":{"$error":"#REF!"}}]
[{"$f":"Schema!#REF!&Schema!#REF!&Schema!#REF!&Schema!#REF!","v":{"$error":"#REF!"}},{"$error":"#REF!"},{"$f":"IF(A366=\"\",\"\",IF(LEN(Schema!#REF!)=2,1,IF(LEN(Schema!#REF!)=2,10,IF(LEN(Schema!#REF!)=2,100,0))))","v":{"$error":"#REF!"}},{"$error":"#REF!"},{"$f":"IF(A366=\"\",\"\",SUM(Tabel2[[#This Row],[I1]:[I2]]))","v":{"$error":"#REF!"}},{"$error":"#REF!"},{"$error":"#REF!"},{"$error":"#REF!"},{"$error":"#REF!"},{"$f":"IF(C366=\"\",\"\",IF(LEN(Tabel2[[#This Row],[Entiteit of attribuut]])=2,\"\",Tabel2[[#This Row],[Entiteit]]&\"_\"&Tabel2[[#This Row],[Entiteit of attribuut]]))","v":{"$error":"#REF!"}},{"$f":"IF(Schema!#REF!=\"\",\"\",Schema!#REF!)","v":{"$error":"#REF!"}},{"$f":"IF(Schema!#REF!=\"\",\"\",Schema!#REF!)","v":{"$error":"#REF!"}},{"$f":"IF(Schema!#REF!=\"\",\"\",Schema!#REF!)","v":{"$error":"#REF!"}},{"$f":"IF(Schema!#REF!=\"\",\"\",Schema!#REF!)","v":{"$error":"#REF!"}},{"$f":"IF(Schema!#REF!=\"\",\"\",Schema!#REF!)","v":{"$error":"#REF!"}}]
[{"$f":"Schema!#REF!&Schema!#REF!&Schema!#REF!&Schema!#REF!","v":{"$error":"#REF!"}},{"$error":"#REF!"},{"$f":"IF(A367=\"\",\"\",IF(LEN(Schema!#REF!)=2,1,IF(LEN(Schema!#REF!)=2,10,IF(LEN(Schema!#REF!)=2,100,0))))","v":{"$error":"#REF!"}},{"$error":"#REF!"},{"$f":"IF(A367=\"\",\"\",SUM(Tabel2[[#This Row],[I1]:[I2]]))","v":{"$error":"#REF!"}},{"$error":"#REF!"},{"$error":"#REF!"},{"$error":"#REF!"},{"$error":"#REF!"},{"$f":"IF(C367=\"\",\"\",IF(LEN(Tabel2[[#This Row],[Entiteit of attribuut]])=2,\"\",Tabel2[[#This Row],[Entiteit]]&\"_\"&Tabel2[[#This Row],[Entiteit of attribuut]]))","v":{"$error":"#REF!"}},{"$f":"IF(Schema!#REF!=\"\",\"\",Schema!#REF!)","v":{"$error":"#REF!"}},{"$f":"IF(Schema!#REF!=\"\",\"\",Schema!#REF!)","v":{"$error":"#REF!"}},{"$f":"IF(Schema!#REF!=\"\",\"\",Schema!#REF!)","v":{"$error":"#REF!"}},{"$f":"IF(Schema!#REF!=\"\",\"\",Schema!#REF!)","v":{"$error":"#REF!"}},{"$f":"IF(Schema!#REF!=\"\",\"\",Schema!#REF!)","v":{"$error":"#REF!"}}]
[{"$f":"Schema!#REF!&Schema!#REF!&Schema!#REF!&Schema!#REF!","v":{"$error":"#REF!"}},{"$error":"#REF!"},{"$f":"IF(A368=\"\",\"\",IF(LEN(Schema!#REF!)=2,1,IF(LEN(Schema!#REF!)=2,10,IF(LEN(Schema!#REF!)=2,100,0))))","v":{"$error":"#REF!"}},{"$error":"#REF!"},{"$f":"IF(A368=\"\",\"\",SUM(Tabel2[[#This Row],[I1]:[I2]]))","v":{"$error":"#REF!"}},{"$error":"#REF!"},{"$error":"#REF!"},{"$error":"#REF!"},{"$error":"#REF!"},{"$f":"IF(C368=\"\",\"\",IF(LEN(Tabel2[[#This Row],[Entiteit of attribuut]])=2,\"\",Tabel2[[#This Row],[Entiteit]]&\"_\"&Tabel2[[#This Row],[Entiteit of attribuut]]))","v":{"$error":"#REF!"}},{"$f":"IF(Schema!#REF!=\"\",\"\",Schema!#REF!)","v":{"$error":"#REF!"}},{"$f":"IF(Schema!#REF!=\"\",\"\",Schema!#REF!)","v":{"$error":"#REF!"}},{"$f":"IF(Schema!#REF!=\"\",\"\",Schema!#REF!)","v":{"$error":"#REF!"}},{"$f":"IF(Schema!#REF!=\"\",\"\",Schema!#REF!)","v":{"$error":"#REF!"}},{"$f":"IF(Schema!#REF!=\"\",\"\",Schema!#REF!)","v":{"$error":"#REF!"}}]
[{"$f":"Schema!#REF!&Schema!#REF!&Schema!#REF!&Schema!#REF!","v":{"$error":"#REF!"}},{"$error":"#REF!"},{"$f":"IF(A369=\"\",\"\",IF(LEN(Schema!#REF!)=2,1,IF(LEN(Schema!#REF!)=2,10,IF(LEN(Schema!#REF!)=2,100,0))))","v":{"$error":"#REF!"}},{"$error":"#REF!"},{"$f":"IF(A369=\"\",\"\",SUM(Tabel2[[#This Row],[I1]:[I2]]))","v":{"$error":"#REF!"}},{"$error":"#REF!"},{"$error":"#REF!"},{"$error":"#REF!"},{"$error":"#REF!"},{"$f":"IF(C369=\"\",\"\",IF(LEN(Tabel2[[#This Row],[Entiteit of attribuut]])=2,\"\",Tabel2[[#This Row],[Entiteit]]&\"_\"&Tabel2[[#This Row],[Entiteit of attribuut]]))","v":{"$error":"#REF!"}},{"$f":"IF(Schema!#REF!=\"\",\"\",Schema!#REF!)","v":{"$error":"#REF!"}},{"$f":"IF(Schema!#REF!=\"\",\"\",Schema!#REF!)","v":{"$error":"#REF!"}},{"$f":"IF(Schema!#REF!=\"\",\"\",Schema!#REF!)","v":{"$error":"#REF!"}},{"$f":"IF(Schema!#REF!=\"\",\"\",Schema!#REF!)","v":{"$error":"#REF!"}},{"$f":"IF(Schema!#REF!=\"\",\"\",Schema!#REF!)","v":{"$error":"#REF!"}}]
[{"$f":"Schema!#REF!&Schema!#REF!&Schema!#REF!&Schema!#REF!","v":{"$error":"#REF!"}},{"$error":"#REF!"},{"$f":"IF(A370=\"\",\"\",IF(LEN(Schema!#REF!)=2,1,IF(LEN(Schema!#REF!)=2,10,IF(LEN(Schema!#REF!)=2,100,0))))","v":{"$error":"#REF!"}},{"$error":"#REF!"},{"$f":"IF(A370=\"\",\"\",SUM(Tabel2[[#This Row],[I1]:[I2]]))","v":{"$error":"#REF!"}},{"$error":"#REF!"},{"$error":"#REF!"},{"$error":"#REF!"},{"$error":"#REF!"},{"$f":"IF(C370=\"\",\"\",IF(LEN(Tabel2[[#This Row],[Entiteit of attribuut]])=2,\"\",Tabel2[[#This Row],[Entiteit]]&\"_\"&Tabel2[[#This Row],[Entiteit of attribuut]]))","v":{"$error":"#REF!"}},{"$f":"IF(Schema!#REF!=\"\",\"\",Schema!#REF!)","v":{"$error":"#REF!"}},{"$f":"IF(Schema!#REF!=\"\",\"\",Schema!#REF!)","v":{"$error":"#REF!"}},{"$f":"IF(Schema!#REF!=\"\",\"\",Schema!#REF!)","v":{"$error":"#REF!"}},{"$f":"IF(Schema!#REF!=\"\",\"\",Schema!#REF!)","v":{"$error":"#REF!"}},{"$f":"IF(Schema!#REF!=\"\",\"\",Schema!#REF!)","v":{"$error":"#REF!"}}]
[{"$f":"Schema!#REF!&Schema!#REF!&Schema!#REF!&Schema!#REF!","v":{"$error":"#REF!"}},{"$error":"#REF!"},{"$f":"IF(A371=\"\",\"\",IF(LEN(Schema!#REF!)=2,1,IF(LEN(Schema!#REF!)=2,10,IF(LEN(Schema!#REF!)=2,100,0))))","v":{"$error":"#REF!"}},{"$error":"#REF!"},{"$f":"IF(A371=\"\",\"\",SUM(Tabel2[[#This Row],[I1]:[I2]]))","v":{"$error":"#REF!"}},{"$error":"#REF!"},{"$error":"#REF!"},{"$error":"#REF!"},{"$error":"#REF!"},{"$f":"IF(C371=\"\",\"\",IF(LEN(Tabel2[[#This Row],[Entiteit of attribuut]])=2,\"\",Tabel2[[#This Row],[Entiteit]]&\"_\"&Tabel2[[#This Row],[Entiteit of attribuut]]))","v":{"$error":"#REF!"}},{"$f":"IF(Schema!#REF!=\"\",\"\",Schema!#REF!)","v":{"$error":"#REF!"}},{"$f":"IF(Schema!#REF!=\"\",\"\",Schema!#REF!)","v":{"$error":"#REF!"}},{"$f":"IF(Schema!#REF!=\"\",\"\",Schema!#REF!)","v":{"$error":"#REF!"}},{"$f":"IF(Schema!#REF!=\"\",\"\",Schema!#REF!)","v":{"$error":"#REF!"}},{"$f":"IF(Schema!#REF!=\"\",\"\",Schema!#REF!)","v":{"$error":"#REF!"}}]
[{"$f":"Schema!#REF!&Schema!#REF!&Schema!#REF!&Schema!#REF!","v":{"$error":"#REF!"}},{"$error":"#REF!"},{"$f":"IF(A372=\"\",\"\",IF(LEN(Schema!#REF!)=2,1,IF(LEN(Schema!#REF!)=2,10,IF(LEN(Schema!#REF!)=2,100,0))))","v":{"$error":"#REF!"}},{"$error":"#REF!"},{"$f":"IF(A372=\"\",\"\",SUM(Tabel2[[#This Row],[I1]:[I2]]))","v":{"$error":"#REF!"}},{"$error":"#REF!"},{"$error":"#REF!"},{"$error":"#REF!"},{"$error":"#REF!"},{"$f":"IF(C372=\"\",\"\",IF(LEN(Tabel2[[#This Row],[Entiteit of attribuut]])=2,\"\",Tabel2[[#This Row],[Entiteit]]&\"_\"&Tabel2[[#This Row],[Entiteit of attribuut]]))","v":{"$error":"#REF!"}},{"$f":"IF(Schema!#REF!=\"\",\"\",Schema!#REF!)","v":{"$error":"#REF!"}},{"$f":"IF(Schema!#REF!=\"\",\"\",Schema!#REF!)","v":{"$error":"#REF!"}},{"$f":"IF(Schema!#REF!=\"\",\"\",Schema!#REF!)","v":{"$error":"#REF!"}},{"$f":"IF(Schema!#REF!=\"\",\"\",Schema!#REF!)","v":{"$error":"#REF!"}},{"$f":"IF(Schema!#REF!=\"\",\"\",Schema!#REF!)","v":{"$error":"#REF!"}}]
[{"$f":"Schema!#REF!&Schema!#REF!&Schema!#REF!&Schema!#REF!","v":{"$error":"#REF!"}},{"$error":"#REF!"},{"$f":"IF(A373=\"\",\"\",IF(LEN(Schema!#REF!)=2,1,IF(LEN(Schema!#REF!)=2,10,IF(LEN(Schema!#REF!)=2,100,0))))","v":{"$error":"#REF!"}},{"$error":"#REF!"},{"$f":"IF(A373=\"\",\"\",SUM(Tabel2[[#This Row],[I1]:[I2]]))","v":{"$error":"#REF!"}},{"$error":"#REF!"},{"$error":"#REF!"},{"$error":"#REF!"},{"$error":"#REF!"},{"$f":"IF(C373=\"\",\"\",IF(LEN(Tabel2[[#This Row],[Entiteit of attribuut]])=2,\"\",Tabel2[[#This Row],[Entiteit]]&\"_\"&Tabel2[[#This Row],[Entiteit of attribuut]]))","v":{"$error":"#REF!"}},{"$f":"IF(Schema!#REF!=\"\",\"\",Schema!#REF!)","v":{"$error":"#REF!"}},{"$f":"IF(Schema!#REF!=\"\",\"\",Schema!#REF!)","v":{"$error":"#REF!"}},{"$f":"IF(Schema!#REF!=\"\",\"\",Schema!#REF!)","v":{"$error":"#REF!"}},{"$f":"IF(Schema!#REF!=\"\",\"\",Schema!#REF!)","v":{"$error":"#REF!"}},{"$f":"IF(Schema!#REF!=\"\",\"\",Schema!#REF!)","v":{"$error":"#REF!"}}]
[{"$f":"Schema!#REF!&Schema!#REF!&Schema!#REF!&Schema!#REF!","v":{"$error":"#REF!"}},{"$error":"#REF!"},{"$f":"IF(A374=\"\",\"\",IF(LEN(Schema!#REF!)=2,1,IF(LEN(Schema!#REF!)=2,10,IF(LEN(Schema!#REF!)=2,100,0))))","v":{"$error":"#REF!"}},{"$error":"#REF!"},{"$f":"IF(A374=\"\",\"\",SUM(Tabel2[[#This Row],[I1]:[I2]]))","v":{"$error":"#REF!"}},{"$error":"#REF!"},{"$error":"#REF!"},{"$error":"#REF!"},{"$error":"#REF!"},{"$f":"IF(C374=\"\",\"\",IF(LEN(Tabel2[[#This Row],[Entiteit of attribuut]])=2,\"\",Tabel2[[#This Row],[Entiteit]]&\"_\"&Tabel2[[#This Row],[Entiteit of attribuut]]))","v":{"$error":"#REF!"}},{"$f":"IF(Schema!#REF!=\"\",\"\",Schema!#REF!)","v":{"$error":"#REF!"}},{"$f":"IF(Schema!#REF!=\"\",\"\",Schema!#REF!)","v":{"$error":"#REF!"}},{"$f":"IF(Schema!#REF!=\"\",\"\",Schema!#REF!)","v":{"$error":"#REF!"}},{"$f":"IF(Schema!#REF!=\"\",\"\",Schema!#REF!)","v":{"$error":"#REF!"}},{"$f":"IF(Schema!#REF!=\"\",\"\",Schema!#REF!)","v":{"$error":"#REF!"}}]
[{"$f":"Schema!#REF!&Schema!#REF!&Schema!#REF!&Schema!#REF!","v":{"$error":"#REF!"}},{"$error":"#REF!"},{"$f":"IF(A375=\"\",\"\",IF(LEN(Schema!#REF!)=2,1,IF(LEN(Schema!#REF!)=2,10,IF(LEN(Schema!#REF!)=2,100,0))))","v":{"$error":"#REF!"}},{"$error":"#REF!"},{"$f":"IF(A375=\"\",\"\",SUM(Tabel2[[#This Row],[I1]:[I2]]))","v":{"$error":"#REF!"}},{"$error":"#REF!"},{"$error":"#REF!"},{"$error":"#REF!"},{"$error":"#REF!"},{"$f":"IF(C375=\"\",\"\",IF(LEN(Tabel2[[#This Row],[Entiteit of attribuut]])=2,\"\",Tabel2[[#This Row],[Entiteit]]&\"_\"&Tabel2[[#This Row],[Entiteit of attribuut]]))","v":{"$error":"#REF!"}},{"$f":"IF(Schema!#REF!=\"\",\"\",Schema!#REF!)","v":{"$error":"#REF!"}},{"$f":"IF(Schema!#REF!=\"\",\"\",Schema!#REF!)","v":{"$error":"#REF!"}},{"$f":"IF(Schema!#REF!=\"\",\"\",Schema!#REF!)","v":{"$error":"#REF!"}},{"$f":"IF(Schema!#REF!=\"\",\"\",Schema!#REF!)","v":{"$error":"#REF!"}},{"$f":"IF(Schema!#REF!=\"\",\"\",Schema!#REF!)","v":{"$error":"#REF!"}}]
[{"$f":"Schema!#REF!&Schema!#REF!&Schema!#REF!&Schema!#REF!","v":{"$error":"#REF!"}},{"$error":"#REF!"},{"$f":"IF(A376=\"\",\"\",IF(LEN(Schema!#REF!)=2,1,IF(LEN(Schema!#REF!)=2,10,IF(LEN(Schema!#REF!)=2,100,0))))","v":{"$error":"#REF!"}},{"$error":"#REF!"},{"$f":"IF(A376=\"\",\"\",SUM(Tabel2[[#This Row],[I1]:[I2]]))","v":{"$error":"#REF!"}},{"$error":"#REF!"},{"$error":"#REF!"},{"$error":"#REF!"},{"$error":"#REF!"},{"$f":"IF(C376=\"\",\"\",IF(LEN(Tabel2[[#This Row],[Entiteit of attribuut]])=2,\"\",Tabel2[[#This Row],[Entiteit]]&\"_\"&Tabel2[[#This Row],[Entiteit of attribuut]]))","v":{"$error":"#REF!"}},{"$f":"IF(Schema!#REF!=\"\",\"\",Schema!#REF!)","v":{"$error":"#REF!"}},{"$f":"IF(Schema!#REF!=\"\",\"\",Schema!#REF!)","v":{"$error":"#REF!"}},{"$f":"IF(Schema!#REF!=\"\",\"\",Schema!#REF!)","v":{"$error":"#REF!"}},{"$f":"IF(Schema!#REF!=\"\",\"\",Schema!#REF!)","v":{"$error":"#REF!"}},{"$f":"IF(Schema!#REF!=\"\",\"\",Schema!#REF!)","v":{"$error":"#REF!"}}]
[{"$f":"Schema!#REF!&Schema!#REF!&Schema!#REF!&Schema!#REF!","v":{"$error":"#REF!"}},{"$error":"#REF!"},{"$f":"IF(A377=\"\",\"\",IF(LEN(Schema!#REF!)=2,1,IF(LEN(Schema!#REF!)=2,10,IF(LEN(Schema!#REF!)=2,100,0))))","v":{"$error":"#REF!"}},{"$error":"#REF!"},{"$f":"IF(A377=\"\",\"\",SUM(Tabel2[[#This Row],[I1]:[I2]]))","v":{"$error":"#REF!"}},{"$error":"#REF!"},{"$error":"#REF!"},{"$error":"#REF!"},{"$error":"#REF!"},{"$f":"IF(C377=\"\",\"\",IF(LEN(Tabel2[[#This Row],[Entiteit of attribuut]])=2,\"\",Tabel2[[#This Row],[Entiteit]]&\"_\"&Tabel2[[#This Row],[Entiteit of attribuut]]))","v":{"$error":"#REF!"}},{"$f":"IF(Schema!#REF!=\"\",\"\",Schema!#REF!)","v":{"$error":"#REF!"}},{"$f":"IF(Schema!#REF!=\"\",\"\",Schema!#REF!)","v":{"$error":"#REF!"}},{"$f":"IF(Schema!#REF!=\"\",\"\",Schema!#REF!)","v":{"$error":"#REF!"}},{"$f":"IF(Schema!#REF!=\"\",\"\",Schema!#REF!)","v":{"$error":"#REF!"}},{"$f":"IF(Schema!#REF!=\"\",\"\",Schema!#REF!)","v":{"$error":"#REF!"}}]
[{"$f":"Schema!#REF!&Schema!#REF!&Schema!#REF!&Schema!#REF!","v":{"$error":"#REF!"}},{"$error":"#REF!"},{"$f":"IF(A378=\"\",\"\",IF(LEN(Schema!#REF!)=2,1,IF(LEN(Schema!#REF!)=2,10,IF(LEN(Schema!#REF!)=2,100,0))))","v":{"$error":"#REF!"}},{"$error":"#REF!"},{"$f":"IF(A378=\"\",\"\",SUM(Tabel2[[#This Row],[I1]:[I2]]))","v":{"$error":"#REF!"}},{"$error":"#REF!"},{"$error":"#REF!"},{"$error":"#REF!"},{"$error":"#REF!"},{"$f":"IF(C378=\"\",\"\",IF(LEN(Tabel2[[#This Row],[Entiteit of attribuut]])=2,\"\",Tabel2[[#This Row],[Entiteit]]&\"_\"&Tabel2[[#This Row],[Entiteit of attribuut]]))","v":{"$error":"#REF!"}},{"$f":"IF(Schema!#REF!=\"\",\"\",Schema!#REF!)","v":{"$error":"#REF!"}},{"$f":"IF(Schema!#REF!=\"\",\"\",Schema!#REF!)","v":{"$error":"#REF!"}},{"$f":"IF(Schema!#REF!=\"\",\"\",Schema!#REF!)","v":{"$error":"#REF!"}},{"$f":"IF(Schema!#REF!=\"\",\"\",Schema!#REF!)","v":{"$error":"#REF!"}},{"$f":"IF(Schema!#REF!=\"\",\"\",Schema!#REF!)","v":{"$error":"#REF!"}}]
[{"$f":"Schema!#REF!&Schema!#REF!&Schema!#REF!&Schema!#REF!","v":{"$error":"#REF!"}},{"$error":"#REF!"},{"$f":"IF(A379=\"\",\"\",IF(LEN(Schema!#REF!)=2,1,IF(LEN(Schema!#REF!)=2,10,IF(LEN(Schema!#REF!)=2,100,0))))","v":{"$error":"#REF!"}},{"$error":"#REF!"},{"$f":"IF(A379=\"\",\"\",SUM(Tabel2[[#This Row],[I1]:[I2]]))","v":{"$error":"#REF!"}},{"$error":"#REF!"},{"$error":"#REF!"},{"$error":"#REF!"},{"$error":"#REF!"},{"$f":"IF(C379=\"\",\"\",IF(LEN(Tabel2[[#This Row],[Entiteit of attribuut]])=2,\"\",Tabel2[[#This Row],[Entiteit]]&\"_\"&Tabel2[[#This Row],[Entiteit of attribuut]]))","v":{"$error":"#REF!"}},{"$f":"IF(Schema!#REF!=\"\",\"\",Schema!#REF!)","v":{"$error":"#REF!"}},{"$f":"IF(Schema!#REF!=\"\",\"\",Schema!#REF!)","v":{"$error":"#REF!"}},{"$f":"IF(Schema!#REF!=\"\",\"\",Schema!#REF!)","v":{"$error":"#REF!"}},{"$f":"IF(Schema!#REF!=\"\",\"\",Schema!#REF!)","v":{"$error":"#REF!"}},{"$f":"IF(Schema!#REF!=\"\",\"\",Schema!#REF!)","v":{"$error":"#REF!"}}]
[{"$f":"Schema!#REF!&Schema!#REF!&Schema!#REF!&Schema!#REF!","v":{"$error":"#REF!"}},{"$error":"#REF!"},{"$f":"IF(A380=\"\",\"\",IF(LEN(Schema!#REF!)=2,1,IF(LEN(Schema!#REF!)=2,10,IF(LEN(Schema!#REF!)=2,100,0))))","v":{"$error":"#REF!"}},{"$error":"#REF!"},{"$f":"IF(A380=\"\",\"\",SUM(Tabel2[[#This Row],[I1]:[I2]]))","v":{"$error":"#REF!"}},{"$error":"#REF!"},{"$error":"#REF!"},{"$error":"#REF!"},{"$error":"#REF!"},{"$f":"IF(C380=\"\",\"\",IF(LEN(Tabel2[[#This Row],[Entiteit of attribuut]])=2,\"\",Tabel2[[#This Row],[Entiteit]]&\"_\"&Tabel2[[#This Row],[Entiteit of attribuut]]))","v":{"$error":"#REF!"}},{"$f":"IF(Schema!#REF!=\"\",\"\",Schema!#REF!)","v":{"$error":"#REF!"}},{"$f":"IF(Schema!#REF!=\"\",\"\",Schema!#REF!)","v":{"$error":"#REF!"}},{"$f":"IF(Schema!#REF!=\"\",\"\",Schema!#REF!)","v":{"$error":"#REF!"}},{"$f":"IF(Schema!#REF!=\"\",\"\",Schema!#REF!)","v":{"$error":"#REF!"}},{"$f":"IF(Schema!#REF!=\"\",\"\",Schema!#REF!)","v":{"$error":"#REF!"}}]
[{"$f":"Schema!#REF!&Schema!#REF!&Schema!#REF!&Schema!#REF!","v":{"$error":"#REF!"}},{"$error":"#REF!"},{"$f":"IF(A381=\"\",\"\",IF(LEN(Schema!#REF!)=2,1,IF(LEN(Schema!#REF!)=2,10,IF(LEN(Schema!#REF!)=2,100,0))))","v":{"$error":"#REF!"}},{"$error":"#REF!"},{"$f":"IF(A381=\"\",\"\",SUM(Tabel2[[#This Row],[I1]:[I2]]))","v":{"$error":"#REF!"}},{"$error":"#REF!"},{"$error":"#REF!"},{"$error":"#REF!"},{"$error":"#REF!"},{"$f":"IF(C381=\"\",\"\",IF(LEN(Tabel2[[#This Row],[Entiteit of attribuut]])=2,\"\",Tabel2[[#This Row],[Entiteit]]&\"_\"&Tabel2[[#This Row],[Entiteit of attribuut]]))","v":{"$error":"#REF!"}},{"$f":"IF(Schema!#REF!=\"\",\"\",Schema!#REF!)","v":{"$error":"#REF!"}},{"$f":"IF(Schema!#REF!=\"\",\"\",Schema!#REF!)","v":{"$error":"#REF!"}},{"$f":"IF(Schema!#REF!=\"\",\"\",Schema!#REF!)","v":{"$error":"#REF!"}},{"$f":"IF(Schema!#REF!=\"\",\"\",Schema!#REF!)","v":{"$error":"#REF!"}},{"$f":"IF(Schema!#REF!=\"\",\"\",Schema!#REF!)","v":{"$error":"#REF!"}}]
[{"$f":"Schema!#REF!&Schema!#REF!&Schema!#REF!&Schema!#REF!","v":{"$error":"#REF!"}},{"$error":"#REF!"},{"$f":"IF(A382=\"\",\"\",IF(LEN(Schema!#REF!)=2,1,IF(LEN(Schema!#REF!)=2,10,IF(LEN(Schema!#REF!)=2,100,0))))","v":{"$error":"#REF!"}},{"$error":"#REF!"},{"$f":"IF(A382=\"\",\"\",SUM(Tabel2[[#This Row],[I1]:[I2]]))","v":{"$error":"#REF!"}},{"$error":"#REF!"},{"$error":"#REF!"},{"$error":"#REF!"},{"$error":"#REF!"},{"$f":"IF(C382=\"\",\"\",IF(LEN(Tabel2[[#This Row],[Entiteit of attribuut]])=2,\"\",Tabel2[[#This Row],[Entiteit]]&\"_\"&Tabel2[[#This Row],[Entiteit of attribuut]]))","v":{"$error":"#REF!"}},{"$f":"IF(Schema!#REF!=\"\",\"\",Schema!#REF!)","v":{"$error":"#REF!"}},{"$f":"IF(Schema!#REF!=\"\",\"\",Schema!#REF!)","v":{"$error":"#REF!"}},{"$f":"IF(Schema!#REF!=\"\",\"\",Schema!#REF!)","v":{"$error":"#REF!"}},{"$f":"IF(Schema!#REF!=\"\",\"\",Schema!#REF!)","v":{"$error":"#REF!"}},{"$f":"IF(Schema!#REF!=\"\",\"\",Schema!#REF!)","v":{"$error":"#REF!"}}]
[{"$f":"Schema!#REF!&Schema!#REF!&Schema!#REF!&Schema!#REF!","v":{"$error":"#REF!"}},{"$error":"#REF!"},{"$f":"IF(A383=\"\",\"\",IF(LEN(Schema!#REF!)=2,1,IF(LEN(Schema!#REF!)=2,10,IF(LEN(Schema!#REF!)=2,100,0))))","v":{"$error":"#REF!"}},{"$error":"#REF!"},{"$f":"IF(A383=\"\",\"\",SUM(Tabel2[[#This Row],[I1]:[I2]]))","v":{"$error":"#REF!"}},{"$error":"#REF!"},{"$error":"#REF!"},{"$error":"#REF!"},{"$error":"#REF!"},{"$f":"IF(C383=\"\",\"\",IF(LEN(Tabel2[[#This Row],[Entiteit of attribuut]])=2,\"\",Tabel2[[#This Row],[Entiteit]]&\"_\"&Tabel2[[#This Row],[Entiteit of attribuut]]))","v":{"$error":"#REF!"}},{"$f":"IF(Schema!#REF!=\"\",\"\",Schema!#REF!)","v":{"$error":"#REF!"}},{"$f":"IF(Schema!#REF!=\"\",\"\",Schema!#REF!)","v":{"$error":"#REF!"}},{"$f":"IF(Schema!#REF!=\"\",\"\",Schema!#REF!)","v":{"$error":"#REF!"}},{"$f":"IF(Schema!#REF!=\"\",\"\",Schema!#REF!)","v":{"$error":"#REF!"}},{"$f":"IF(Schema!#REF!=\"\",\"\",Schema!#REF!)","v":{"$error":"#REF!"}}]
[{"$f":"Schema!#REF!&Schema!#REF!&Schema!#REF!&Schema!#REF!","v":{"$error":"#REF!"}},{"$error":"#REF!"},{"$f":"IF(A384=\"\",\"\",IF(LEN(Schema!#REF!)=2,1,IF(LEN(Schema!#REF!)=2,10,IF(LEN(Schema!#REF!)=2,100,0))))","v":{"$error":"#REF!"}},{"$error":"#REF!"},{"$f":"IF(A384=\"\",\"\",SUM(Tabel2[[#This Row],[I1]:[I2]]))","v":{"$error":"#REF!"}},{"$error":"#REF!"},{"$error":"#REF!"},{"$error":"#REF!"},{"$error":"#REF!"},{"$f":"IF(C384=\"\",\"\",IF(LEN(Tabel2[[#This Row],[Entiteit of attribuut]])=2,\"\",Tabel2[[#This Row],[Entiteit]]&\"_\"&Tabel2[[#This Row],[Entiteit of attribuut]]))","v":{"$error":"#REF!"}},{"$f":"IF(Schema!#REF!=\"\",\"\",Schema!#REF!)","v":{"$error":"#REF!"}},{"$f":"IF(Schema!#REF!=\"\",\"\",Schema!#REF!)","v":{"$error":"#REF!"}},{"$f":"IF(Schema!#REF!=\"\",\"\",Schema!#REF!)","v":{"$error":"#REF!"}},{"$f":"IF(Schema!#REF!=\"\",\"\",Schema!#REF!)","v":{"$error":"#REF!"}},{"$f":"IF(Schema!#REF!=\"\",\"\",Schema!#REF!)","v":{"$error":"#REF!"}}]
[{"$f":"Schema!#REF!&Schema!#REF!&Schema!#REF!&Schema!#REF!","v":{"$error":"#REF!"}},{"$error":"#REF!"},{"$f":"IF(A385=\"\",\"\",IF(LEN(Schema!#REF!)=2,1,IF(LEN(Schema!#REF!)=2,10,IF(LEN(Schema!#REF!)=2,100,0))))","v":{"$error":"#REF!"}},{"$error":"#REF!"},{"$f":"IF(A385=\"\",\"\",SUM(Tabel2[[#This Row],[I1]:[I2]]))","v":{"$error":"#REF!"}},{"$error":"#REF!"},{"$error":"#REF!"},{"$error":"#REF!"},{"$error":"#REF!"},{"$f":"IF(C385=\"\",\"\",IF(LEN(Tabel2[[#This Row],[Entiteit of attribuut]])=2,\"\",Tabel2[[#This Row],[Entiteit]]&\"_\"&Tabel2[[#This Row],[Entiteit of attribuut]]))","v":{"$error":"#REF!"}},{"$f":"IF(Schema!#REF!=\"\",\"\",Schema!#REF!)","v":{"$error":"#REF!"}},{"$f":"IF(Schema!#REF!=\"\",\"\",Schema!#REF!)","v":{"$error":"#REF!"}},{"$f":"IF(Schema!#REF!=\"\",\"\",Schema!#REF!)","v":{"$error":"#REF!"}},{"$f":"IF(Schema!#REF!=\"\",\"\",Schema!#REF!)","v":{"$error":"#REF!"}},{"$f":"IF(Schema!#REF!=\"\",\"\",Schema!#REF!)","v":{"$error":"#REF!"}}]
[{"$f":"Schema!#REF!&Schema!#REF!&Schema!#REF!&Schema!#REF!","v":{"$error":"#REF!"}},{"$error":"#REF!"},{"$f":"IF(A386=\"\",\"\",IF(LEN(Schema!#REF!)=2,1,IF(LEN(Schema!#REF!)=2,10,IF(LEN(Schema!#REF!)=2,100,0))))","v":{"$error":"#REF!"}},{"$error":"#REF!"},{"$f":"IF(A386=\"\",\"\",SUM(Tabel2[[#This Row],[I1]:[I2]]))","v":{"$error":"#REF!"}},{"$error":"#REF!"},{"$error":"#REF!"},{"$error":"#REF!"},{"$error":"#REF!"},{"$f":"IF(C386=\"\",\"\",IF(LEN(Tabel2[[#This Row],[Entiteit of attribuut]])=2,\"\",Tabel2[[#This Row],[Entiteit]]&\"_\"&Tabel2[[#This Row],[Entiteit of attribuut]]))","v":{"$error":"#REF!"}},{"$f":"IF(Schema!#REF!=\"\",\"\",Schema!#REF!)","v":{"$error":"#REF!"}},{"$f":"IF(Schema!#REF!=\"\",\"\",Schema!#REF!)","v":{"$error":"#REF!"}},{"$f":"IF(Schema!#REF!=\"\",\"\",Schema!#REF!)","v":{"$error":"#REF!"}},{"$f":"IF(Schema!#REF!=\"\",\"\",Schema!#REF!)","v":{"$error":"#REF!"}},{"$f":"IF(Schema!#REF!=\"\",\"\",Schema!#REF!)","v":{"$error":"#REF!"}}]
[{"$f":"Schema!#REF!&Schema!#REF!&Schema!#REF!&Schema!#REF!","v":{"$error":"#REF!"}},{"$f":"IF(LEN(A387)=2,A387,IF(A387=\"\",\"Leeg\",B386))","v":{"$error":"#REF!"}},{"$f":"IF(A387=\"\",\"\",IF(LEN(Schema!#REF!)=2,1,IF(LEN(Schema!#REF!)=2,10,IF(LEN(Schema!#REF!)=2,100,0))))","v":{"$error":"#REF!"}},{"$f":"IF(C387=0,D386,C387)","v":{"$error":"#REF!"}},{"$f":"IF(A387=\"\",\"\",SUM(Tabel2[[#This Row],[I1]:[I2]]))","v":{"$error":"#REF!"}},{"$f":"IF(A387=\"\",\"\",IF(C387=1,B387,F386))","v":{"$error":"#REF!"}},{"$f":"IF(C387=10,A387,IF(OR(C387=0,C387=100),G386,\"\"))","v":{"$error":"#REF!"}},{"$f":"IF(E387=200,B387,IF(C387=0,H386,\"\"))","v":{"$error":"#REF!"}},{"$f":"IF(C387=\"\",\"\",IF(OR(E387=1,E387=10,E387=100),I386,IF(E387=2,F387,IF(E387=20,F387&\"/\"&G387,IF(E387=200,F387&\"/\"&G387&\"/\"&H387)))))","v":{"$error":"#REF!"}},{"$f":"IF(C387=\"\",\"\",IF(LEN(Tabel2[[#This Row],[Entiteit of attribuut]])=2,\"\",Tabel2[[#This Row],[Entiteit]]&\"_\"&Tabel2[[#This Row],[Entiteit of attribuut]]))","v":{"$error":"#REF!"}},{"$f":"IF(Schema!#REF!=\"\",\"\",Schema!#REF!)","v":{"$error":"#REF!"}},{"$f":"IF(Schema!#REF!=\"\",\"\",Schema!#REF!)","v":{"$error":"#REF!"}},{"$f":"IF(Schema!#REF!=\"\",\"\",Schema!#REF!)","v":{"$error":"#REF!"}},{"$f":"IF(Schema!#REF!=\"\",\"\",Schema!#REF!)","v":{"$error":"#REF!"}},{"$f":"IF(Schema!#REF!=\"\",\"\",Schema!#REF!)","v":{"$error":"#REF!"}}]
[{"$f":"Schema!#REF!&Schema!#REF!&Schema!#REF!&Schema!#REF!","v":{"$error":"#REF!"}},{"$error":"#REF!"},{"$f":"IF(A388=\"\",\"\",IF(LEN(Schema!#REF!)=2,1,IF(LEN(Schema!#REF!)=2,10,IF(LEN(Schema!#REF!)=2,100,0))))","v":{"$error":"#REF!"}},{"$error":"#REF!"},{"$f":"IF(A388=\"\",\"\",SUM(Tabel2[[#This Row],[I1]:[I2]]))","v":{"$error":"#REF!"}},{"$error":"#REF!"},{"$error":"#REF!"},{"$error":"#REF!"},{"$error":"#REF!"},{"$f":"IF(C388=\"\",\"\",IF(LEN(Tabel2[[#This Row],[Entiteit of attribuut]])=2,\"\",Tabel2[[#This Row],[Entiteit]]&\"_\"&Tabel2[[#This Row],[Entiteit of attribuut]]))","v":{"$error":"#REF!"}},{"$f":"IF(Schema!#REF!=\"\",\"\",Schema!#REF!)","v":{"$error":"#REF!"}},{"$f":"IF(Schema!#REF!=\"\",\"\",Schema!#REF!)","v":{"$error":"#REF!"}},{"$f":"IF(Schema!#REF!=\"\",\"\",Schema!#REF!)","v":{"$error":"#REF!"}},{"$f":"IF(Schema!#REF!=\"\",\"\",Schema!#REF!)","v":{"$error":"#REF!"}},{"$f":"IF(Schema!#REF!=\"\",\"\",Schema!#REF!)","v":{"$error":"#REF!"}}]
[{"$f":"Schema!#REF!&Schema!#REF!&Schema!#REF!&Schema!#REF!","v":{"$error":"#REF!"}},{"$error":"#REF!"},{"$f":"IF(A389=\"\",\"\",IF(LEN(Schema!#REF!)=2,1,IF(LEN(Schema!#REF!)=2,10,IF(LEN(Schema!#REF!)=2,100,0))))","v":{"$error":"#REF!"}},{"$error":"#REF!"},{"$f":"IF(A389=\"\",\"\",SUM(Tabel2[[#This Row],[I1]:[I2]]))","v":{"$error":"#REF!"}},{"$error":"#REF!"},{"$error":"#REF!"},{"$error":"#REF!"},{"$error":"#REF!"},{"$f":"IF(C389=\"\",\"\",IF(LEN(Tabel2[[#This Row],[Entiteit of attribuut]])=2,\"\",Tabel2[[#This Row],[Entiteit]]&\"_\"&Tabel2[[#This Row],[Entiteit of attribuut]]))","v":{"$error":"#REF!"}},{"$f":"IF(Schema!#REF!=\"\",\"\",Schema!#REF!)","v":{"$error":"#REF!"}},{"$f":"IF(Schema!#REF!=\"\",\"\",Schema!#REF!)","v":{"$error":"#REF!"}},{"$f":"IF(Schema!#REF!=\"\",\"\",Schema!#REF!)","v":{"$error":"#REF!"}},{"$f":"IF(Schema!#REF!=\"\",\"\",Schema!#REF!)","v":{"$error":"#REF!"}},{"$f":"IF(Schema!#REF!=\"\",\"\",Schema!#REF!)","v":{"$error":"#REF!"}}]
[{"$f":"Schema!#REF!&Schema!#REF!&Schema!#REF!&Schema!#REF!","v":{"$error":"#REF!"}},{"$error":"#REF!"},{"$f":"IF(A390=\"\",\"\",IF(LEN(Schema!#REF!)=2,1,IF(LEN(Schema!#REF!)=2,10,IF(LEN(Schema!#REF!)=2,100,0))))","v":{"$error":"#REF!"}},{"$error":"#REF!"},{"$f":"IF(A390=\"\",\"\",SUM(Tabel2[[#This Row],[I1]:[I2]]))","v":{"$error":"#REF!"}},{"$error":"#REF!"},{"$error":"#REF!"},{"$error":"#REF!"},{"$error":"#REF!"},{"$f":"IF(C390=\"\",\"\",IF(LEN(Tabel2[[#This Row],[Entiteit of attribuut]])=2,\"\",Tabel2[[#This Row],[Entiteit]]&\"_\"&Tabel2[[#This Row],[Entiteit of attribuut]]))","v":{"$error":"#REF!"}},{"$f":"IF(Schema!#REF!=\"\",\"\",Schema!#REF!)","v":{"$error":"#REF!"}},{"$f":"IF(Schema!#REF!=\"\",\"\",Schema!#REF!)","v":{"$error":"#REF!"}},{"$f":"IF(Schema!#REF!=\"\",\"\",Schema!#REF!)","v":{"$error":"#REF!"}},{"$f":"IF(Schema!#REF!=\"\",\"\",Schema!#REF!)","v":{"$error":"#REF!"}},{"$f":"IF(Schema!#REF!=\"\",\"\",Schema!#REF!)","v":{"$error":"#REF!"}}]
[{"$f":"Schema!#REF!&Schema!#REF!&Schema!#REF!&Schema!#REF!","v":{"$error":"#REF!"}},{"$error":"#REF!"},{"$f":"IF(A391=\"\",\"\",IF(LEN(Schema!#REF!)=2,1,IF(LEN(Schema!#REF!)=2,10,IF(LEN(Schema!#REF!)=2,100,0))))","v":{"$error":"#REF!"}},{"$error":"#REF!"},{"$f":"IF(A391=\"\",\"\",SUM(Tabel2[[#This Row],[I1]:[I2]]))","v":{"$error":"#REF!"}},{"$error":"#REF!"},{"$error":"#REF!"},{"$error":"#REF!"},{"$error":"#REF!"},{"$f":"IF(C391=\"\",\"\",IF(LEN(Tabel2[[#This Row],[Entiteit of attribuut]])=2,\"\",Tabel2[[#This Row],[Entiteit]]&\"_\"&Tabel2[[#This Row],[Entiteit of attribuut]]))","v":{"$error":"#REF!"}},{"$f":"IF(Schema!#REF!=\"\",\"\",Schema!#REF!)","v":{"$error":"#REF!"}},{"$f":"IF(Schema!#REF!=\"\",\"\",Schema!#REF!)","v":{"$error":"#REF!"}},{"$f":"IF(Schema!#REF!=\"\",\"\",Schema!#REF!)","v":{"$error":"#REF!"}},{"$f":"IF(Schema!#REF!=\"\",\"\",Schema!#REF!)","v":{"$error":"#REF!"}},{"$f":"IF(Schema!#REF!=\"\",\"\",Schema!#REF!)","v":{"$error":"#REF!"}}]
[{"$f":"Schema!#REF!&Schema!#REF!&Schema!#REF!&Schema!#REF!","v":{"$error":"#REF!"}},{"$error":"#REF!"},{"$f":"IF(A392=\"\",\"\",IF(LEN(Schema!#REF!)=2,1,IF(LEN(Schema!#REF!)=2,10,IF(LEN(Schema!#REF!)=2,100,0))))","v":{"$error":"#REF!"}},{"$error":"#REF!"},{"$f":"IF(A392=\"\",\"\",SUM(Tabel2[[#This Row],[I1]:[I2]]))","v":{"$error":"#REF!"}},{"$error":"#REF!"},{"$error":"#REF!"},{"$error":"#REF!"},{"$error":"#REF!"},{"$f":"IF(C392=\"\",\"\",IF(LEN(Tabel2[[#This Row],[Entiteit of attribuut]])=2,\"\",Tabel2[[#This Row],[Entiteit]]&\"_\"&Tabel2[[#This Row],[Entiteit of attribuut]]))","v":{"$error":"#REF!"}},{"$f":"IF(Schema!#REF!=\"\",\"\",Schema!#REF!)","v":{"$error":"#REF!"}},{"$f":"IF(Schema!#REF!=\"\",\"\",Schema!#REF!)","v":{"$error":"#REF!"}},{"$f":"IF(Schema!#REF!=\"\",\"\",Schema!#REF!)","v":{"$error":"#REF!"}},{"$f":"IF(Schema!#REF!=\"\",\"\",Schema!#REF!)","v":{"$error":"#REF!"}},{"$f":"IF(Schema!#REF!=\"\",\"\",Schema!#REF!)","v":{"$error":"#REF!"}}]
[{"$f":"Schema!#REF!&Schema!#REF!&Schema!#REF!&Schema!#REF!","v":{"$error":"#REF!"}},{"$error":"#REF!"},{"$f":"IF(A393=\"\",\"\",IF(LEN(Schema!#REF!)=2,1,IF(LEN(Schema!#REF!)=2,10,IF(LEN(Schema!#REF!)=2,100,0))))","v":{"$error":"#REF!"}},{"$error":"#REF!"},{"$f":"IF(A393=\"\",\"\",SUM(Tabel2[[#This Row],[I1]:[I2]]))","v":{"$error":"#REF!"}},{"$error":"#REF!"},{"$error":"#REF!"},{"$error":"#REF!"},{"$error":"#REF!"},{"$f":"IF(C393=\"\",\"\",IF(LEN(Tabel2[[#This Row],[Entiteit of attribuut]])=2,\"\",Tabel2[[#This Row],[Entiteit]]&\"_\"&Tabel2[[#This Row],[Entiteit of attribuut]]))","v":{"$error":"#REF!"}},{"$f":"IF(Schema!#REF!=\"\",\"\",Schema!#REF!)","v":{"$error":"#REF!"}},{"$f":"IF(Schema!#REF!=\"\",\"\",Schema!#REF!)","v":{"$error":"#REF!"}},{"$f":"IF(Schema!#REF!=\"\",\"\",Schema!#REF!)","v":{"$error":"#REF!"}},{"$f":"IF(Schema!#REF!=\"\",\"\",Schema!#REF!)","v":{"$error":"#REF!"}},{"$f":"IF(Schema!#REF!=\"\",\"\",Schema!#REF!)","v":{"$error":"#REF!"}}]
[{"$f":"Schema!#REF!&Schema!#REF!&Schema!#REF!&Schema!#REF!","v":{"$error":"#REF!"}},{"$error":"#REF!"},{"$f":"IF(A394=\"\",\"\",IF(LEN(Schema!#REF!)=2,1,IF(LEN(Schema!#REF!)=2,10,IF(LEN(Schema!#REF!)=2,100,0))))","v":{"$error":"#REF!"}},{"$error":"#REF!"},{"$f":"IF(A394=\"\",\"\",SUM(Tabel2[[#This Row],[I1]:[I2]]))","v":{"$error":"#REF!"}},{"$error":"#REF!"},{"$error":"#REF!"},{"$error":"#REF!"},{"$error":"#REF!"},{"$f":"IF(C394=\"\",\"\",IF(LEN(Tabel2[[#This Row],[Entiteit of attribuut]])=2,\"\",Tabel2[[#This Row],[Entiteit]]&\"_\"&Tabel2[[#This Row],[Entiteit of attribuut]]))","v":{"$error":"#REF!"}},{"$f":"IF(Schema!#REF!=\"\",\"\",Schema!#REF!)","v":{"$error":"#REF!"}},{"$f":"IF(Schema!#REF!=\"\",\"\",Schema!#REF!)","v":{"$error":"#REF!"}},{"$f":"IF(Schema!#REF!=\"\",\"\",Schema!#REF!)","v":{"$error":"#REF!"}},{"$f":"IF(Schema!#REF!=\"\",\"\",Schema!#REF!)","v":{"$error":"#REF!"}},{"$f":"IF(Schema!#REF!=\"\",\"\",Schema!#REF!)","v":{"$error":"#REF!"}}]
[{"$f":"Schema!#REF!&Schema!#REF!&Schema!#REF!&Schema!#REF!","v":{"$error":"#REF!"}},{"$error":"#REF!"},{"$f":"IF(A395=\"\",\"\",IF(LEN(Schema!#REF!)=2,1,IF(LEN(Schema!#REF!)=2,10,IF(LEN(Schema!#REF!)=2,100,0))))","v":{"$error":"#REF!"}},{"$error":"#REF!"},{"$f":"IF(A395=\"\",\"\",SUM(Tabel2[[#This Row],[I1]:[I2]]))","v":{"$error":"#REF!"}},{"$error":"#REF!"},{"$error":"#REF!"},{"$error":"#REF!"},{"$error":"#REF!"},{"$f":"IF(C395=\"\",\"\",IF(LEN(Tabel2[[#This Row],[Entiteit of attribuut]])=2,\"\",Tabel2[[#This Row],[Entiteit]]&\"_\"&Tabel2[[#This Row],[Entiteit of attribuut]]))","v":{"$error":"#REF!"}},{"$f":"IF(Schema!#REF!=\"\",\"\",Schema!#REF!)","v":{"$error":"#REF!"}},{"$f":"IF(Schema!#REF!=\"\",\"\",Schema!#REF!)","v":{"$error":"#REF!"}},{"$f":"IF(Schema!#REF!=\"\",\"\",Schema!#REF!)","v":{"$error":"#REF!"}},{"$f":"IF(Schema!#REF!=\"\",\"\",Schema!#REF!)","v":{"$error":"#REF!"}},{"$f":"IF(Schema!#REF!=\"\",\"\",Schema!#REF!)","v":{"$error":"#REF!"}}]
[{"$f":"Schema!#REF!&Schema!#REF!&Schema!#REF!&Schema!#REF!","v":{"$error":"#REF!"}},{"$error":"#REF!"},{"$f":"IF(A396=\"\",\"\",IF(LEN(Schema!#REF!)=2,1,IF(LEN(Schema!#REF!)=2,10,IF(LEN(Schema!#REF!)=2,100,0))))","v":{"$error":"#REF!"}},{"$error":"#REF!"},{"$f":"IF(A396=\"\",\"\",SUM(Tabel2[[#This Row],[I1]:[I2]]))","v":{"$error":"#REF!"}},{"$error":"#REF!"},{"$error":"#REF!"},{"$error":"#REF!"},{"$error":"#REF!"},{"$f":"IF(C396=\"\",\"\",IF(LEN(Tabel2[[#This Row],[Entiteit of attribuut]])=2,\"\",Tabel2[[#This Row],[Entiteit]]&\"_\"&Tabel2[[#This Row],[Entiteit of attribuut]]))","v":{"$error":"#REF!"}},{"$f":"IF(Schema!#REF!=\"\",\"\",Schema!#REF!)","v":{"$error":"#REF!"}},{"$f":"IF(Schema!#REF!=\"\",\"\",Schema!#REF!)","v":{"$error":"#REF!"}},{"$f":"IF(Schema!#REF!=\"\",\"\",Schema!#REF!)","v":{"$error":"#REF!"}},{"$f":"IF(Schema!#REF!=\"\",\"\",Schema!#REF!)","v":{"$error":"#REF!"}},{"$f":"IF(Schema!#REF!=\"\",\"\",Schema!#REF!)","v":{"$error":"#REF!"}}]
[{"$f":"Schema!#REF!&Schema!#REF!&Schema!#REF!&Schema!#REF!","v":{"$error":"#REF!"}},{"$error":"#REF!"},{"$f":"IF(A397=\"\",\"\",IF(LEN(Schema!#REF!)=2,1,IF(LEN(Schema!#REF!)=2,10,IF(LEN(Schema!#REF!)=2,100,0))))","v":{"$error":"#REF!"}},{"$error":"#REF!"},{"$f":"IF(A397=\"\",\"\",SUM(Tabel2[[#This Row],[I1]:[I2]]))","v":{"$error":"#REF!"}},{"$error":"#REF!"},{"$error":"#REF!"},{"$error":"#REF!"},{"$error":"#REF!"},{"$f":"IF(C397=\"\",\"\",IF(LEN(Tabel2[[#This Row],[Entiteit of attribuut]])=2,\"\",Tabel2[[#This Row],[Entiteit]]&\"_\"&Tabel2[[#This Row],[Entiteit of attribuut]]))","v":{"$error":"#REF!"}},{"$f":"IF(Schema!#REF!=\"\",\"\",Schema!#REF!)","v":{"$error":"#REF!"}},{"$f":"IF(Schema!#REF!=\"\",\"\",Schema!#REF!)","v":{"$error":"#REF!"}},{"$f":"IF(Schema!#REF!=\"\",\"\",Schema!#REF!)","v":{"$error":"#REF!"}},{"$f":"IF(Schema!#REF!=\"\",\"\",Schema!#REF!)","v":{"$error":"#REF!"}},{"$f":"IF(Schema!#REF!=\"\",\"\",Schema!#REF!)","v":{"$error":"#REF!"}}]
[{"$f":"Schema!#REF!&Schema!#REF!&Schema!#REF!&Schema!#REF!","v":{"$error":"#REF!"}},{"$error":"#REF!"},{"$f":"IF(A398=\"\",\"\",IF(LEN(Schema!#REF!)=2,1,IF(LEN(Schema!#REF!)=2,10,IF(LEN(Schema!#REF!)=2,100,0))))","v":{"$error":"#REF!"}},{"$error":"#REF!"},{"$f":"IF(A398=\"\",\"\",SUM(Tabel2[[#This Row],[I1]:[I2]]))","v":{"$error":"#REF!"}},{"$error":"#REF!"},{"$error":"#REF!"},{"$error":"#REF!"},{"$error":"#REF!"},{"$f":"IF(C398=\"\",\"\",IF(LEN(Tabel2[[#This Row],[Entiteit of attribuut]])=2,\"\",Tabel2[[#This Row],[Entiteit]]&\"_\"&Tabel2[[#This Row],[Entiteit of attribuut]]))","v":{"$error":"#REF!"}},{"$f":"IF(Schema!#REF!=\"\",\"\",Schema!#REF!)","v":{"$error":"#REF!"}},{"$f":"IF(Schema!#REF!=\"\",\"\",Schema!#REF!)","v":{"$error":"#REF!"}},{"$f":"IF(Schema!#REF!=\"\",\"\",Schema!#REF!)","v":{"$error":"#REF!"}},{"$f":"IF(Schema!#REF!=\"\",\"\",Schema!#REF!)","v":{"$error":"#REF!"}},{"$f":"IF(Schema!#REF!=\"\",\"\",Schema!#REF!)","v":{"$error":"#REF!"}}]
[{"$f":"Schema!#REF!&Schema!#REF!&Schema!#REF!&Schema!#REF!","v":{"$error":"#REF!"}},{"$error":"#REF!"},{"$f":"IF(A399=\"\",\"\",IF(LEN(Schema!#REF!)=2,1,IF(LEN(Schema!#REF!)=2,10,IF(LEN(Schema!#REF!)=2,100,0))))","v":{"$error":"#REF!"}},{"$error":"#REF!"},{"$f":"IF(A399=\"\",\"\",SUM(Tabel2[[#This Row],[I1]:[I2]]))","v":{"$error":"#REF!"}},{"$error":"#REF!"},{"$error":"#REF!"},{"$error":"#REF!"},{"$error":"#REF!"},{"$f":"IF(C399=\"\",\"\",IF(LEN(Tabel2[[#This Row],[Entiteit of attribuut]])=2,\"\",Tabel2[[#This Row],[Entiteit]]&\"_\"&Tabel2[[#This Row],[Entiteit of attribuut]]))","v":{"$error":"#REF!"}},{"$f":"IF(Schema!#REF!=\"\",\"\",Schema!#REF!)","v":{"$error":"#REF!"}},{"$f":"IF(Schema!#REF!=\"\",\"\",Schema!#REF!)","v":{"$error":"#REF!"}},{"$f":"IF(Schema!#REF!=\"\",\"\",Schema!#REF!)","v":{"$error":"#REF!"}},{"$f":"IF(Schema!#REF!=\"\",\"\",Schema!#REF!)","v":{"$error":"#REF!"}},{"$f":"IF(Schema!#REF!=\"\",\"\",Schema!#REF!)","v":{"$error":"#REF!"}}]
[{"$f":"Schema!#REF!&Schema!#REF!&Schema!#REF!&Schema!#REF!","v":{"$error":"#REF!"}},{"$error":"#REF!"},{"$f":"IF(A400=\"\",\"\",IF(LEN(Schema!#REF!)=2,1,IF(LEN(Schema!#REF!)=2,10,IF(LEN(Schema!#REF!)=2,100,0))))","v":{"$error":"#REF!"}},{"$error":"#REF!"},{"$f":"IF(A400=\"\",\"\",SUM(Tabel2[[#This Row],[I1]:[I2]]))","v":{"$error":"#REF!"}},{"$error":"#REF!"},{"$error":"#REF!"},{"$error":"#REF!"},{"$error":"#REF!"},{"$f":"IF(C400=\"\",\"\",IF(LEN(Tabel2[[#This Row],[Entiteit of attribuut]])=2,\"\",Tabel2[[#This Row],[Entiteit]]&\"_\"&Tabel2[[#This Row],[Entiteit of attribuut]]))","v":{"$error":"#REF!"}},{"$f":"IF(Schema!#REF!=\"\",\"\",Schema!#REF!)","v":{"$error":"#REF!"}},{"$f":"IF(Schema!#REF!=\"\",\"\",Schema!#REF!)","v":{"$error":"#REF!"}},{"$f":"IF(Schema!#REF!=\"\",\"\",Schema!#REF!)","v":{"$error":"#REF!"}},{"$f":"IF(Schema!#REF!=\"\",\"\",Schema!#REF!)","v":{"$error":"#REF!"}},{"$f":"IF(Schema!#REF!=\"\",\"\",Schema!#REF!)","v":{"$error":"#REF!"}}]
[{"$f":"Schema!#REF!&Schema!#REF!&Schema!#REF!&Schema!#REF!","v":{"$error":"#REF!"}},{"$error":"#REF!"},{"$f":"IF(A401=\"\",\"\",IF(LEN(Schema!#REF!)=2,1,IF(LEN(Schema!#REF!)=2,10,IF(LEN(Schema!#REF!)=2,100,0))))","v":{"$error":"#REF!"}},{"$error":"#REF!"},{"$f":"IF(A401=\"\",\"\",SUM(Tabel2[[#This Row],[I1]:[I2]]))","v":{"$error":"#REF!"}},{"$error":"#REF!"},{"$error":"#REF!"},{"$error":"#REF!"},{"$error":"#REF!"},{"$f":"IF(C401=\"\",\"\",IF(LEN(Tabel2[[#This Row],[Entiteit of attribuut]])=2,\"\",Tabel2[[#This Row],[Entiteit]]&\"_\"&Tabel2[[#This Row],[Entiteit of attribuut]]))","v":{"$error":"#REF!"}},{"$f":"IF(Schema!#REF!=\"\",\"\",Schema!#REF!)","v":{"$error":"#REF!"}},{"$f":"IF(Schema!#REF!=\"\",\"\",Schema!#REF!)","v":{"$error":"#REF!"}},{"$f":"IF(Schema!#REF!=\"\",\"\",Schema!#REF!)","v":{"$error":"#REF!"}},{"$f":"IF(Schema!#REF!=\"\",\"\",Schema!#REF!)","v":{"$error":"#REF!"}},{"$f":"IF(Schema!#REF!=\"\",\"\",Schema!#REF!)","v":{"$error":"#REF!"}}]
[{"$f":"Schema!#REF!&Schema!#REF!&Schema!#REF!&Schema!#REF!","v":{"$error":"#REF!"}},{"$error":"#REF!"},{"$f":"IF(A402=\"\",\"\",IF(LEN(Schema!#REF!)=2,1,IF(LEN(Schema!#REF!)=2,10,IF(LEN(Schema!#REF!)=2,100,0))))","v":{"$error":"#REF!"}},{"$error":"#REF!"},{"$f":"IF(A402=\"\",\"\",SUM(Tabel2[[#This Row],[I1]:[I2]]))","v":{"$error":"#REF!"}},{"$error":"#REF!"},{"$error":"#REF!"},{"$error":"#REF!"},{"$error":"#REF!"},{"$f":"IF(C402=\"\",\"\",IF(LEN(Tabel2[[#This Row],[Entiteit of attribuut]])=2,\"\",Tabel2[[#This Row],[Entiteit]]&\"_\"&Tabel2[[#This Row],[Entiteit of attribuut]]))","v":{"$error":"#REF!"}},{"$f":"IF(Schema!#REF!=\"\",\"\",Schema!#REF!)","v":{"$error":"#REF!"}},{"$f":"IF(Schema!#REF!=\"\",\"\",Schema!#REF!)","v":{"$error":"#REF!"}},{"$f":"IF(Schema!#REF!=\"\",\"\",Schema!#REF!)","v":{"$error":"#REF!"}},{"$f":"IF(Schema!#REF!=\"\",\"\",Schema!#REF!)","v":{"$error":"#REF!"}},{"$f":"IF(Schema!#REF!=\"\",\"\",Schema!#REF!)","v":{"$error":"#REF!"}}]
[{"$f":"Schema!#REF!&Schema!#REF!&Schema!#REF!&Schema!#REF!","v":{"$error":"#REF!"}},{"$error":"#REF!"},{"$f":"IF(A403=\"\",\"\",IF(LEN(Schema!#REF!)=2,1,IF(LEN(Schema!#REF!)=2,10,IF(LEN(Schema!#REF!)=2,100,0))))","v":{"$error":"#REF!"}},{"$error":"#REF!"},{"$f":"IF(A403=\"\",\"\",SUM(Tabel2[[#This Row],[I1]:[I2]]))","v":{"$error":"#REF!"}},{"$error":"#REF!"},{"$error":"#REF!"},{"$error":"#REF!"},{"$error":"#REF!"},{"$f":"IF(C403=\"\",\"\",IF(LEN(Tabel2[[#This Row],[Entiteit of attribuut]])=2,\"\",Tabel2[[#This Row],[Entiteit]]&\"_\"&Tabel2[[#This Row],[Entiteit of attribuut]]))","v":{"$error":"#REF!"}},{"$f":"IF(Schema!#REF!=\"\",\"\",Schema!#REF!)","v":{"$error":"#REF!"}},{"$f":"IF(Schema!#REF!=\"\",\"\",Schema!#REF!)","v":{"$error":"#REF!"}},{"$f":"IF(Schema!#REF!=\"\",\"\",Schema!#REF!)","v":{"$error":"#REF!"}},{"$f":"IF(Schema!#REF!=\"\",\"\",Schema!#REF!)","v":{"$error":"#REF!"}},{"$f":"IF(Schema!#REF!=\"\",\"\",Schema!#REF!)","v":{"$error":"#REF!"}}]
[{"$f":"Schema!#REF!&Schema!#REF!&Schema!#REF!&Schema!#REF!","v":{"$error":"#REF!"}},{"$error":"#REF!"},{"$f":"IF(A404=\"\",\"\",IF(LEN(Schema!#REF!)=2,1,IF(LEN(Schema!#REF!)=2,10,IF(LEN(Schema!#REF!)=2,100,0))))","v":{"$error":"#REF!"}},{"$error":"#REF!"},{"$f":"IF(A404=\"\",\"\",SUM(Tabel2[[#This Row],[I1]:[I2]]))","v":{"$error":"#REF!"}},{"$error":"#REF!"},{"$error":"#REF!"},{"$error":"#REF!"},{"$error":"#REF!"},{"$f":"IF(C404=\"\",\"\",IF(LEN(Tabel2[[#This Row],[Entiteit of attribuut]])=2,\"\",Tabel2[[#This Row],[Entiteit]]&\"_\"&Tabel2[[#This Row],[Entiteit of attribuut]]))","v":{"$error":"#REF!"}},{"$f":"IF(Schema!#REF!=\"\",\"\",Schema!#REF!)","v":{"$error":"#REF!"}},{"$f":"IF(Schema!#REF!=\"\",\"\",Schema!#REF!)","v":{"$error":"#REF!"}},{"$f":"IF(Schema!#REF!=\"\",\"\",Schema!#REF!)","v":{"$error":"#REF!"}},{"$f":"IF(Schema!#REF!=\"\",\"\",Schema!#REF!)","v":{"$error":"#REF!"}},{"$f":"IF(Schema!#REF!=\"\",\"\",Schema!#REF!)","v":{"$error":"#REF!"}}]
[{"$f":"Schema!#REF!&Schema!#REF!&Schema!#REF!&Schema!#REF!","v":{"$error":"#REF!"}},{"$error":"#REF!"},{"$f":"IF(A405=\"\",\"\",IF(LEN(Schema!#REF!)=2,1,IF(LEN(Schema!#REF!)=2,10,IF(LEN(Schema!#REF!)=2,100,0))))","v":{"$error":"#REF!"}},{"$error":"#REF!"},{"$f":"IF(A405=\"\",\"\",SUM(Tabel2[[#This Row],[I1]:[I2]]))","v":{"$error":"#REF!"}},{"$error":"#REF!"},{"$error":"#REF!"},{"$error":"#REF!"},{"$error":"#REF!"},{"$f":"IF(C405=\"\",\"\",IF(LEN(Tabel2[[#This Row],[Entiteit of attribuut]])=2,\"\",Tabel2[[#This Row],[Entiteit]]&\"_\"&Tabel2[[#This Row],[Entiteit of attribuut]]))","v":{"$error":"#REF!"}},{"$f":"IF(Schema!#REF!=\"\",\"\",Schema!#REF!)","v":{"$error":"#REF!"}},{"$f":"IF(Schema!#REF!=\"\",\"\",Schema!#REF!)","v":{"$error":"#REF!"}},{"$f":"IF(Schema!#REF!=\"\",\"\",Schema!#REF!)","v":{"$error":"#REF!"}},{"$f":"IF(Schema!#REF!=\"\",\"\",Schema!#REF!)","v":{"$error":"#REF!"}},{"$f":"IF(Schema!#REF!=\"\",\"\",Schema!#REF!)","v":{"$error":"#REF!"}}]
[{"$f":"Schema!#REF!&Schema!#REF!&Schema!#REF!&Schema!#REF!","v":{"$error":"#REF!"}},{"$error":"#REF!"},{"$f":"IF(A406=\"\",\"\",IF(LEN(Schema!#REF!)=2,1,IF(LEN(Schema!#REF!)=2,10,IF(LEN(Schema!#REF!)=2,100,0))))","v":{"$error":"#REF!"}},{"$error":"#REF!"},{"$f":"IF(A406=\"\",\"\",SUM(Tabel2[[#This Row],[I1]:[I2]]))","v":{"$error":"#REF!"}},{"$error":"#REF!"},{"$error":"#REF!"},{"$error":"#REF!"},{"$error":"#REF!"},{"$f":"IF(C406=\"\",\"\",IF(LEN(Tabel2[[#This Row],[Entiteit of attribuut]])=2,\"\",Tabel2[[#This Row],[Entiteit]]&\"_\"&Tabel2[[#This Row],[Entiteit of attribuut]]))","v":{"$error":"#REF!"}},{"$f":"IF(Schema!#REF!=\"\",\"\",Schema!#REF!)","v":{"$error":"#REF!"}},{"$f":"IF(Schema!#REF!=\"\",\"\",Schema!#REF!)","v":{"$error":"#REF!"}},{"$f":"IF(Schema!#REF!=\"\",\"\",Schema!#REF!)","v":{"$error":"#REF!"}},{"$f":"IF(Schema!#REF!=\"\",\"\",Schema!#REF!)","v":{"$error":"#REF!"}},{"$f":"IF(Schema!#REF!=\"\",\"\",Schema!#REF!)","v":{"$error":"#REF!"}}]
[{"$f":"Schema!#REF!&Schema!#REF!&Schema!#REF!&Schema!#REF!","v":{"$error":"#REF!"}},{"$error":"#REF!"},{"$f":"IF(A407=\"\",\"\",IF(LEN(Schema!#REF!)=2,1,IF(LEN(Schema!#REF!)=2,10,IF(LEN(Schema!#REF!)=2,100,0))))","v":{"$error":"#REF!"}},{"$error":"#REF!"},{"$f":"IF(A407=\"\",\"\",SUM(Tabel2[[#This Row],[I1]:[I2]]))","v":{"$error":"#REF!"}},{"$error":"#REF!"},{"$error":"#REF!"},{"$error":"#REF!"},{"$error":"#REF!"},{"$f":"IF(C407=\"\",\"\",IF(LEN(Tabel2[[#This Row],[Entiteit of attribuut]])=2,\"\",Tabel2[[#This Row],[Entiteit]]&\"_\"&Tabel2[[#This Row],[Entiteit of attribuut]]))","v":{"$error":"#REF!"}},{"$f":"IF(Schema!#REF!=\"\",\"\",Schema!#REF!)","v":{"$error":"#REF!"}},{"$f":"IF(Schema!#REF!=\"\",\"\",Schema!#REF!)","v":{"$error":"#REF!"}},{"$f":"IF(Schema!#REF!=\"\",\"\",Schema!#REF!)","v":{"$error":"#REF!"}},{"$f":"IF(Schema!#REF!=\"\",\"\",Schema!#REF!)","v":{"$error":"#REF!"}},{"$f":"IF(Schema!#REF!=\"\",\"\",Schema!#REF!)","v":{"$error":"#REF!"}}]
[{"$f":"Schema!#REF!&Schema!#REF!&Schema!#REF!&Schema!#REF!","v":{"$error":"#REF!"}},{"$error":"#REF!"},{"$f":"IF(A408=\"\",\"\",IF(LEN(Schema!#REF!)=2,1,IF(LEN(Schema!#REF!)=2,10,IF(LEN(Schema!#REF!)=2,100,0))))","v":{"$error":"#REF!"}},{"$error":"#REF!"},{"$f":"IF(A408=\"\",\"\",SUM(Tabel2[[#This Row],[I1]:[I2]]))","v":{"$error":"#REF!"}},{"$error":"#REF!"},{"$error":"#REF!"},{"$error":"#REF!"},{"$error":"#REF!"},{"$f":"IF(C408=\"\",\"\",IF(LEN(Tabel2[[#This Row],[Entiteit of attribuut]])=2,\"\",Tabel2[[#This Row],[Entiteit]]&\"_\"&Tabel2[[#This Row],[Entiteit of attribuut]]))","v":{"$error":"#REF!"}},{"$f":"IF(Schema!#REF!=\"\",\"\",Schema!#REF!)","v":{"$error":"#REF!"}},{"$f":"IF(Schema!#REF!=\"\",\"\",Schema!#REF!)","v":{"$error":"#REF!"}},{"$f":"IF(Schema!#REF!=\"\",\"\",Schema!#REF!)","v":{"$error":"#REF!"}},{"$f":"IF(Schema!#REF!=\"\",\"\",Schema!#REF!)","v":{"$error":"#REF!"}},{"$f":"IF(Schema!#REF!=\"\",\"\",Schema!#REF!)","v":{"$error":"#REF!"}}]
[{"$f":"Schema!#REF!&Schema!#REF!&Schema!#REF!&Schema!#REF!","v":{"$error":"#REF!"}},{"$error":"#REF!"},{"$f":"IF(A409=\"\",\"\",IF(LEN(Schema!#REF!)=2,1,IF(LEN(Schema!#REF!)=2,10,IF(LEN(Schema!#REF!)=2,100,0))))","v":{"$error":"#REF!"}},{"$error":"#REF!"},{"$f":"IF(A409=\"\",\"\",SUM(Tabel2[[#This Row],[I1]:[I2]]))","v":{"$error":"#REF!"}},{"$error":"#REF!"},{"$error":"#REF!"},{"$error":"#REF!"},{"$error":"#REF!"},{"$f":"IF(C409=\"\",\"\",IF(LEN(Tabel2[[#This Row],[Entiteit of attribuut]])=2,\"\",Tabel2[[#This Row],[Entiteit]]&\"_\"&Tabel2[[#This Row],[Entiteit of attribuut]]))","v":{"$error":"#REF!"}},{"$f":"IF(Schema!#REF!=\"\",\"\",Schema!#REF!)","v":{"$error":"#REF!"}},{"$f":"IF(Schema!#REF!=\"\",\"\",Schema!#REF!)","v":{"$error":"#REF!"}},{"$f":"IF(Schema!#REF!=\"\",\"\",Schema!#REF!)","v":{"$error":"#REF!"}},{"$f":"IF(Schema!#REF!=\"\",\"\",Schema!#REF!)","v":{"$error":"#REF!"}},{"$f":"IF(Schema!#REF!=\"\",\"\",Schema!#REF!)","v":{"$error":"#REF!"}}]
[{"$f":"Schema!#REF!&Schema!#REF!&Schema!#REF!&Schema!#REF!","v":{"$error":"#REF!"}},{"$error":"#REF!"},{"$f":"IF(A410=\"\",\"\",IF(LEN(Schema!#REF!)=2,1,IF(LEN(Schema!#REF!)=2,10,IF(LEN(Schema!#REF!)=2,100,0))))","v":{"$error":"#REF!"}},{"$error":"#REF!"},{"$f":"IF(A410=\"\",\"\",SUM(Tabel2[[#This Row],[I1]:[I2]]))","v":{"$error":"#REF!"}},{"$error":"#REF!"},{"$error":"#REF!"},{"$error":"#REF!"},{"$error":"#REF!"},{"$f":"IF(C410=\"\",\"\",IF(LEN(Tabel2[[#This Row],[Entiteit of attribuut]])=2,\"\",Tabel2[[#This Row],[Entiteit]]&\"_\"&Tabel2[[#This Row],[Entiteit of attribuut]]))","v":{"$error":"#REF!"}},{"$f":"IF(Schema!#REF!=\"\",\"\",Schema!#REF!)","v":{"$error":"#REF!"}},{"$f":"IF(Schema!#REF!=\"\",\"\",Schema!#REF!)","v":{"$error":"#REF!"}},{"$f":"IF(Schema!#REF!=\"\",\"\",Schema!#REF!)","v":{"$error":"#REF!"}},{"$f":"IF(Schema!#REF!=\"\",\"\",Schema!#REF!)","v":{"$error":"#REF!"}},{"$f":"IF(Schema!#REF!=\"\",\"\",Schema!#REF!)","v":{"$error":"#REF!"}}]
[{"$f":"Schema!#REF!&Schema!#REF!&Schema!#REF!&Schema!#REF!","v":{"$error":"#REF!"}},{"$error":"#REF!"},{"$f":"IF(A411=\"\",\"\",IF(LEN(Schema!#REF!)=2,1,IF(LEN(Schema!#REF!)=2,10,IF(LEN(Schema!#REF!)=2,100,0))))","v":{"$error":"#REF!"}},{"$error":"#REF!"},{"$f":"IF(A411=\"\",\"\",SUM(Tabel2[[#This Row],[I1]:[I2]]))","v":{"$error":"#REF!"}},{"$error":"#REF!"},{"$error":"#REF!"},{"$error":"#REF!"},{"$error":"#REF!"},{"$f":"IF(C411=\"\",\"\",IF(LEN(Tabel2[[#This Row],[Entiteit of attribuut]])=2,\"\",Tabel2[[#This Row],[Entiteit]]&\"_\"&Tabel2[[#This Row],[Entiteit of attribuut]]))","v":{"$error":"#REF!"}},{"$f":"IF(Schema!#REF!=\"\",\"\",Schema!#REF!)","v":{"$error":"#REF!"}},{"$f":"IF(Schema!#REF!=\"\",\"\",Schema!#REF!)","v":{"$error":"#REF!"}},{"$f":"IF(Schema!#REF!=\"\",\"\",Schema!#REF!)","v":{"$error":"#REF!"}},{"$f":"IF(Schema!#REF!=\"\",\"\",Schema!#REF!)","v":{"$error":"#REF!"}},{"$f":"IF(Schema!#REF!=\"\",\"\",Schema!#REF!)","v":{"$error":"#REF!"}}]
[{"$f":"Schema!#REF!&Schema!#REF!&Schema!#REF!&Schema!#REF!","v":{"$error":"#REF!"}},{"$error":"#REF!"},{"$f":"IF(A412=\"\",\"\",IF(LEN(Schema!#REF!)=2,1,IF(LEN(Schema!#REF!)=2,10,IF(LEN(Schema!#REF!)=2,100,0))))","v":{"$error":"#REF!"}},{"$error":"#REF!"},{"$f":"IF(A412=\"\",\"\",SUM(Tabel2[[#This Row],[I1]:[I2]]))","v":{"$error":"#REF!"}},{"$error":"#REF!"},{"$error":"#REF!"},{"$error":"#REF!"},{"$error":"#REF!"},{"$f":"IF(C412=\"\",\"\",IF(LEN(Tabel2[[#This Row],[Entiteit of attribuut]])=2,\"\",Tabel2[[#This Row],[Entiteit]]&\"_\"&Tabel2[[#This Row],[Entiteit of attribuut]]))","v":{"$error":"#REF!"}},{"$f":"IF(Schema!#REF!=\"\",\"\",Schema!#REF!)","v":{"$error":"#REF!"}},{"$f":"IF(Schema!#REF!=\"\",\"\",Schema!#REF!)","v":{"$error":"#REF!"}},{"$f":"IF(Schema!#REF!=\"\",\"\",Schema!#REF!)","v":{"$error":"#REF!"}},{"$f":"IF(Schema!#REF!=\"\",\"\",Schema!#REF!)","v":{"$error":"#REF!"}},{"$f":"IF(Schema!#REF!=\"\",\"\",Schema!#REF!)","v":{"$error":"#REF!"}}]
[{"$f":"Schema!#REF!&Schema!#REF!&Schema!#REF!&Schema!#REF!","v":{"$error":"#REF!"}},{"$error":"#REF!"},{"$f":"IF(A413=\"\",\"\",IF(LEN(Schema!#REF!)=2,1,IF(LEN(Schema!#REF!)=2,10,IF(LEN(Schema!#REF!)=2,100,0))))","v":{"$error":"#REF!"}},{"$error":"#REF!"},{"$f":"IF(A413=\"\",\"\",SUM(Tabel2[[#This Row],[I1]:[I2]]))","v":{"$error":"#REF!"}},{"$error":"#REF!"},{"$error":"#REF!"},{"$error":"#REF!"},{"$error":"#REF!"},{"$f":"IF(C413=\"\",\"\",IF(LEN(Tabel2[[#This Row],[Entiteit of attribuut]])=2,\"\",Tabel2[[#This Row],[Entiteit]]&\"_\"&Tabel2[[#This Row],[Entiteit of attribuut]]))","v":{"$error":"#REF!"}},{"$f":"IF(Schema!#REF!=\"\",\"\",Schema!#REF!)","v":{"$error":"#REF!"}},{"$f":"IF(Schema!#REF!=\"\",\"\",Schema!#REF!)","v":{"$error":"#REF!"}},{"$f":"IF(Schema!#REF!=\"\",\"\",Schema!#REF!)","v":{"$error":"#REF!"}},{"$f":"IF(Schema!#REF!=\"\",\"\",Schema!#REF!)","v":{"$error":"#REF!"}},{"$f":"IF(Schema!#REF!=\"\",\"\",Schema!#REF!)","v":{"$error":"#REF!"}}]
[{"$f":"Schema!#REF!&Schema!#REF!&Schema!#REF!&Schema!#REF!","v":{"$error":"#REF!"}},{"$error":"#REF!"},{"$f":"IF(A414=\"\",\"\",IF(LEN(Schema!#REF!)=2,1,IF(LEN(Schema!#REF!)=2,10,IF(LEN(Schema!#REF!)=2,100,0))))","v":{"$error":"#REF!"}},{"$error":"#REF!"},{"$f":"IF(A414=\"\",\"\",SUM(Tabel2[[#This Row],[I1]:[I2]]))","v":{"$error":"#REF!"}},{"$error":"#REF!"},{"$error":"#REF!"},{"$error":"#REF!"},{"$error":"#REF!"},{"$f":"IF(C414=\"\",\"\",IF(LEN(Tabel2[[#This Row],[Entiteit of attribuut]])=2,\"\",Tabel2[[#This Row],[Entiteit]]&\"_\"&Tabel2[[#This Row],[Entiteit of attribuut]]))","v":{"$error":"#REF!"}},{"$f":"IF(Schema!#REF!=\"\",\"\",Schema!#REF!)","v":{"$error":"#REF!"}},{"$f":"IF(Schema!#REF!=\"\",\"\",Schema!#REF!)","v":{"$error":"#REF!"}},{"$f":"IF(Schema!#REF!=\"\",\"\",Schema!#REF!)","v":{"$error":"#REF!"}},{"$f":"IF(Schema!#REF!=\"\",\"\",Schema!#REF!)","v":{"$error":"#REF!"}},{"$f":"IF(Schema!#REF!=\"\",\"\",Schema!#REF!)","v":{"$error":"#REF!"}}]
[{"$f":"Schema!#REF!&Schema!#REF!&Schema!#REF!&Schema!#REF!","v":{"$error":"#REF!"}},{"$error":"#REF!"},{"$f":"IF(A415=\"\",\"\",IF(LEN(Schema!#REF!)=2,1,IF(LEN(Schema!#REF!)=2,10,IF(LEN(Schema!#REF!)=2,100,0))))","v":{"$error":"#REF!"}},{"$error":"#REF!"},{"$f":"IF(A415=\"\",\"\",SUM(Tabel2[[#This Row],[I1]:[I2]]))","v":{"$error":"#REF!"}},{"$error":"#REF!"},{"$error":"#REF!"},{"$error":"#REF!"},{"$error":"#REF!"},{"$f":"IF(C415=\"\",\"\",IF(LEN(Tabel2[[#This Row],[Entiteit of attribuut]])=2,\"\",Tabel2[[#This Row],[Entiteit]]&\"_\"&Tabel2[[#This Row],[Entiteit of attribuut]]))","v":{"$error":"#REF!"}},{"$f":"IF(Schema!#REF!=\"\",\"\",Schema!#REF!)","v":{"$error":"#REF!"}},{"$f":"IF(Schema!#REF!=\"\",\"\",Schema!#REF!)","v":{"$error":"#REF!"}},{"$f":"IF(Schema!#REF!=\"\",\"\",Schema!#REF!)","v":{"$error":"#REF!"}},{"$f":"IF(Schema!#REF!=\"\",\"\",Schema!#REF!)","v":{"$error":"#REF!"}},{"$f":"IF(Schema!#REF!=\"\",\"\",Schema!#REF!)","v":{"$error":"#REF!"}}]
[{"$f":"Schema!#REF!&Schema!#REF!&Schema!#REF!&Schema!#REF!","v":{"$error":"#REF!"}},{"$error":"#REF!"},{"$f":"IF(A416=\"\",\"\",IF(LEN(Schema!#REF!)=2,1,IF(LEN(Schema!#REF!)=2,10,IF(LEN(Schema!#REF!)=2,100,0))))","v":{"$error":"#REF!"}},{"$error":"#REF!"},{"$f":"IF(A416=\"\",\"\",SUM(Tabel2[[#This Row],[I1]:[I2]]))","v":{"$error":"#REF!"}},{"$error":"#REF!"},{"$error":"#REF!"},{"$error":"#REF!"},{"$error":"#REF!"},{"$f":"IF(C416=\"\",\"\",IF(LEN(Tabel2[[#This Row],[Entiteit of attribuut]])=2,\"\",Tabel2[[#This Row],[Entiteit]]&\"_\"&Tabel2[[#This Row],[Entiteit of attribuut]]))","v":{"$error":"#REF!"}},{"$f":"IF(Schema!#REF!=\"\",\"\",Schema!#REF!)","v":{"$error":"#REF!"}},{"$f":"IF(Schema!#REF!=\"\",\"\",Schema!#REF!)","v":{"$error":"#REF!"}},{"$f":"IF(Schema!#REF!=\"\",\"\",Schema!#REF!)","v":{"$error":"#REF!"}},{"$f":"IF(Schema!#REF!=\"\",\"\",Schema!#REF!)","v":{"$error":"#REF!"}},{"$f":"IF(Schema!#REF!=\"\",\"\",Schema!#REF!)","v":{"$error":"#REF!"}}]
[{"$f":"Schema!#REF!&Schema!#REF!&Schema!#REF!&Schema!#REF!","v":{"$error":"#REF!"}},{"$error":"#REF!"},{"$f":"IF(A417=\"\",\"\",IF(LEN(Schema!#REF!)=2,1,IF(LEN(Schema!#REF!)=2,10,IF(LEN(Schema!#REF!)=2,100,0))))","v":{"$error":"#REF!"}},{"$error":"#REF!"},{"$f":"IF(A417=\"\",\"\",SUM(Tabel2[[#This Row],[I1]:[I2]]))","v":{"$error":"#REF!"}},{"$error":"#REF!"},{"$error":"#REF!"},{"$error":"#REF!"},{"$error":"#REF!"},{"$f":"IF(C417=\"\",\"\",IF(LEN(Tabel2[[#This Row],[Entiteit of attribuut]])=2,\"\",Tabel2[[#This Row],[Entiteit]]&\"_\"&Tabel2[[#This Row],[Entiteit of attribuut]]))","v":{"$error":"#REF!"}},{"$f":"IF(Schema!#REF!=\"\",\"\",Schema!#REF!)","v":{"$error":"#REF!"}},{"$f":"IF(Schema!#REF!=\"\",\"\",Schema!#REF!)","v":{"$error":"#REF!"}},{"$f":"IF(Schema!#REF!=\"\",\"\",Schema!#REF!)","v":{"$error":"#REF!"}},{"$f":"IF(Schema!#REF!=\"\",\"\",Schema!#REF!)","v":{"$error":"#REF!"}},{"$f":"IF(Schema!#REF!=\"\",\"\",Schema!#REF!)","v":{"$error":"#REF!"}}]
[{"$f":"Schema!#REF!&Schema!#REF!&Schema!#REF!&Schema!#REF!","v":{"$error":"#REF!"}},{"$error":"#REF!"},{"$f":"IF(A418=\"\",\"\",IF(LEN(Schema!#REF!)=2,1,IF(LEN(Schema!#REF!)=2,10,IF(LEN(Schema!#REF!)=2,100,0))))","v":{"$error":"#REF!"}},{"$error":"#REF!"},{"$f":"IF(A418=\"\",\"\",SUM(Tabel2[[#This Row],[I1]:[I2]]))","v":{"$error":"#REF!"}},{"$error":"#REF!"},{"$error":"#REF!"},{"$error":"#REF!"},{"$error":"#REF!"},{"$f":"IF(C418=\"\",\"\",IF(LEN(Tabel2[[#This Row],[Entiteit of attribuut]])=2,\"\",Tabel2[[#This Row],[Entiteit]]&\"_\"&Tabel2[[#This Row],[Entiteit of attribuut]]))","v":{"$error":"#REF!"}},{"$f":"IF(Schema!#REF!=\"\",\"\",Schema!#REF!)","v":{"$error":"#REF!"}},{"$f":"IF(Schema!#REF!=\"\",\"\",Schema!#REF!)","v":{"$error":"#REF!"}},{"$f":"IF(Schema!#REF!=\"\",\"\",Schema!#REF!)","v":{"$error":"#REF!"}},{"$f":"IF(Schema!#REF!=\"\",\"\",Schema!#REF!)","v":{"$error":"#REF!"}},{"$f":"IF(Schema!#REF!=\"\",\"\",Schema!#REF!)","v":{"$error":"#REF!"}}]
[{"$f":"Schema!#REF!&Schema!#REF!&Schema!#REF!&Schema!#REF!","v":{"$error":"#REF!"}},{"$error":"#REF!"},{"$f":"IF(A419=\"\",\"\",IF(LEN(Schema!#REF!)=2,1,IF(LEN(Schema!#REF!)=2,10,IF(LEN(Schema!#REF!)=2,100,0))))","v":{"$error":"#REF!"}},{"$error":"#REF!"},{"$f":"IF(A419=\"\",\"\",SUM(Tabel2[[#This Row],[I1]:[I2]]))","v":{"$error":"#REF!"}},{"$error":"#REF!"},{"$error":"#REF!"},{"$error":"#REF!"},{"$error":"#REF!"},{"$f":"IF(C419=\"\",\"\",IF(LEN(Tabel2[[#This Row],[Entiteit of attribuut]])=2,\"\",Tabel2[[#This Row],[Entiteit]]&\"_\"&Tabel2[[#This Row],[Entiteit of attribuut]]))","v":{"$error":"#REF!"}},{"$f":"IF(Schema!#REF!=\"\",\"\",Schema!#REF!)","v":{"$error":"#REF!"}},{"$f":"IF(Schema!#REF!=\"\",\"\",Schema!#REF!)","v":{"$error":"#REF!"}},{"$f":"IF(Schema!#REF!=\"\",\"\",Schema!#REF!)","v":{"$error":"#REF!"}},{"$f":"IF(Schema!#REF!=\"\",\"\",Schema!#REF!)","v":{"$error":"#REF!"}},{"$f":"IF(Schema!#REF!=\"\",\"\",Schema!#REF!)","v":{"$error":"#REF!"}}]
[{"$f":"Schema!#REF!&Schema!#REF!&Schema!#REF!&Schema!#REF!","v":{"$error":"#REF!"}},{"$error":"#REF!"},{"$f":"IF(A420=\"\",\"\",IF(LEN(Schema!#REF!)=2,1,IF(LEN(Schema!#REF!)=2,10,IF(LEN(Schema!#REF!)=2,100,0))))","v":{"$error":"#REF!"}},{"$error":"#REF!"},{"$f":"IF(A420=\"\",\"\",SUM(Tabel2[[#This Row],[I1]:[I2]]))","v":{"$error":"#REF!"}},{"$error":"#REF!"},{"$error":"#REF!"},{"$error":"#REF!"},{"$error":"#REF!"},{"$f":"IF(C420=\"\",\"\",IF(LEN(Tabel2[[#This Row],[Entiteit of attribuut]])=2,\"\",Tabel2[[#This Row],[Entiteit]]&\"_\"&Tabel2[[#This Row],[Entiteit of attribuut]]))","v":{"$error":"#REF!"}},{"$f":"IF(Schema!#REF!=\"\",\"\",Schema!#REF!)","v":{"$error":"#REF!"}},{"$f":"IF(Schema!#REF!=\"\",\"\",Schema!#REF!)","v":{"$error":"#REF!"}},{"$f":"IF(Schema!#REF!=\"\",\"\",Schema!#REF!)","v":{"$error":"#REF!"}},{"$f":"IF(Schema!#REF!=\"\",\"\",Schema!#REF!)","v":{"$error":"#REF!"}},{"$f":"IF(Schema!#REF!=\"\",\"\",Schema!#REF!)","v":{"$error":"#REF!"}}]
[{"$f":"Schema!#REF!&Schema!#REF!&Schema!#REF!&Schema!#REF!","v":{"$error":"#REF!"}},{"$error":"#REF!"},{"$f":"IF(A421=\"\",\"\",IF(LEN(Schema!#REF!)=2,1,IF(LEN(Schema!#REF!)=2,10,IF(LEN(Schema!#REF!)=2,100,0))))","v":{"$error":"#REF!"}},{"$error":"#REF!"},{"$f":"IF(A421=\"\",\"\",SUM(Tabel2[[#This Row],[I1]:[I2]]))","v":{"$error":"#REF!"}},{"$error":"#REF!"},{"$error":"#REF!"},{"$error":"#REF!"},{"$error":"#REF!"},{"$f":"IF(C421=\"\",\"\",IF(LEN(Tabel2[[#This Row],[Entiteit of attribuut]])=2,\"\",Tabel2[[#This Row],[Entiteit]]&\"_\"&Tabel2[[#This Row],[Entiteit of attribuut]]))","v":{"$error":"#REF!"}},{"$f":"IF(Schema!#REF!=\"\",\"\",Schema!#REF!)","v":{"$error":"#REF!"}},{"$f":"IF(Schema!#REF!=\"\",\"\",Schema!#REF!)","v":{"$error":"#REF!"}},{"$f":"IF(Schema!#REF!=\"\",\"\",Schema!#REF!)","v":{"$error":"#REF!"}},{"$f":"IF(Schema!#REF!=\"\",\"\",Schema!#REF!)","v":{"$error":"#REF!"}},{"$f":"IF(Schema!#REF!=\"\",\"\",Schema!#REF!)","v":{"$error":"#REF!"}}]
[{"$f":"Schema!#REF!&Schema!#REF!&Schema!#REF!&Schema!#REF!","v":{"$error":"#REF!"}},{"$error":"#REF!"},{"$f":"IF(A422=\"\",\"\",IF(LEN(Schema!#REF!)=2,1,IF(LEN(Schema!#REF!)=2,10,IF(LEN(Schema!#REF!)=2,100,0))))","v":{"$error":"#REF!"}},{"$error":"#REF!"},{"$f":"IF(A422=\"\",\"\",SUM(Tabel2[[#This Row],[I1]:[I2]]))","v":{"$error":"#REF!"}},{"$error":"#REF!"},{"$error":"#REF!"},{"$error":"#REF!"},{"$error":"#REF!"},{"$f":"IF(C422=\"\",\"\",IF(LEN(Tabel2[[#This Row],[Entiteit of attribuut]])=2,\"\",Tabel2[[#This Row],[Entiteit]]&\"_\"&Tabel2[[#This Row],[Entiteit of attribuut]]))","v":{"$error":"#REF!"}},{"$f":"IF(Schema!#REF!=\"\",\"\",Schema!#REF!)","v":{"$error":"#REF!"}},{"$f":"IF(Schema!#REF!=\"\",\"\",Schema!#REF!)","v":{"$error":"#REF!"}},{"$f":"IF(Schema!#REF!=\"\",\"\",Schema!#REF!)","v":{"$error":"#REF!"}},{"$f":"IF(Schema!#REF!=\"\",\"\",Schema!#REF!)","v":{"$error":"#REF!"}},{"$f":"IF(Schema!#REF!=\"\",\"\",Schema!#REF!)","v":{"$error":"#REF!"}}]
[{"$f":"Schema!#REF!&Schema!#REF!&Schema!#REF!&Schema!#REF!","v":{"$error":"#REF!"}},{"$error":"#REF!"},{"$f":"IF(A423=\"\",\"\",IF(LEN(Schema!#REF!)=2,1,IF(LEN(Schema!#REF!)=2,10,IF(LEN(Schema!#REF!)=2,100,0))))","v":{"$error":"#REF!"}},{"$error":"#REF!"},{"$f":"IF(A423=\"\",\"\",SUM(Tabel2[[#This Row],[I1]:[I2]]))","v":{"$error":"#REF!"}},{"$error":"#REF!"},{"$error":"#REF!"},{"$error":"#REF!"},{"$error":"#REF!"},{"$f":"IF(C423=\"\",\"\",IF(LEN(Tabel2[[#This Row],[Entiteit of attribuut]])=2,\"\",Tabel2[[#This Row],[Entiteit]]&\"_\"&Tabel2[[#This Row],[Entiteit of attribuut]]))","v":{"$error":"#REF!"}},{"$f":"IF(Schema!#REF!=\"\",\"\",Schema!#REF!)","v":{"$error":"#REF!"}},{"$f":"IF(Schema!#REF!=\"\",\"\",Schema!#REF!)","v":{"$error":"#REF!"}},{"$f":"IF(Schema!#REF!=\"\",\"\",Schema!#REF!)","v":{"$error":"#REF!"}},{"$f":"IF(Schema!#REF!=\"\",\"\",Schema!#REF!)","v":{"$error":"#REF!"}},{"$f":"IF(Schema!#REF!=\"\",\"\",Schema!#REF!)","v":{"$error":"#REF!"}}]
[{"$f":"Schema!#REF!&Schema!#REF!&Schema!#REF!&Schema!#REF!","v":{"$error":"#REF!"}},{"$error":"#REF!"},{"$f":"IF(A424=\"\",\"\",IF(LEN(Schema!#REF!)=2,1,IF(LEN(Schema!#REF!)=2,10,IF(LEN(Schema!#REF!)=2,100,0))))","v":{"$error":"#REF!"}},{"$error":"#REF!"},{"$f":"IF(A424=\"\",\"\",SUM(Tabel2[[#This Row],[I1]:[I2]]))","v":{"$error":"#REF!"}},{"$error":"#REF!"},{"$error":"#REF!"},{"$error":"#REF!"},{"$error":"#REF!"},{"$f":"IF(C424=\"\",\"\",IF(LEN(Tabel2[[#This Row],[Entiteit of attribuut]])=2,\"\",Tabel2[[#This Row],[Entiteit]]&\"_\"&Tabel2[[#This Row],[Entiteit of attribuut]]))","v":{"$error":"#REF!"}},{"$f":"IF(Schema!#REF!=\"\",\"\",Schema!#REF!)","v":{"$error":"#REF!"}},{"$f":"IF(Schema!#REF!=\"\",\"\",Schema!#REF!)","v":{"$error":"#REF!"}},{"$f":"IF(Schema!#REF!=\"\",\"\",Schema!#REF!)","v":{"$error":"#REF!"}},{"$f":"IF(Schema!#REF!=\"\",\"\",Schema!#REF!)","v":{"$error":"#REF!"}},{"$f":"IF(Schema!#REF!=\"\",\"\",Schema!#REF!)","v":{"$error":"#REF!"}}]
[{"$f":"Schema!#REF!&Schema!#REF!&Schema!#REF!&Schema!#REF!","v":{"$error":"#REF!"}},{"$error":"#REF!"},{"$f":"IF(A425=\"\",\"\",IF(LEN(Schema!#REF!)=2,1,IF(LEN(Schema!#REF!)=2,10,IF(LEN(Schema!#REF!)=2,100,0))))","v":{"$error":"#REF!"}},{"$error":"#REF!"},{"$f":"IF(A425=\"\",\"\",SUM(Tabel2[[#This Row],[I1]:[I2]]))","v":{"$error":"#REF!"}},{"$error":"#REF!"},{"$error":"#REF!"},{"$error":"#REF!"},{"$error":"#REF!"},{"$f":"IF(C425=\"\",\"\",IF(LEN(Tabel2[[#This Row],[Entiteit of attribuut]])=2,\"\",Tabel2[[#This Row],[Entiteit]]&\"_\"&Tabel2[[#This Row],[Entiteit of attribuut]]))","v":{"$error":"#REF!"}},{"$f":"IF(Schema!#REF!=\"\",\"\",Schema!#REF!)","v":{"$error":"#REF!"}},{"$f":"IF(Schema!#REF!=\"\",\"\",Schema!#REF!)","v":{"$error":"#REF!"}},{"$f":"IF(Schema!#REF!=\"\",\"\",Schema!#REF!)","v":{"$error":"#REF!"}},{"$f":"IF(Schema!#REF!=\"\",\"\",Schema!#REF!)","v":{"$error":"#REF!"}},{"$f":"IF(Schema!#REF!=\"\",\"\",Schema!#REF!)","v":{"$error":"#REF!"}}]
[{"$f":"Schema!#REF!&Schema!#REF!&Schema!#REF!&Schema!#REF!","v":{"$error":"#REF!"}},{"$error":"#REF!"},{"$f":"IF(A426=\"\",\"\",IF(LEN(Schema!#REF!)=2,1,IF(LEN(Schema!#REF!)=2,10,IF(LEN(Schema!#REF!)=2,100,0))))","v":{"$error":"#REF!"}},{"$error":"#REF!"},{"$f":"IF(A426=\"\",\"\",SUM(Tabel2[[#This Row],[I1]:[I2]]))","v":{"$error":"#REF!"}},{"$error":"#REF!"},{"$error":"#REF!"},{"$error":"#REF!"},{"$error":"#REF!"},{"$f":"IF(C426=\"\",\"\",IF(LEN(Tabel2[[#This Row],[Entiteit of attribuut]])=2,\"\",Tabel2[[#This Row],[Entiteit]]&\"_\"&Tabel2[[#This Row],[Entiteit of attribuut]]))","v":{"$error":"#REF!"}},{"$f":"IF(Schema!#REF!=\"\",\"\",Schema!#REF!)","v":{"$error":"#REF!"}},{"$f":"IF(Schema!#REF!=\"\",\"\",Schema!#REF!)","v":{"$error":"#REF!"}},{"$f":"IF(Schema!#REF!=\"\",\"\",Schema!#REF!)","v":{"$error":"#REF!"}},{"$f":"IF(Schema!#REF!=\"\",\"\",Schema!#REF!)","v":{"$error":"#REF!"}},{"$f":"IF(Schema!#REF!=\"\",\"\",Schema!#REF!)","v":{"$error":"#REF!"}}]
[{"$f":"Schema!#REF!&Schema!#REF!&Schema!#REF!&Schema!#REF!","v":{"$error":"#REF!"}},{"$error":"#REF!"},{"$f":"IF(A427=\"\",\"\",IF(LEN(Schema!#REF!)=2,1,IF(LEN(Schema!#REF!)=2,10,IF(LEN(Schema!#REF!)=2,100,0))))","v":{"$error":"#REF!"}},{"$error":"#REF!"},{"$f":"IF(A427=\"\",\"\",SUM(Tabel2[[#This Row],[I1]:[I2]]))","v":{"$error":"#REF!"}},{"$error":"#REF!"},{"$error":"#REF!"},{"$error":"#REF!"},{"$error":"#REF!"},{"$f":"IF(C427=\"\",\"\",IF(LEN(Tabel2[[#This Row],[Entiteit of attribuut]])=2,\"\",Tabel2[[#This Row],[Entiteit]]&\"_\"&Tabel2[[#This Row],[Entiteit of attribuut]]))","v":{"$error":"#REF!"}},{"$f":"IF(Schema!#REF!=\"\",\"\",Schema!#REF!)","v":{"$error":"#REF!"}},{"$f":"IF(Schema!#REF!=\"\",\"\",Schema!#REF!)","v":{"$error":"#REF!"}},{"$f":"IF(Schema!#REF!=\"\",\"\",Schema!#REF!)","v":{"$error":"#REF!"}},{"$f":"IF(Schema!#REF!=\"\",\"\",Schema!#REF!)","v":{"$error":"#REF!"}},{"$f":"IF(Schema!#REF!=\"\",\"\",Schema!#REF!)","v":{"$error":"#REF!"}}]
[{"$f":"Schema!#REF!&Schema!#REF!&Schema!#REF!&Schema!#REF!","v":{"$error":"#REF!"}},{"$error":"#REF!"},{"$f":"IF(A428=\"\",\"\",IF(LEN(Schema!#REF!)=2,1,IF(LEN(Schema!#REF!)=2,10,IF(LEN(Schema!#REF!)=2,100,0))))","v":{"$error":"#REF!"}},{"$error":"#REF!"},{"$f":"IF(A428=\"\",\"\",SUM(Tabel2[[#This Row],[I1]:[I2]]))","v":{"$error":"#REF!"}},{"$error":"#REF!"},{"$error":"#REF!"},{"$error":"#REF!"},{"$error":"#REF!"},{"$f":"IF(C428=\"\",\"\",IF(LEN(Tabel2[[#This Row],[Entiteit of attribuut]])=2,\"\",Tabel2[[#This Row],[Entiteit]]&\"_\"&Tabel2[[#This Row],[Entiteit of attribuut]]))","v":{"$error":"#REF!"}},{"$f":"IF(Schema!#REF!=\"\",\"\",Schema!#REF!)","v":{"$error":"#REF!"}},{"$f":"IF(Schema!#REF!=\"\",\"\",Schema!#REF!)","v":{"$error":"#REF!"}},{"$f":"IF(Schema!#REF!=\"\",\"\",Schema!#REF!)","v":{"$error":"#REF!"}},{"$f":"IF(Schema!#REF!=\"\",\"\",Schema!#REF!)","v":{"$error":"#REF!"}},{"$f":"IF(Schema!#REF!=\"\",\"\",Schema!#REF!)","v":{"$error":"#REF!"}}]
[{"$f":"Schema!#REF!&Schema!#REF!&Schema!#REF!&Schema!#REF!","v":{"$error":"#REF!"}},{"$error":"#REF!"},{"$f":"IF(A429=\"\",\"\",IF(LEN(Schema!#REF!)=2,1,IF(LEN(Schema!#REF!)=2,10,IF(LEN(Schema!#REF!)=2,100,0))))","v":{"$error":"#REF!"}},{"$error":"#REF!"},{"$f":"IF(A429=\"\",\"\",SUM(Tabel2[[#This Row],[I1]:[I2]]))","v":{"$error":"#REF!"}},{"$error":"#REF!"},{"$error":"#REF!"},{"$error":"#REF!"},{"$error":"#REF!"},{"$f":"IF(C429=\"\",\"\",IF(LEN(Tabel2[[#This Row],[Entiteit of attribuut]])=2,\"\",Tabel2[[#This Row],[Entiteit]]&\"_\"&Tabel2[[#This Row],[Entiteit of attribuut]]))","v":{"$error":"#REF!"}},{"$f":"IF(Schema!#REF!=\"\",\"\",Schema!#REF!)","v":{"$error":"#REF!"}},{"$f":"IF(Schema!#REF!=\"\",\"\",Schema!#REF!)","v":{"$error":"#REF!"}},{"$f":"IF(Schema!#REF!=\"\",\"\",Schema!#REF!)","v":{"$error":"#REF!"}},{"$f":"IF(Schema!#REF!=\"\",\"\",Schema!#REF!)","v":{"$error":"#REF!"}},{"$f":"IF(Schema!#REF!=\"\",\"\",Schema!#REF!)","v":{"$error":"#REF!"}}]
[{"$f":"Schema!#REF!&Schema!#REF!&Schema!#REF!&Schema!#REF!","v":{"$error":"#REF!"}},{"$error":"#REF!"},{"$f":"IF(A430=\"\",\"\",IF(LEN(Schema!#REF!)=2,1,IF(LEN(Schema!#REF!)=2,10,IF(LEN(Schema!#REF!)=2,100,0))))","v":{"$error":"#REF!"}},{"$error":"#REF!"},{"$f":"IF(A430=\"\",\"\",SUM(Tabel2[[#This Row],[I1]:[I2]]))","v":{"$error":"#REF!"}},{"$error":"#REF!"},{"$error":"#REF!"},{"$error":"#REF!"},{"$error":"#REF!"},{"$f":"IF(C430=\"\",\"\",IF(LEN(Tabel2[[#This Row],[Entiteit of attribuut]])=2,\"\",Tabel2[[#This Row],[Entiteit]]&\"_\"&Tabel2[[#This Row],[Entiteit of attribuut]]))","v":{"$error":"#REF!"}},{"$f":"IF(Schema!#REF!=\"\",\"\",Schema!#REF!)","v":{"$error":"#REF!"}},{"$f":"IF(Schema!#REF!=\"\",\"\",Schema!#REF!)","v":{"$error":"#REF!"}},{"$f":"IF(Schema!#REF!=\"\",\"\",Schema!#REF!)","v":{"$error":"#REF!"}},{"$f":"IF(Schema!#REF!=\"\",\"\",Schema!#REF!)","v":{"$error":"#REF!"}},{"$f":"IF(Schema!#REF!=\"\",\"\",Schema!#REF!)","v":{"$error":"#REF!"}}]
[{"$f":"Schema!#REF!&Schema!#REF!&Schema!#REF!&Schema!#REF!","v":{"$error":"#REF!"}},{"$error":"#REF!"},{"$f":"IF(A431=\"\",\"\",IF(LEN(Schema!#REF!)=2,1,IF(LEN(Schema!#REF!)=2,10,IF(LEN(Schema!#REF!)=2,100,0))))","v":{"$error":"#REF!"}},{"$error":"#REF!"},{"$f":"IF(A431=\"\",\"\",SUM(Tabel2[[#This Row],[I1]:[I2]]))","v":{"$error":"#REF!"}},{"$error":"#REF!"},{"$error":"#REF!"},{"$error":"#REF!"},{"$error":"#REF!"},{"$f":"IF(C431=\"\",\"\",IF(LEN(Tabel2[[#This Row],[Entiteit of attribuut]])=2,\"\",Tabel2[[#This Row],[Entiteit]]&\"_\"&Tabel2[[#This Row],[Entiteit of attribuut]]))","v":{"$error":"#REF!"}},{"$f":"IF(Schema!#REF!=\"\",\"\",Schema!#REF!)","v":{"$error":"#REF!"}},{"$f":"IF(Schema!#REF!=\"\",\"\",Schema!#REF!)","v":{"$error":"#REF!"}},{"$f":"IF(Schema!#REF!=\"\",\"\",Schema!#REF!)","v":{"$error":"#REF!"}},{"$f":"IF(Schema!#REF!=\"\",\"\",Schema!#REF!)","v":{"$error":"#REF!"}},{"$f":"IF(Schema!#REF!=\"\",\"\",Schema!#REF!)","v":{"$error":"#REF!"}}]
[{"$f":"Schema!#REF!&Schema!#REF!&Schema!#REF!&Schema!#REF!","v":{"$error":"#REF!"}},{"$error":"#REF!"},{"$f":"IF(A432=\"\",\"\",IF(LEN(Schema!#REF!)=2,1,IF(LEN(Schema!#REF!)=2,10,IF(LEN(Schema!#REF!)=2,100,0))))","v":{"$error":"#REF!"}},{"$error":"#REF!"},{"$f":"IF(A432=\"\",\"\",SUM(Tabel2[[#This Row],[I1]:[I2]]))","v":{"$error":"#REF!"}},{"$error":"#REF!"},{"$error":"#REF!"},{"$error":"#REF!"},{"$error":"#REF!"},{"$f":"IF(C432=\"\",\"\",IF(LEN(Tabel2[[#This Row],[Entiteit of attribuut]])=2,\"\",Tabel2[[#This Row],[Entiteit]]&\"_\"&Tabel2[[#This Row],[Entiteit of attribuut]]))","v":{"$error":"#REF!"}},{"$f":"IF(Schema!#REF!=\"\",\"\",Schema!#REF!)","v":{"$error":"#REF!"}},{"$f":"IF(Schema!#REF!=\"\",\"\",Schema!#REF!)","v":{"$error":"#REF!"}},{"$f":"IF(Schema!#REF!=\"\",\"\",Schema!#REF!)","v":{"$error":"#REF!"}},{"$f":"IF(Schema!#REF!=\"\",\"\",Schema!#REF!)","v":{"$error":"#REF!"}},{"$f":"IF(Schema!#REF!=\"\",\"\",Schema!#REF!)","v":{"$error":"#REF!"}}]
[{"$f":"Schema!#REF!&Schema!#REF!&Schema!#REF!&Schema!#REF!","v":{"$error":"#REF!"}},{"$error":"#REF!"},{"$f":"IF(A433=\"\",\"\",IF(LEN(Schema!#REF!)=2,1,IF(LEN(Schema!#REF!)=2,10,IF(LEN(Schema!#REF!)=2,100,0))))","v":{"$error":"#REF!"}},{"$error":"#REF!"},{"$f":"IF(A433=\"\",\"\",SUM(Tabel2[[#This Row],[I1]:[I2]]))","v":{"$error":"#REF!"}},{"$error":"#REF!"},{"$error":"#REF!"},{"$error":"#REF!"},{"$error":"#REF!"},{"$f":"IF(C433=\"\",\"\",IF(LEN(Tabel2[[#This Row],[Entiteit of attribuut]])=2,\"\",Tabel2[[#This Row],[Entiteit]]&\"_\"&Tabel2[[#This Row],[Entiteit of attribuut]]))","v":{"$error":"#REF!"}},{"$f":"IF(Schema!#REF!=\"\",\"\",Schema!#REF!)","v":{"$error":"#REF!"}},{"$f":"IF(Schema!#REF!=\"\",\"\",Schema!#REF!)","v":{"$error":"#REF!"}},{"$f":"IF(Schema!#REF!=\"\",\"\",Schema!#REF!)","v":{"$error":"#REF!"}},{"$f":"IF(Schema!#REF!=\"\",\"\",Schema!#REF!)","v":{"$error":"#REF!"}},{"$f":"IF(Schema!#REF!=\"\",\"\",Schema!#REF!)","v":{"$error":"#REF!"}}]
[{"$f":"Schema!#REF!&Schema!#REF!&Schema!#REF!&Schema!#REF!","v":{"$error":"#REF!"}},{"$error":"#REF!"},{"$f":"IF(A434=\"\",\"\",IF(LEN(Schema!#REF!)=2,1,IF(LEN(Schema!#REF!)=2,10,IF(LEN(Schema!#REF!)=2,100,0))))","v":{"$error":"#REF!"}},{"$error":"#REF!"},{"$f":"IF(A434=\"\",\"\",SUM(Tabel2[[#This Row],[I1]:[I2]]))","v":{"$error":"#REF!"}},{"$error":"#REF!"},{"$error":"#REF!"},{"$error":"#REF!"},{"$error":"#REF!"},{"$f":"IF(C434=\"\",\"\",IF(LEN(Tabel2[[#This Row],[Entiteit of attribuut]])=2,\"\",Tabel2[[#This Row],[Entiteit]]&\"_\"&Tabel2[[#This Row],[Entiteit of attribuut]]))","v":{"$error":"#REF!"}},{"$f":"IF(Schema!#REF!=\"\",\"\",Schema!#REF!)","v":{"$error":"#REF!"}},{"$f":"IF(Schema!#REF!=\"\",\"\",Schema!#REF!)","v":{"$error":"#REF!"}},{"$f":"IF(Schema!#REF!=\"\",\"\",Schema!#REF!)","v":{"$error":"#REF!"}},{"$f":"IF(Schema!#REF!=\"\",\"\",Schema!#REF!)","v":{"$error":"#REF!"}},{"$f":"IF(Schema!#REF!=\"\",\"\",Schema!#REF!)","v":{"$error":"#REF!"}}]
[{"$f":"Schema!#REF!&Schema!#REF!&Schema!#REF!&Schema!#REF!","v":{"$error":"#REF!"}},{"$error":"#REF!"},{"$f":"IF(A435=\"\",\"\",IF(LEN(Schema!#REF!)=2,1,IF(LEN(Schema!#REF!)=2,10,IF(LEN(Schema!#REF!)=2,100,0))))","v":{"$error":"#REF!"}},{"$error":"#REF!"},{"$f":"IF(A435=\"\",\"\",SUM(Tabel2[[#This Row],[I1]:[I2]]))","v":{"$error":"#REF!"}},{"$error":"#REF!"},{"$error":"#REF!"},{"$error":"#REF!"},{"$error":"#REF!"},{"$f":"IF(C435=\"\",\"\",IF(LEN(Tabel2[[#This Row],[Entiteit of attribuut]])=2,\"\",Tabel2[[#This Row],[Entiteit]]&\"_\"&Tabel2[[#This Row],[Entiteit of attribuut]]))","v":{"$error":"#REF!"}},{"$f":"IF(Schema!#REF!=\"\",\"\",Schema!#REF!)","v":{"$error":"#REF!"}},{"$f":"IF(Schema!#REF!=\"\",\"\",Schema!#REF!)","v":{"$error":"#REF!"}},{"$f":"IF(Schema!#REF!=\"\",\"\",Schema!#REF!)","v":{"$error":"#REF!"}},{"$f":"IF(Schema!#REF!=\"\",\"\",Schema!#REF!)","v":{"$error":"#REF!"}},{"$f":"IF(Schema!#REF!=\"\",\"\",Schema!#REF!)","v":{"$error":"#REF!"}}]
[{"$f":"Schema!#REF!&Schema!#REF!&Schema!#REF!&Schema!#REF!","v":{"$error":"#REF!"}},{"$error":"#REF!"},{"$f":"IF(A436=\"\",\"\",IF(LEN(Schema!#REF!)=2,1,IF(LEN(Schema!#REF!)=2,10,IF(LEN(Schema!#REF!)=2,100,0))))","v":{"$error":"#REF!"}},{"$error":"#REF!"},{"$f":"IF(A436=\"\",\"\",SUM(Tabel2[[#This Row],[I1]:[I2]]))","v":{"$error":"#REF!"}},{"$error":"#REF!"},{"$error":"#REF!"},{"$error":"#REF!"},{"$error":"#REF!"},{"$f":"IF(C436=\"\",\"\",IF(LEN(Tabel2[[#This Row],[Entiteit of attribuut]])=2,\"\",Tabel2[[#This Row],[Entiteit]]&\"_\"&Tabel2[[#This Row],[Entiteit of attribuut]]))","v":{"$error":"#REF!"}},{"$f":"IF(Schema!#REF!=\"\",\"\",Schema!#REF!)","v":{"$error":"#REF!"}},{"$f":"IF(Schema!#REF!=\"\",\"\",Schema!#REF!)","v":{"$error":"#REF!"}},{"$f":"IF(Schema!#REF!=\"\",\"\",Schema!#REF!)","v":{"$error":"#REF!"}},{"$f":"IF(Schema!#REF!=\"\",\"\",Schema!#REF!)","v":{"$error":"#REF!"}},{"$f":"IF(Schema!#REF!=\"\",\"\",Schema!#REF!)","v":{"$error":"#REF!"}}]
[{"$f":"Schema!#REF!&Schema!#REF!&Schema!#REF!&Schema!#REF!","v":{"$error":"#REF!"}},{"$error":"#REF!"},{"$f":"IF(A437=\"\",\"\",IF(LEN(Schema!#REF!)=2,1,IF(LEN(Schema!#REF!)=2,10,IF(LEN(Schema!#REF!)=2,100,0))))","v":{"$error":"#REF!"}},{"$error":"#REF!"},{"$f":"IF(A437=\"\",\"\",SUM(Tabel2[[#This Row],[I1]:[I2]]))","v":{"$error":"#REF!"}},{"$error":"#REF!"},{"$error":"#REF!"},{"$error":"#REF!"},{"$error":"#REF!"},{"$f":"IF(C437=\"\",\"\",IF(LEN(Tabel2[[#This Row],[Entiteit of attribuut]])=2,\"\",Tabel2[[#This Row],[Entiteit]]&\"_\"&Tabel2[[#This Row],[Entiteit of attribuut]]))","v":{"$error":"#REF!"}},{"$f":"IF(Schema!#REF!=\"\",\"\",Schema!#REF!)","v":{"$error":"#REF!"}},{"$f":"IF(Schema!#REF!=\"\",\"\",Schema!#REF!)","v":{"$error":"#REF!"}},{"$f":"IF(Schema!#REF!=\"\",\"\",Schema!#REF!)","v":{"$error":"#REF!"}},{"$f":"IF(Schema!#REF!=\"\",\"\",Schema!#REF!)","v":{"$error":"#REF!"}},{"$f":"IF(Schema!#REF!=\"\",\"\",Schema!#REF!)","v":{"$error":"#REF!"}}]
[{"$f":"Schema!#REF!&Schema!#REF!&Schema!#REF!&Schema!#REF!","v":{"$error":"#REF!"}},{"$error":"#REF!"},{"$f":"IF(A438=\"\",\"\",IF(LEN(Schema!#REF!)=2,1,IF(LEN(Schema!#REF!)=2,10,IF(LEN(Schema!#REF!)=2,100,0))))","v":{"$error":"#REF!"}},{"$error":"#REF!"},{"$f":"IF(A438=\"\",\"\",SUM(Tabel2[[#This Row],[I1]:[I2]]))","v":{"$error":"#REF!"}},{"$error":"#REF!"},{"$error":"#REF!"},{"$error":"#REF!"},{"$error":"#REF!"},{"$f":"IF(C438=\"\",\"\",IF(LEN(Tabel2[[#This Row],[Entiteit of attribuut]])=2,\"\",Tabel2[[#This Row],[Entiteit]]&\"_\"&Tabel2[[#This Row],[Entiteit of attribuut]]))","v":{"$error":"#REF!"}},{"$f":"IF(Schema!#REF!=\"\",\"\",Schema!#REF!)","v":{"$error":"#REF!"}},{"$f":"IF(Schema!#REF!=\"\",\"\",Schema!#REF!)","v":{"$error":"#REF!"}},{"$f":"IF(Schema!#REF!=\"\",\"\",Schema!#REF!)","v":{"$error":"#REF!"}},{"$f":"IF(Schema!#REF!=\"\",\"\",Schema!#REF!)","v":{"$error":"#REF!"}},{"$f":"IF(Schema!#REF!=\"\",\"\",Schema!#REF!)","v":{"$error":"#REF!"}}]
[{"$f":"Schema!#REF!&Schema!#REF!&Schema!#REF!&Schema!#REF!","v":{"$error":"#REF!"}},{"$error":"#REF!"},{"$f":"IF(A439=\"\",\"\",IF(LEN(Schema!#REF!)=2,1,IF(LEN(Schema!#REF!)=2,10,IF(LEN(Schema!#REF!)=2,100,0))))","v":{"$error":"#REF!"}},{"$error":"#REF!"},{"$f":"IF(A439=\"\",\"\",SUM(Tabel2[[#This Row],[I1]:[I2]]))","v":{"$error":"#REF!"}},{"$error":"#REF!"},{"$error":"#REF!"},{"$error":"#REF!"},{"$error":"#REF!"},{"$f":"IF(C439=\"\",\"\",IF(LEN(Tabel2[[#This Row],[Entiteit of attribuut]])=2,\"\",Tabel2[[#This Row],[Entiteit]]&\"_\"&Tabel2[[#This Row],[Entiteit of attribuut]]))","v":{"$error":"#REF!"}},{"$f":"IF(Schema!#REF!=\"\",\"\",Schema!#REF!)","v":{"$error":"#REF!"}},{"$f":"IF(Schema!#REF!=\"\",\"\",Schema!#REF!)","v":{"$error":"#REF!"}},{"$f":"IF(Schema!#REF!=\"\",\"\",Schema!#REF!)","v":{"$error":"#REF!"}},{"$f":"IF(Schema!#REF!=\"\",\"\",Schema!#REF!)","v":{"$error":"#REF!"}},{"$f":"IF(Schema!#REF!=\"\",\"\",Schema!#REF!)","v":{"$error":"#REF!"}}]
[{"$f":"Schema!#REF!&Schema!#REF!&Schema!#REF!&Schema!#REF!","v":{"$error":"#REF!"}},{"$error":"#REF!"},{"$f":"IF(A440=\"\",\"\",IF(LEN(Schema!#REF!)=2,1,IF(LEN(Schema!#REF!)=2,10,IF(LEN(Schema!#REF!)=2,100,0))))","v":{"$error":"#REF!"}},{"$error":"#REF!"},{"$f":"IF(A440=\"\",\"\",SUM(Tabel2[[#This Row],[I1]:[I2]]))","v":{"$error":"#REF!"}},{"$error":"#REF!"},{"$error":"#REF!"},{"$error":"#REF!"},{"$error":"#REF!"},{"$f":"IF(C440=\"\",\"\",IF(LEN(Tabel2[[#This Row],[Entiteit of attribuut]])=2,\"\",Tabel2[[#This Row],[Entiteit]]&\"_\"&Tabel2[[#This Row],[Entiteit of attribuut]]))","v":{"$error":"#REF!"}},{"$f":"IF(Schema!#REF!=\"\",\"\",Schema!#REF!)","v":{"$error":"#REF!"}},{"$f":"IF(Schema!#REF!=\"\",\"\",Schema!#REF!)","v":{"$error":"#REF!"}},{"$f":"IF(Schema!#REF!=\"\",\"\",Schema!#REF!)","v":{"$error":"#REF!"}},{"$f":"IF(Schema!#REF!=\"\",\"\",Schema!#REF!)","v":{"$error":"#REF!"}},{"$f":"IF(Schema!#REF!=\"\",\"\",Schema!#REF!)","v":{"$error":"#REF!"}}]
[{"$f":"Schema!#REF!&Schema!#REF!&Schema!#REF!&Schema!#REF!","v":{"$error":"#REF!"}},{"$error":"#REF!"},{"$f":"IF(A441=\"\",\"\",IF(LEN(Schema!#REF!)=2,1,IF(LEN(Schema!#REF!)=2,10,IF(LEN(Schema!#REF!)=2,100,0))))","v":{"$error":"#REF!"}},{"$error":"#REF!"},{"$f":"IF(A441=\"\",\"\",SUM(Tabel2[[#This Row],[I1]:[I2]]))","v":{"$error":"#REF!"}},{"$error":"#REF!"},{"$error":"#REF!"},{"$error":"#REF!"},{"$error":"#REF!"},{"$f":"IF(C441=\"\",\"\",IF(LEN(Tabel2[[#This Row],[Entiteit of attribuut]])=2,\"\",Tabel2[[#This Row],[Entiteit]]&\"_\"&Tabel2[[#This Row],[Entiteit of attribuut]]))","v":{"$error":"#REF!"}},{"$f":"IF(Schema!#REF!=\"\",\"\",Schema!#REF!)","v":{"$error":"#REF!"}},{"$f":"IF(Schema!#REF!=\"\",\"\",Schema!#REF!)","v":{"$error":"#REF!"}},{"$f":"IF(Schema!#REF!=\"\",\"\",Schema!#REF!)","v":{"$error":"#REF!"}},{"$f":"IF(Schema!#REF!=\"\",\"\",Schema!#REF!)","v":{"$error":"#REF!"}},{"$f":"IF(Schema!#REF!=\"\",\"\",Schema!#REF!)","v":{"$error":"#REF!"}}]
[{"$f":"Schema!#REF!&Schema!#REF!&Schema!#REF!&Schema!#REF!","v":{"$error":"#REF!"}},{"$error":"#REF!"},{"$f":"IF(A442=\"\",\"\",IF(LEN(Schema!#REF!)=2,1,IF(LEN(Schema!#REF!)=2,10,IF(LEN(Schema!#REF!)=2,100,0))))","v":{"$error":"#REF!"}},{"$error":"#REF!"},{"$f":"IF(A442=\"\",\"\",SUM(Tabel2[[#This Row],[I1]:[I2]]))","v":{"$error":"#REF!"}},{"$error":"#REF!"},{"$error":"#REF!"},{"$error":"#REF!"},{"$error":"#REF!"},{"$f":"IF(C442=\"\",\"\",IF(LEN(Tabel2[[#This Row],[Entiteit of attribuut]])=2,\"\",Tabel2[[#This Row],[Entiteit]]&\"_\"&Tabel2[[#This Row],[Entiteit of attribuut]]))","v":{"$error":"#REF!"}},{"$f":"IF(Schema!#REF!=\"\",\"\",Schema!#REF!)","v":{"$error":"#REF!"}},{"$f":"IF(Schema!#REF!=\"\",\"\",Schema!#REF!)","v":{"$error":"#REF!"}},{"$f":"IF(Schema!#REF!=\"\",\"\",Schema!#REF!)","v":{"$error":"#REF!"}},{"$f":"IF(Schema!#REF!=\"\",\"\",Schema!#REF!)","v":{"$error":"#REF!"}},{"$f":"IF(Schema!#REF!=\"\",\"\",Schema!#REF!)","v":{"$error":"#REF!"}}]
[{"$f":"Schema!#REF!&Schema!#REF!&Schema!#REF!&Schema!#REF!","v":{"$error":"#REF!"}},{"$error":"#REF!"},{"$f":"IF(A443=\"\",\"\",IF(LEN(Schema!#REF!)=2,1,IF(LEN(Schema!#REF!)=2,10,IF(LEN(Schema!#REF!)=2,100,0))))","v":{"$error":"#REF!"}},{"$error":"#REF!"},{"$f":"IF(A443=\"\",\"\",SUM(Tabel2[[#This Row],[I1]:[I2]]))","v":{"$error":"#REF!"}},{"$error":"#REF!"},{"$error":"#REF!"},{"$error":"#REF!"},{"$error":"#REF!"},{"$f":"IF(C443=\"\",\"\",IF(LEN(Tabel2[[#This Row],[Entiteit of attribuut]])=2,\"\",Tabel2[[#This Row],[Entiteit]]&\"_\"&Tabel2[[#This Row],[Entiteit of attribuut]]))","v":{"$error":"#REF!"}},{"$f":"IF(Schema!#REF!=\"\",\"\",Schema!#REF!)","v":{"$error":"#REF!"}},{"$f":"IF(Schema!#REF!=\"\",\"\",Schema!#REF!)","v":{"$error":"#REF!"}},{"$f":"IF(Schema!#REF!=\"\",\"\",Schema!#REF!)","v":{"$error":"#REF!"}},{"$f":"IF(Schema!#REF!=\"\",\"\",Schema!#REF!)","v":{"$error":"#REF!"}},{"$f":"IF(Schema!#REF!=\"\",\"\",Schema!#REF!)","v":{"$error":"#REF!"}}]
[{"$f":"Schema!#REF!&Schema!#REF!&Schema!#REF!&Schema!#REF!","v":{"$error":"#REF!"}},{"$error":"#REF!"},{"$f":"IF(A444=\"\",\"\",IF(LEN(Schema!#REF!)=2,1,IF(LEN(Schema!#REF!)=2,10,IF(LEN(Schema!#REF!)=2,100,0))))","v":{"$error":"#REF!"}},{"$error":"#REF!"},{"$f":"IF(A444=\"\",\"\",SUM(Tabel2[[#This Row],[I1]:[I2]]))","v":{"$error":"#REF!"}},{"$error":"#REF!"},{"$error":"#REF!"},{"$error":"#REF!"},{"$error":"#REF!"},{"$f":"IF(C444=\"\",\"\",IF(LEN(Tabel2[[#This Row],[Entiteit of attribuut]])=2,\"\",Tabel2[[#This Row],[Entiteit]]&\"_\"&Tabel2[[#This Row],[Entiteit of attribuut]]))","v":{"$error":"#REF!"}},{"$f":"IF(Schema!#REF!=\"\",\"\",Schema!#REF!)","v":{"$error":"#REF!"}},{"$f":"IF(Schema!#REF!=\"\",\"\",Schema!#REF!)","v":{"$error":"#REF!"}},{"$f":"IF(Schema!#REF!=\"\",\"\",Schema!#REF!)","v":{"$error":"#REF!"}},{"$f":"IF(Schema!#REF!=\"\",\"\",Schema!#REF!)","v":{"$error":"#REF!"}},{"$f":"IF(Schema!#REF!=\"\",\"\",Schema!#REF!)","v":{"$error":"#REF!"}}]
[{"$f":"Schema!#REF!&Schema!#REF!&Schema!#REF!&Schema!#REF!","v":{"$error":"#REF!"}},{"$error":"#REF!"},{"$f":"IF(A445=\"\",\"\",IF(LEN(Schema!#REF!)=2,1,IF(LEN(Schema!#REF!)=2,10,IF(LEN(Schema!#REF!)=2,100,0))))","v":{"$error":"#REF!"}},{"$error":"#REF!"},{"$f":"IF(A445=\"\",\"\",SUM(Tabel2[[#This Row],[I1]:[I2]]))","v":{"$error":"#REF!"}},{"$error":"#REF!"},{"$error":"#REF!"},{"$error":"#REF!"},{"$error":"#REF!"},{"$f":"IF(C445=\"\",\"\",IF(LEN(Tabel2[[#This Row],[Entiteit of attribuut]])=2,\"\",Tabel2[[#This Row],[Entiteit]]&\"_\"&Tabel2[[#This Row],[Entiteit of attribuut]]))","v":{"$error":"#REF!"}},{"$f":"IF(Schema!#REF!=\"\",\"\",Schema!#REF!)","v":{"$error":"#REF!"}},{"$f":"IF(Schema!#REF!=\"\",\"\",Schema!#REF!)","v":{"$error":"#REF!"}},{"$f":"IF(Schema!#REF!=\"\",\"\",Schema!#REF!)","v":{"$error":"#REF!"}},{"$f":"IF(Schema!#REF!=\"\",\"\",Schema!#REF!)","v":{"$error":"#REF!"}},{"$f":"IF(Schema!#REF!=\"\",\"\",Schema!#REF!)","v":{"$error":"#REF!"}}]
[{"$f":"Schema!#REF!&Schema!#REF!&Schema!#REF!&Schema!#REF!","v":{"$error":"#REF!"}},{"$error":"#REF!"},{"$f":"IF(A446=\"\",\"\",IF(LEN(Schema!#REF!)=2,1,IF(LEN(Schema!#REF!)=2,10,IF(LEN(Schema!#REF!)=2,100,0))))","v":{"$error":"#REF!"}},{"$error":"#REF!"},{"$f":"IF(A446=\"\",\"\",SUM(Tabel2[[#This Row],[I1]:[I2]]))","v":{"$error":"#REF!"}},{"$error":"#REF!"},{"$error":"#REF!"},{"$error":"#REF!"},{"$error":"#REF!"},{"$f":"IF(C446=\"\",\"\",IF(LEN(Tabel2[[#This Row],[Entiteit of attribuut]])=2,\"\",Tabel2[[#This Row],[Entiteit]]&\"_\"&Tabel2[[#This Row],[Entiteit of attribuut]]))","v":{"$error":"#REF!"}},{"$f":"IF(Schema!#REF!=\"\",\"\",Schema!#REF!)","v":{"$error":"#REF!"}},{"$f":"IF(Schema!#REF!=\"\",\"\",Schema!#REF!)","v":{"$error":"#REF!"}},{"$f":"IF(Schema!#REF!=\"\",\"\",Schema!#REF!)","v":{"$error":"#REF!"}},{"$f":"IF(Schema!#REF!=\"\",\"\",Schema!#REF!)","v":{"$error":"#REF!"}},{"$f":"IF(Schema!#REF!=\"\",\"\",Schema!#REF!)","v":{"$error":"#REF!"}}]
[{"$f":"Schema!#REF!&Schema!#REF!&Schema!#REF!&Schema!#REF!","v":{"$error":"#REF!"}},{"$error":"#REF!"},{"$f":"IF(A447=\"\",\"\",IF(LEN(Schema!#REF!)=2,1,IF(LEN(Schema!#REF!)=2,10,IF(LEN(Schema!#REF!)=2,100,0))))","v":{"$error":"#REF!"}},{"$error":"#REF!"},{"$f":"IF(A447=\"\",\"\",SUM(Tabel2[[#This Row],[I1]:[I2]]))","v":{"$error":"#REF!"}},{"$error":"#REF!"},{"$error":"#REF!"},{"$error":"#REF!"},{"$error":"#REF!"},{"$f":"IF(C447=\"\",\"\",IF(LEN(Tabel2[[#This Row],[Entiteit of attribuut]])=2,\"\",Tabel2[[#This Row],[Entiteit]]&\"_\"&Tabel2[[#This Row],[Entiteit of attribuut]]))","v":{"$error":"#REF!"}},{"$f":"IF(Schema!#REF!=\"\",\"\",Schema!#REF!)","v":{"$error":"#REF!"}},{"$f":"IF(Schema!#REF!=\"\",\"\",Schema!#REF!)","v":{"$error":"#REF!"}},{"$f":"IF(Schema!#REF!=\"\",\"\",Schema!#REF!)","v":{"$error":"#REF!"}},{"$f":"IF(Schema!#REF!=\"\",\"\",Schema!#REF!)","v":{"$error":"#REF!"}},{"$f":"IF(Schema!#REF!=\"\",\"\",Schema!#REF!)","v":{"$error":"#REF!"}}]
[{"$f":"Schema!#REF!&Schema!#REF!&Schema!#REF!&Schema!#REF!","v":{"$error":"#REF!"}},{"$error":"#REF!"},{"$f":"IF(A448=\"\",\"\",IF(LEN(Schema!#REF!)=2,1,IF(LEN(Schema!#REF!)=2,10,IF(LEN(Schema!#REF!)=2,100,0))))","v":{"$error":"#REF!"}},{"$error":"#REF!"},{"$f":"IF(A448=\"\",\"\",SUM(Tabel2[[#This Row],[I1]:[I2]]))","v":{"$error":"#REF!"}},{"$error":"#REF!"},{"$error":"#REF!"},{"$error":"#REF!"},{"$error":"#REF!"},{"$f":"IF(C448=\"\",\"\",IF(LEN(Tabel2[[#This Row],[Entiteit of attribuut]])=2,\"\",Tabel2[[#This Row],[Entiteit]]&\"_\"&Tabel2[[#This Row],[Entiteit of attribuut]]))","v":{"$error":"#REF!"}},{"$f":"IF(Schema!#REF!=\"\",\"\",Schema!#REF!)","v":{"$error":"#REF!"}},{"$f":"IF(Schema!#REF!=\"\",\"\",Schema!#REF!)","v":{"$error":"#REF!"}},{"$f":"IF(Schema!#REF!=\"\",\"\",Schema!#REF!)","v":{"$error":"#REF!"}},{"$f":"IF(Schema!#REF!=\"\",\"\",Schema!#REF!)","v":{"$error":"#REF!"}},{"$f":"IF(Schema!#REF!=\"\",\"\",Schema!#REF!)","v":{"$error":"#REF!"}}]
[{"$f":"Schema!#REF!&Schema!#REF!&Schema!#REF!&Schema!#REF!","v":{"$error":"#REF!"}},{"$error":"#REF!"},{"$f":"IF(A449=\"\",\"\",IF(LEN(Schema!#REF!)=2,1,IF(LEN(Schema!#REF!)=2,10,IF(LEN(Schema!#REF!)=2,100,0))))","v":{"$error":"#REF!"}},{"$error":"#REF!"},{"$f":"IF(A449=\"\",\"\",SUM(Tabel2[[#This Row],[I1]:[I2]]))","v":{"$error":"#REF!"}},{"$error":"#REF!"},{"$error":"#REF!"},{"$error":"#REF!"},{"$error":"#REF!"},{"$f":"IF(C449=\"\",\"\",IF(LEN(Tabel2[[#This Row],[Entiteit of attribuut]])=2,\"\",Tabel2[[#This Row],[Entiteit]]&\"_\"&Tabel2[[#This Row],[Entiteit of attribuut]]))","v":{"$error":"#REF!"}},{"$f":"IF(Schema!#REF!=\"\",\"\",Schema!#REF!)","v":{"$error":"#REF!"}},{"$f":"IF(Schema!#REF!=\"\",\"\",Schema!#REF!)","v":{"$error":"#REF!"}},{"$f":"IF(Schema!#REF!=\"\",\"\",Schema!#REF!)","v":{"$error":"#REF!"}},{"$f":"IF(Schema!#REF!=\"\",\"\",Schema!#REF!)","v":{"$error":"#REF!"}},{"$f":"IF(Schema!#REF!=\"\",\"\",Schema!#REF!)","v":{"$error":"#REF!"}}]
[{"$f":"Schema!#REF!&Schema!#REF!&Schema!#REF!&Schema!#REF!","v":{"$error":"#REF!"}},{"$error":"#REF!"},{"$f":"IF(A450=\"\",\"\",IF(LEN(Schema!#REF!)=2,1,IF(LEN(Schema!#REF!)=2,10,IF(LEN(Schema!#REF!)=2,100,0))))","v":{"$error":"#REF!"}},{"$error":"#REF!"},{"$f":"IF(A450=\"\",\"\",SUM(Tabel2[[#This Row],[I1]:[I2]]))","v":{"$error":"#REF!"}},{"$error":"#REF!"},{"$error":"#REF!"},{"$error":"#REF!"},{"$error":"#REF!"},{"$f":"IF(C450=\"\",\"\",IF(LEN(Tabel2[[#This Row],[Entiteit of attribuut]])=2,\"\",Tabel2[[#This Row],[Entiteit]]&\"_\"&Tabel2[[#This Row],[Entiteit of attribuut]]))","v":{"$error":"#REF!"}},{"$f":"IF(Schema!#REF!=\"\",\"\",Schema!#REF!)","v":{"$error":"#REF!"}},{"$f":"IF(Schema!#REF!=\"\",\"\",Schema!#REF!)","v":{"$error":"#REF!"}},{"$f":"IF(Schema!#REF!=\"\",\"\",Schema!#REF!)","v":{"$error":"#REF!"}},{"$f":"IF(Schema!#REF!=\"\",\"\",Schema!#REF!)","v":{"$error":"#REF!"}},{"$f":"IF(Schema!#REF!=\"\",\"\",Schema!#REF!)","v":{"$error":"#REF!"}}]
[{"$f":"Schema!#REF!&Schema!#REF!&Schema!#REF!&Schema!#REF!","v":{"$error":"#REF!"}},{"$f":"IF(LEN(A451)=2,A451,IF(A451=\"\",\"Leeg\",B450))","v":{"$error":"#REF!"}},{"$f":"IF(A451=\"\",\"\",IF(LEN(Schema!#REF!)=2,1,IF(LEN(Schema!#REF!)=2,10,IF(LEN(Schema!#REF!)=2,100,0))))","v":{"$error":"#REF!"}},{"$f":"IF(C451=0,D450,C451)","v":{"$error":"#REF!"}},{"$f":"IF(A451=\"\",\"\",SUM(Tabel2[[#This Row],[I1]:[I2]]))","v":{"$error":"#REF!"}},{"$f":"IF(A451=\"\",\"\",IF(C451=1,B451,F450))","v":{"$error":"#REF!"}},{"$f":"IF(C451=10,A451,IF(OR(C451=0,C451=100),G450,\"\"))","v":{"$error":"#REF!"}},{"$f":"IF(E451=200,B451,IF(C451=0,H450,\"\"))","v":{"$error":"#REF!"}},{"$f":"IF(C451=\"\",\"\",IF(OR(E451=1,E451=10,E451=100),I450,IF(E451=2,F451,IF(E451=20,F451&\"/\"&G451,IF(E451=200,F451&\"/\"&G451&\"/\"&H451)))))","v":{"$error":"#REF!"}},{"$f":"IF(C451=\"\",\"\",IF(LEN(Tabel2[[#This Row],[Entiteit of attribuut]])=2,\"\",Tabel2[[#This Row],[Entiteit]]&\"_\"&Tabel2[[#This Row],[Entiteit of attribuut]]))","v":{"$error":"#REF!"}},{"$f":"IF(Schema!#REF!=\"\",\"\",Schema!#REF!)","v":{"$error":"#REF!"}},{"$f":"IF(Schema!#REF!=\"\",\"\",Schema!#REF!)","v":{"$error":"#REF!"}},{"$f":"IF(Schema!#REF!=\"\",\"\",Schema!#REF!)","v":{"$error":"#REF!"}},{"$f":"IF(Schema!#REF!=\"\",\"\",Schema!#REF!)","v":{"$error":"#REF!"}},{"$f":"IF(Schema!#REF!=\"\",\"\",Schema!#REF!)","v":{"$error":"#REF!"}}]
[{"$f":"Schema!#REF!&Schema!#REF!&Schema!#REF!&Schema!#REF!","v":{"$error":"#REF!"}},{"$error":"#REF!"},{"$f":"IF(A452=\"\",\"\",IF(LEN(Schema!#REF!)=2,1,IF(LEN(Schema!#REF!)=2,10,IF(LEN(Schema!#REF!)=2,100,0))))","v":{"$error":"#REF!"}},{"$error":"#REF!"},{"$f":"IF(A452=\"\",\"\",SUM(Tabel2[[#This Row],[I1]:[I2]]))","v":{"$error":"#REF!"}},{"$error":"#REF!"},{"$error":"#REF!"},{"$error":"#REF!"},{"$error":"#REF!"},{"$f":"IF(C452=\"\",\"\",IF(LEN(Tabel2[[#This Row],[Entiteit of attribuut]])=2,\"\",Tabel2[[#This Row],[Entiteit]]&\"_\"&Tabel2[[#This Row],[Entiteit of attribuut]]))","v":{"$error":"#REF!"}},{"$f":"IF(Schema!#REF!=\"\",\"\",Schema!#REF!)","v":{"$error":"#REF!"}},{"$f":"IF(Schema!#REF!=\"\",\"\",Schema!#REF!)","v":{"$error":"#REF!"}},{"$f":"IF(Schema!#REF!=\"\",\"\",Schema!#REF!)","v":{"$error":"#REF!"}},{"$f":"IF(Schema!#REF!=\"\",\"\",Schema!#REF!)","v":{"$error":"#REF!"}},{"$f":"IF(Schema!#REF!=\"\",\"\",Schema!#REF!)","v":{"$error":"#REF!"}}]
[{"$f":"Schema!#REF!&Schema!#REF!&Schema!#REF!&Schema!#REF!","v":{"$error":"#REF!"}},{"$error":"#REF!"},{"$f":"IF(A453=\"\",\"\",IF(LEN(Schema!#REF!)=2,1,IF(LEN(Schema!#REF!)=2,10,IF(LEN(Schema!#REF!)=2,100,0))))","v":{"$error":"#REF!"}},{"$error":"#REF!"},{"$f":"IF(A453=\"\",\"\",SUM(Tabel2[[#This Row],[I1]:[I2]]))","v":{"$error":"#REF!"}},{"$error":"#REF!"},{"$error":"#REF!"},{"$error":"#REF!"},{"$error":"#REF!"},{"$f":"IF(C453=\"\",\"\",IF(LEN(Tabel2[[#This Row],[Entiteit of attribuut]])=2,\"\",Tabel2[[#This Row],[Entiteit]]&\"_\"&Tabel2[[#This Row],[Entiteit of attribuut]]))","v":{"$error":"#REF!"}},{"$f":"IF(Schema!#REF!=\"\",\"\",Schema!#REF!)","v":{"$error":"#REF!"}},{"$f":"IF(Schema!#REF!=\"\",\"\",Schema!#REF!)","v":{"$error":"#REF!"}},{"$f":"IF(Schema!#REF!=\"\",\"\",Schema!#REF!)","v":{"$error":"#REF!"}},{"$f":"IF(Schema!#REF!=\"\",\"\",Schema!#REF!)","v":{"$error":"#REF!"}},{"$f":"IF(Schema!#REF!=\"\",\"\",Schema!#REF!)","v":{"$error":"#REF!"}}]
[{"$f":"Schema!#REF!&Schema!#REF!&Schema!#REF!&Schema!#REF!","v":{"$error":"#REF!"}},{"$error":"#REF!"},{"$f":"IF(A454=\"\",\"\",IF(LEN(Schema!#REF!)=2,1,IF(LEN(Schema!#REF!)=2,10,IF(LEN(Schema!#REF!)=2,100,0))))","v":{"$error":"#REF!"}},{"$error":"#REF!"},{"$f":"IF(A454=\"\",\"\",SUM(Tabel2[[#This Row],[I1]:[I2]]))","v":{"$error":"#REF!"}},{"$error":"#REF!"},{"$error":"#REF!"},{"$error":"#REF!"},{"$error":"#REF!"},{"$f":"IF(C454=\"\",\"\",IF(LEN(Tabel2[[#This Row],[Entiteit of attribuut]])=2,\"\",Tabel2[[#This Row],[Entiteit]]&\"_\"&Tabel2[[#This Row],[Entiteit of attribuut]]))","v":{"$error":"#REF!"}},{"$f":"IF(Schema!#REF!=\"\",\"\",Schema!#REF!)","v":{"$error":"#REF!"}},{"$f":"IF(Schema!#REF!=\"\",\"\",Schema!#REF!)","v":{"$error":"#REF!"}},{"$f":"IF(Schema!#REF!=\"\",\"\",Schema!#REF!)","v":{"$error":"#REF!"}},{"$f":"IF(Schema!#REF!=\"\",\"\",Schema!#REF!)","v":{"$error":"#REF!"}},{"$f":"IF(Schema!#REF!=\"\",\"\",Schema!#REF!)","v":{"$error":"#REF!"}}]
[{"$f":"Schema!#REF!&Schema!#REF!&Schema!#REF!&Schema!#REF!","v":{"$error":"#REF!"}},{"$error":"#REF!"},{"$f":"IF(A455=\"\",\"\",IF(LEN(Schema!#REF!)=2,1,IF(LEN(Schema!#REF!)=2,10,IF(LEN(Schema!#REF!)=2,100,0))))","v":{"$error":"#REF!"}},{"$error":"#REF!"},{"$f":"IF(A455=\"\",\"\",SUM(Tabel2[[#This Row],[I1]:[I2]]))","v":{"$error":"#REF!"}},{"$error":"#REF!"},{"$error":"#REF!"},{"$error":"#REF!"},{"$error":"#REF!"},{"$f":"IF(C455=\"\",\"\",IF(LEN(Tabel2[[#This Row],[Entiteit of attribuut]])=2,\"\",Tabel2[[#This Row],[Entiteit]]&\"_\"&Tabel2[[#This Row],[Entiteit of attribuut]]))","v":{"$error":"#REF!"}},{"$f":"IF(Schema!#REF!=\"\",\"\",Schema!#REF!)","v":{"$error":"#REF!"}},{"$f":"IF(Schema!#REF!=\"\",\"\",Schema!#REF!)","v":{"$error":"#REF!"}},{"$f":"IF(Schema!#REF!=\"\",\"\",Schema!#REF!)","v":{"$error":"#REF!"}},{"$f":"IF(Schema!#REF!=\"\",\"\",Schema!#REF!)","v":{"$error":"#REF!"}},{"$f":"IF(Schema!#REF!=\"\",\"\",Schema!#REF!)","v":{"$error":"#REF!"}}]
[{"$f":"Schema!#REF!&Schema!#REF!&Schema!#REF!&Schema!#REF!","v":{"$error":"#REF!"}},{"$error":"#REF!"},{"$f":"IF(A456=\"\",\"\",IF(LEN(Schema!#REF!)=2,1,IF(LEN(Schema!#REF!)=2,10,IF(LEN(Schema!#REF!)=2,100,0))))","v":{"$error":"#REF!"}},{"$error":"#REF!"},{"$f":"IF(A456=\"\",\"\",SUM(Tabel2[[#This Row],[I1]:[I2]]))","v":{"$error":"#REF!"}},{"$error":"#REF!"},{"$error":"#REF!"},{"$error":"#REF!"},{"$error":"#REF!"},{"$f":"IF(C456=\"\",\"\",IF(LEN(Tabel2[[#This Row],[Entiteit of attribuut]])=2,\"\",Tabel2[[#This Row],[Entiteit]]&\"_\"&Tabel2[[#This Row],[Entiteit of attribuut]]))","v":{"$error":"#REF!"}},{"$f":"IF(Schema!#REF!=\"\",\"\",Schema!#REF!)","v":{"$error":"#REF!"}},{"$f":"IF(Schema!#REF!=\"\",\"\",Schema!#REF!)","v":{"$error":"#REF!"}},{"$f":"IF(Schema!#REF!=\"\",\"\",Schema!#REF!)","v":{"$error":"#REF!"}},{"$f":"IF(Schema!#REF!=\"\",\"\",Schema!#REF!)","v":{"$error":"#REF!"}},{"$f":"IF(Schema!#REF!=\"\",\"\",Schema!#REF!)","v":{"$error":"#REF!"}}]
[{"$f":"Schema!#REF!&Schema!#REF!&Schema!#REF!&Schema!#REF!","v":{"$error":"#REF!"}},{"$error":"#REF!"},{"$f":"IF(A457=\"\",\"\",IF(LEN(Schema!#REF!)=2,1,IF(LEN(Schema!#REF!)=2,10,IF(LEN(Schema!#REF!)=2,100,0))))","v":{"$error":"#REF!"}},{"$error":"#REF!"},{"$f":"IF(A457=\"\",\"\",SUM(Tabel2[[#This Row],[I1]:[I2]]))","v":{"$error":"#REF!"}},{"$error":"#REF!"},{"$error":"#REF!"},{"$error":"#REF!"},{"$error":"#REF!"},{"$f":"IF(C457=\"\",\"\",IF(LEN(Tabel2[[#This Row],[Entiteit of attribuut]])=2,\"\",Tabel2[[#This Row],[Entiteit]]&\"_\"&Tabel2[[#This Row],[Entiteit of attribuut]]))","v":{"$error":"#REF!"}},{"$f":"IF(Schema!#REF!=\"\",\"\",Schema!#REF!)","v":{"$error":"#REF!"}},{"$f":"IF(Schema!#REF!=\"\",\"\",Schema!#REF!)","v":{"$error":"#REF!"}},{"$f":"IF(Schema!#REF!=\"\",\"\",Schema!#REF!)","v":{"$error":"#REF!"}},{"$f":"IF(Schema!#REF!=\"\",\"\",Schema!#REF!)","v":{"$error":"#REF!"}},{"$f":"IF(Schema!#REF!=\"\",\"\",Schema!#REF!)","v":{"$error":"#REF!"}}]
[{"$f":"Schema!#REF!&Schema!#REF!&Schema!#REF!&Schema!#REF!","v":{"$error":"#REF!"}},{"$error":"#REF!"},{"$f":"IF(A458=\"\",\"\",IF(LEN(Schema!#REF!)=2,1,IF(LEN(Schema!#REF!)=2,10,IF(LEN(Schema!#REF!)=2,100,0))))","v":{"$error":"#REF!"}},{"$error":"#REF!"},{"$f":"IF(A458=\"\",\"\",SUM(Tabel2[[#This Row],[I1]:[I2]]))","v":{"$error":"#REF!"}},{"$error":"#REF!"},{"$error":"#REF!"},{"$error":"#REF!"},{"$error":"#REF!"},{"$f":"IF(C458=\"\",\"\",IF(LEN(Tabel2[[#This Row],[Entiteit of attribuut]])=2,\"\",Tabel2[[#This Row],[Entiteit]]&\"_\"&Tabel2[[#This Row],[Entiteit of attribuut]]))","v":{"$error":"#REF!"}},{"$f":"IF(Schema!#REF!=\"\",\"\",Schema!#REF!)","v":{"$error":"#REF!"}},{"$f":"IF(Schema!#REF!=\"\",\"\",Schema!#REF!)","v":{"$error":"#REF!"}},{"$f":"IF(Schema!#REF!=\"\",\"\",Schema!#REF!)","v":{"$error":"#REF!"}},{"$f":"IF(Schema!#REF!=\"\",\"\",Schema!#REF!)","v":{"$error":"#REF!"}},{"$f":"IF(Schema!#REF!=\"\",\"\",Schema!#REF!)","v":{"$error":"#REF!"}}]
[{"$f":"Schema!#REF!&Schema!#REF!&Schema!#REF!&Schema!#REF!","v":{"$error":"#REF!"}},{"$error":"#REF!"},{"$f":"IF(A459=\"\",\"\",IF(LEN(Schema!#REF!)=2,1,IF(LEN(Schema!#REF!)=2,10,IF(LEN(Schema!#REF!)=2,100,0))))","v":{"$error":"#REF!"}},{"$error":"#REF!"},{"$f":"IF(A459=\"\",\"\",SUM(Tabel2[[#This Row],[I1]:[I2]]))","v":{"$error":"#REF!"}},{"$error":"#REF!"},{"$error":"#REF!"},{"$error":"#REF!"},{"$error":"#REF!"},{"$f":"IF(C459=\"\",\"\",IF(LEN(Tabel2[[#This Row],[Entiteit of attribuut]])=2,\"\",Tabel2[[#This Row],[Entiteit]]&\"_\"&Tabel2[[#This Row],[Entiteit of attribuut]]))","v":{"$error":"#REF!"}},{"$f":"IF(Schema!#REF!=\"\",\"\",Schema!#REF!)","v":{"$error":"#REF!"}},{"$f":"IF(Schema!#REF!=\"\",\"\",Schema!#REF!)","v":{"$error":"#REF!"}},{"$f":"IF(Schema!#REF!=\"\",\"\",Schema!#REF!)","v":{"$error":"#REF!"}},{"$f":"IF(Schema!#REF!=\"\",\"\",Schema!#REF!)","v":{"$error":"#REF!"}},{"$f":"IF(Schema!#REF!=\"\",\"\",Schema!#REF!)","v":{"$error":"#REF!"}}]
[{"$f":"Schema!#REF!&Schema!#REF!&Schema!#REF!&Schema!#REF!","v":{"$error":"#REF!"}},{"$error":"#REF!"},{"$f":"IF(A460=\"\",\"\",IF(LEN(Schema!#REF!)=2,1,IF(LEN(Schema!#REF!)=2,10,IF(LEN(Schema!#REF!)=2,100,0))))","v":{"$error":"#REF!"}},{"$error":"#REF!"},{"$f":"IF(A460=\"\",\"\",SUM(Tabel2[[#This Row],[I1]:[I2]]))","v":{"$error":"#REF!"}},{"$error":"#REF!"},{"$error":"#REF!"},{"$error":"#REF!"},{"$error":"#REF!"},{"$f":"IF(C460=\"\",\"\",IF(LEN(Tabel2[[#This Row],[Entiteit of attribuut]])=2,\"\",Tabel2[[#This Row],[Entiteit]]&\"_\"&Tabel2[[#This Row],[Entiteit of attribuut]]))","v":{"$error":"#REF!"}},{"$f":"IF(Schema!#REF!=\"\",\"\",Schema!#REF!)","v":{"$error":"#REF!"}},{"$f":"IF(Schema!#REF!=\"\",\"\",Schema!#REF!)","v":{"$error":"#REF!"}},{"$f":"IF(Schema!#REF!=\"\",\"\",Schema!#REF!)","v":{"$error":"#REF!"}},{"$f":"IF(Schema!#REF!=\"\",\"\",Schema!#REF!)","v":{"$error":"#REF!"}},{"$f":"IF(Schema!#REF!=\"\",\"\",Schema!#REF!)","v":{"$error":"#REF!"}}]
[{"$f":"Schema!#REF!&Schema!#REF!&Schema!#REF!&Schema!#REF!","v":{"$error":"#REF!"}},{"$error":"#REF!"},{"$f":"IF(A461=\"\",\"\",IF(LEN(Schema!#REF!)=2,1,IF(LEN(Schema!#REF!)=2,10,IF(LEN(Schema!#REF!)=2,100,0))))","v":{"$error":"#REF!"}},{"$error":"#REF!"},{"$f":"IF(A461=\"\",\"\",SUM(Tabel2[[#This Row],[I1]:[I2]]))","v":{"$error":"#REF!"}},{"$error":"#REF!"},{"$error":"#REF!"},{"$error":"#REF!"},{"$error":"#REF!"},{"$f":"IF(C461=\"\",\"\",IF(LEN(Tabel2[[#This Row],[Entiteit of attribuut]])=2,\"\",Tabel2[[#This Row],[Entiteit]]&\"_\"&Tabel2[[#This Row],[Entiteit of attribuut]]))","v":{"$error":"#REF!"}},{"$f":"IF(Schema!#REF!=\"\",\"\",Schema!#REF!)","v":{"$error":"#REF!"}},{"$f":"IF(Schema!#REF!=\"\",\"\",Schema!#REF!)","v":{"$error":"#REF!"}},{"$f":"IF(Schema!#REF!=\"\",\"\",Schema!#REF!)","v":{"$error":"#REF!"}},{"$f":"IF(Schema!#REF!=\"\",\"\",Schema!#REF!)","v":{"$error":"#REF!"}},{"$f":"IF(Schema!#REF!=\"\",\"\",Schema!#REF!)","v":{"$error":"#REF!"}}]
[{"$f":"Schema!#REF!&Schema!#REF!&Schema!#REF!&Schema!#REF!","v":{"$error":"#REF!"}},{"$error":"#REF!"},{"$f":"IF(A462=\"\",\"\",IF(LEN(Schema!#REF!)=2,1,IF(LEN(Schema!#REF!)=2,10,IF(LEN(Schema!#REF!)=2,100,0))))","v":{"$error":"#REF!"}},{"$error":"#REF!"},{"$f":"IF(A462=\"\",\"\",SUM(Tabel2[[#This Row],[I1]:[I2]]))","v":{"$error":"#REF!"}},{"$error":"#REF!"},{"$error":"#REF!"},{"$error":"#REF!"},{"$error":"#REF!"},{"$f":"IF(C462=\"\",\"\",IF(LEN(Tabel2[[#This Row],[Entiteit of attribuut]])=2,\"\",Tabel2[[#This Row],[Entiteit]]&\"_\"&Tabel2[[#This Row],[Entiteit of attribuut]]))","v":{"$error":"#REF!"}},{"$f":"IF(Schema!#REF!=\"\",\"\",Schema!#REF!)","v":{"$error":"#REF!"}},{"$f":"IF(Schema!#REF!=\"\",\"\",Schema!#REF!)","v":{"$error":"#REF!"}},{"$f":"IF(Schema!#REF!=\"\",\"\",Schema!#REF!)","v":{"$error":"#REF!"}},{"$f":"IF(Schema!#REF!=\"\",\"\",Schema!#REF!)","v":{"$error":"#REF!"}},{"$f":"IF(Schema!#REF!=\"\",\"\",Schema!#REF!)","v":{"$error":"#REF!"}}]
[{"$f":"Schema!#REF!&Schema!#REF!&Schema!#REF!&Schema!#REF!","v":{"$error":"#REF!"}},{"$error":"#REF!"},{"$f":"IF(A463=\"\",\"\",IF(LEN(Schema!#REF!)=2,1,IF(LEN(Schema!#REF!)=2,10,IF(LEN(Schema!#REF!)=2,100,0))))","v":{"$error":"#REF!"}},{"$error":"#REF!"},{"$f":"IF(A463=\"\",\"\",SUM(Tabel2[[#This Row],[I1]:[I2]]))","v":{"$error":"#REF!"}},{"$error":"#REF!"},{"$error":"#REF!"},{"$error":"#REF!"},{"$error":"#REF!"},{"$f":"IF(C463=\"\",\"\",IF(LEN(Tabel2[[#This Row],[Entiteit of attribuut]])=2,\"\",Tabel2[[#This Row],[Entiteit]]&\"_\"&Tabel2[[#This Row],[Entiteit of attribuut]]))","v":{"$error":"#REF!"}},{"$f":"IF(Schema!#REF!=\"\",\"\",Schema!#REF!)","v":{"$error":"#REF!"}},{"$f":"IF(Schema!#REF!=\"\",\"\",Schema!#REF!)","v":{"$error":"#REF!"}},{"$f":"IF(Schema!#REF!=\"\",\"\",Schema!#REF!)","v":{"$error":"#REF!"}},{"$f":"IF(Schema!#REF!=\"\",\"\",Schema!#REF!)","v":{"$error":"#REF!"}},{"$f":"IF(Schema!#REF!=\"\",\"\",Schema!#REF!)","v":{"$error":"#REF!"}}]
[{"$f":"Schema!#REF!&Schema!#REF!&Schema!#REF!&Schema!#REF!","v":{"$error":"#REF!"}},{"$error":"#REF!"},{"$f":"IF(A464=\"\",\"\",IF(LEN(Schema!#REF!)=2,1,IF(LEN(Schema!#REF!)=2,10,IF(LEN(Schema!#REF!)=2,100,0))))","v":{"$error":"#REF!"}},{"$error":"#REF!"},{"$f":"IF(A464=\"\",\"\",SUM(Tabel2[[#This Row],[I1]:[I2]]))","v":{"$error":"#REF!"}},{"$error":"#REF!"},{"$error":"#REF!"},{"$error":"#REF!"},{"$error":"#REF!"},{"$f":"IF(C464=\"\",\"\",IF(LEN(Tabel2[[#This Row],[Entiteit of attribuut]])=2,\"\",Tabel2[[#This Row],[Entiteit]]&\"_\"&Tabel2[[#This Row],[Entiteit of attribuut]]))","v":{"$error":"#REF!"}},{"$f":"IF(Schema!#REF!=\"\",\"\",Schema!#REF!)","v":{"$error":"#REF!"}},{"$f":"IF(Schema!#REF!=\"\",\"\",Schema!#REF!)","v":{"$error":"#REF!"}},{"$f":"IF(Schema!#REF!=\"\",\"\",Schema!#REF!)","v":{"$error":"#REF!"}},{"$f":"IF(Schema!#REF!=\"\",\"\",Schema!#REF!)","v":{"$error":"#REF!"}},{"$f":"IF(Schema!#REF!=\"\",\"\",Schema!#REF!)","v":{"$error":"#REF!"}}]
[{"$f":"Schema!#REF!&Schema!#REF!&Schema!#REF!&Schema!#REF!","v":{"$error":"#REF!"}},{"$error":"#REF!"},{"$f":"IF(A465=\"\",\"\",IF(LEN(Schema!#REF!)=2,1,IF(LEN(Schema!#REF!)=2,10,IF(LEN(Schema!#REF!)=2,100,0))))","v":{"$error":"#REF!"}},{"$error":"#REF!"},{"$f":"IF(A465=\"\",\"\",SUM(Tabel2[[#This Row],[I1]:[I2]]))","v":{"$error":"#REF!"}},{"$error":"#REF!"},{"$error":"#REF!"},{"$error":"#REF!"},{"$error":"#REF!"},{"$f":"IF(C465=\"\",\"\",IF(LEN(Tabel2[[#This Row],[Entiteit of attribuut]])=2,\"\",Tabel2[[#This Row],[Entiteit]]&\"_\"&Tabel2[[#This Row],[Entiteit of attribuut]]))","v":{"$error":"#REF!"}},{"$f":"IF(Schema!#REF!=\"\",\"\",Schema!#REF!)","v":{"$error":"#REF!"}},{"$f":"IF(Schema!#REF!=\"\",\"\",Schema!#REF!)","v":{"$error":"#REF!"}},{"$f":"IF(Schema!#REF!=\"\",\"\",Schema!#REF!)","v":{"$error":"#REF!"}},{"$f":"IF(Schema!#REF!=\"\",\"\",Schema!#REF!)","v":{"$error":"#REF!"}},{"$f":"IF(Schema!#REF!=\"\",\"\",Schema!#REF!)","v":{"$error":"#REF!"}}]
[{"$f":"Schema!#REF!&Schema!#REF!&Schema!#REF!&Schema!#REF!","v":{"$error":"#REF!"}},{"$error":"#REF!"},{"$f":"IF(A466=\"\",\"\",IF(LEN(Schema!#REF!)=2,1,IF(LEN(Schema!#REF!)=2,10,IF(LEN(Schema!#REF!)=2,100,0))))","v":{"$error":"#REF!"}},{"$error":"#REF!"},{"$f":"IF(A466=\"\",\"\",SUM(Tabel2[[#This Row],[I1]:[I2]]))","v":{"$error":"#REF!"}},{"$error":"#REF!"},{"$error":"#REF!"},{"$error":"#REF!"},{"$error":"#REF!"},{"$f":"IF(C466=\"\",\"\",IF(LEN(Tabel2[[#This Row],[Entiteit of attribuut]])=2,\"\",Tabel2[[#This Row],[Entiteit]]&\"_\"&Tabel2[[#This Row],[Entiteit of attribuut]]))","v":{"$error":"#REF!"}},{"$f":"IF(Schema!#REF!=\"\",\"\",Schema!#REF!)","v":{"$error":"#REF!"}},{"$f":"IF(Schema!#REF!=\"\",\"\",Schema!#REF!)","v":{"$error":"#REF!"}},{"$f":"IF(Schema!#REF!=\"\",\"\",Schema!#REF!)","v":{"$error":"#REF!"}},{"$f":"IF(Schema!#REF!=\"\",\"\",Schema!#REF!)","v":{"$error":"#REF!"}},{"$f":"IF(Schema!#REF!=\"\",\"\",Schema!#REF!)","v":{"$error":"#REF!"}}]
[{"$f":"Schema!#REF!&Schema!#REF!&Schema!#REF!&Schema!#REF!","v":{"$error":"#REF!"}},{"$error":"#REF!"},{"$f":"IF(A467=\"\",\"\",IF(LEN(Schema!#REF!)=2,1,IF(LEN(Schema!#REF!)=2,10,IF(LEN(Schema!#REF!)=2,100,0))))","v":{"$error":"#REF!"}},{"$error":"#REF!"},{"$f":"IF(A467=\"\",\"\",SUM(Tabel2[[#This Row],[I1]:[I2]]))","v":{"$error":"#REF!"}},{"$error":"#REF!"},{"$error":"#REF!"},{"$error":"#REF!"},{"$error":"#REF!"},{"$f":"IF(C467=\"\",\"\",IF(LEN(Tabel2[[#This Row],[Entiteit of attribuut]])=2,\"\",Tabel2[[#This Row],[Entiteit]]&\"_\"&Tabel2[[#This Row],[Entiteit of attribuut]]))","v":{"$error":"#REF!"}},{"$f":"IF(Schema!#REF!=\"\",\"\",Schema!#REF!)","v":{"$error":"#REF!"}},{"$f":"IF(Schema!#REF!=\"\",\"\",Schema!#REF!)","v":{"$error":"#REF!"}},{"$f":"IF(Schema!#REF!=\"\",\"\",Schema!#REF!)","v":{"$error":"#REF!"}},{"$f":"IF(Schema!#REF!=\"\",\"\",Schema!#REF!)","v":{"$error":"#REF!"}},{"$f":"IF(Schema!#REF!=\"\",\"\",Schema!#REF!)","v":{"$error":"#REF!"}}]
[{"$f":"Schema!#REF!&Schema!#REF!&Schema!#REF!&Schema!#REF!","v":{"$error":"#REF!"}},{"$error":"#REF!"},{"$f":"IF(A468=\"\",\"\",IF(LEN(Schema!#REF!)=2,1,IF(LEN(Schema!#REF!)=2,10,IF(LEN(Schema!#REF!)=2,100,0))))","v":{"$error":"#REF!"}},{"$error":"#REF!"},{"$f":"IF(A468=\"\",\"\",SUM(Tabel2[[#This Row],[I1]:[I2]]))","v":{"$error":"#REF!"}},{"$error":"#REF!"},{"$error":"#REF!"},{"$error":"#REF!"},{"$error":"#REF!"},{"$f":"IF(C468=\"\",\"\",IF(LEN(Tabel2[[#This Row],[Entiteit of attribuut]])=2,\"\",Tabel2[[#This Row],[Entiteit]]&\"_\"&Tabel2[[#This Row],[Entiteit of attribuut]]))","v":{"$error":"#REF!"}},{"$f":"IF(Schema!#REF!=\"\",\"\",Schema!#REF!)","v":{"$error":"#REF!"}},{"$f":"IF(Schema!#REF!=\"\",\"\",Schema!#REF!)","v":{"$error":"#REF!"}},{"$f":"IF(Schema!#REF!=\"\",\"\",Schema!#REF!)","v":{"$error":"#REF!"}},{"$f":"IF(Schema!#REF!=\"\",\"\",Schema!#REF!)","v":{"$error":"#REF!"}},{"$f":"IF(Schema!#REF!=\"\",\"\",Schema!#REF!)","v":{"$error":"#REF!"}}]
[{"$f":"Schema!#REF!&Schema!#REF!&Schema!#REF!&Schema!#REF!","v":{"$error":"#REF!"}},{"$error":"#REF!"},{"$f":"IF(A469=\"\",\"\",IF(LEN(Schema!#REF!)=2,1,IF(LEN(Schema!#REF!)=2,10,IF(LEN(Schema!#REF!)=2,100,0))))","v":{"$error":"#REF!"}},{"$error":"#REF!"},{"$f":"IF(A469=\"\",\"\",SUM(Tabel2[[#This Row],[I1]:[I2]]))","v":{"$error":"#REF!"}},{"$error":"#REF!"},{"$error":"#REF!"},{"$error":"#REF!"},{"$error":"#REF!"},{"$f":"IF(C469=\"\",\"\",IF(LEN(Tabel2[[#This Row],[Entiteit of attribuut]])=2,\"\",Tabel2[[#This Row],[Entiteit]]&\"_\"&Tabel2[[#This Row],[Entiteit of attribuut]]))","v":{"$error":"#REF!"}},{"$f":"IF(Schema!#REF!=\"\",\"\",Schema!#REF!)","v":{"$error":"#REF!"}},{"$f":"IF(Schema!#REF!=\"\",\"\",Schema!#REF!)","v":{"$error":"#REF!"}},{"$f":"IF(Schema!#REF!=\"\",\"\",Schema!#REF!)","v":{"$error":"#REF!"}},{"$f":"IF(Schema!#REF!=\"\",\"\",Schema!#REF!)","v":{"$error":"#REF!"}},{"$f":"IF(Schema!#REF!=\"\",\"\",Schema!#REF!)","v":{"$error":"#REF!"}}]
[{"$f":"Schema!#REF!&Schema!#REF!&Schema!#REF!&Schema!#REF!","v":{"$error":"#REF!"}},{"$error":"#REF!"},{"$f":"IF(A470=\"\",\"\",IF(LEN(Schema!#REF!)=2,1,IF(LEN(Schema!#REF!)=2,10,IF(LEN(Schema!#REF!)=2,100,0))))","v":{"$error":"#REF!"}},{"$error":"#REF!"},{"$f":"IF(A470=\"\",\"\",SUM(Tabel2[[#This Row],[I1]:[I2]]))","v":{"$error":"#REF!"}},{"$error":"#REF!"},{"$error":"#REF!"},{"$error":"#REF!"},{"$error":"#REF!"},{"$f":"IF(C470=\"\",\"\",IF(LEN(Tabel2[[#This Row],[Entiteit of attribuut]])=2,\"\",Tabel2[[#This Row],[Entiteit]]&\"_\"&Tabel2[[#This Row],[Entiteit of attribuut]]))","v":{"$error":"#REF!"}},{"$f":"IF(Schema!#REF!=\"\",\"\",Schema!#REF!)","v":{"$error":"#REF!"}},{"$f":"IF(Schema!#REF!=\"\",\"\",Schema!#REF!)","v":{"$error":"#REF!"}},{"$f":"IF(Schema!#REF!=\"\",\"\",Schema!#REF!)","v":{"$error":"#REF!"}},{"$f":"IF(Schema!#REF!=\"\",\"\",Schema!#REF!)","v":{"$error":"#REF!"}},{"$f":"IF(Schema!#REF!=\"\",\"\",Schema!#REF!)","v":{"$error":"#REF!"}}]
[{"$f":"Schema!#REF!&Schema!#REF!&Schema!#REF!&Schema!#REF!","v":{"$error":"#REF!"}},{"$error":"#REF!"},{"$f":"IF(A471=\"\",\"\",IF(LEN(Schema!#REF!)=2,1,IF(LEN(Schema!#REF!)=2,10,IF(LEN(Schema!#REF!)=2,100,0))))","v":{"$error":"#REF!"}},{"$error":"#REF!"},{"$f":"IF(A471=\"\",\"\",SUM(Tabel2[[#This Row],[I1]:[I2]]))","v":{"$error":"#REF!"}},{"$error":"#REF!"},{"$error":"#REF!"},{"$error":"#REF!"},{"$error":"#REF!"},{"$f":"IF(C471=\"\",\"\",IF(LEN(Tabel2[[#This Row],[Entiteit of attribuut]])=2,\"\",Tabel2[[#This Row],[Entiteit]]&\"_\"&Tabel2[[#This Row],[Entiteit of attribuut]]))","v":{"$error":"#REF!"}},{"$f":"IF(Schema!#REF!=\"\",\"\",Schema!#REF!)","v":{"$error":"#REF!"}},{"$f":"IF(Schema!#REF!=\"\",\"\",Schema!#REF!)","v":{"$error":"#REF!"}},{"$f":"IF(Schema!#REF!=\"\",\"\",Schema!#REF!)","v":{"$error":"#REF!"}},{"$f":"IF(Schema!#REF!=\"\",\"\",Schema!#REF!)","v":{"$error":"#REF!"}},{"$f":"IF(Schema!#REF!=\"\",\"\",Schema!#REF!)","v":{"$error":"#REF!"}}]
[{"$f":"Schema!#REF!&Schema!#REF!&Schema!#REF!&Schema!#REF!","v":{"$error":"#REF!"}},{"$error":"#REF!"},{"$f":"IF(A472=\"\",\"\",IF(LEN(Schema!#REF!)=2,1,IF(LEN(Schema!#REF!)=2,10,IF(LEN(Schema!#REF!)=2,100,0))))","v":{"$error":"#REF!"}},{"$error":"#REF!"},{"$f":"IF(A472=\"\",\"\",SUM(Tabel2[[#This Row],[I1]:[I2]]))","v":{"$error":"#REF!"}},{"$error":"#REF!"},{"$error":"#REF!"},{"$error":"#REF!"},{"$error":"#REF!"},{"$f":"IF(C472=\"\",\"\",IF(LEN(Tabel2[[#This Row],[Entiteit of attribuut]])=2,\"\",Tabel2[[#This Row],[Entiteit]]&\"_\"&Tabel2[[#This Row],[Entiteit of attribuut]]))","v":{"$error":"#REF!"}},{"$f":"IF(Schema!#REF!=\"\",\"\",Schema!#REF!)","v":{"$error":"#REF!"}},{"$f":"IF(Schema!#REF!=\"\",\"\",Schema!#REF!)","v":{"$error":"#REF!"}},{"$f":"IF(Schema!#REF!=\"\",\"\",Schema!#REF!)","v":{"$error":"#REF!"}},{"$f":"IF(Schema!#REF!=\"\",\"\",Schema!#REF!)","v":{"$error":"#REF!"}},{"$f":"IF(Schema!#REF!=\"\",\"\",Schema!#REF!)","v":{"$error":"#REF!"}}]
[{"$f":"Schema!#REF!&Schema!#REF!&Schema!#REF!&Schema!#REF!","v":{"$error":"#REF!"}},{"$error":"#REF!"},{"$f":"IF(A473=\"\",\"\",IF(LEN(Schema!#REF!)=2,1,IF(LEN(Schema!#REF!)=2,10,IF(LEN(Schema!#REF!)=2,100,0))))","v":{"$error":"#REF!"}},{"$error":"#REF!"},{"$f":"IF(A473=\"\",\"\",SUM(Tabel2[[#This Row],[I1]:[I2]]))","v":{"$error":"#REF!"}},{"$error":"#REF!"},{"$error":"#REF!"},{"$error":"#REF!"},{"$error":"#REF!"},{"$f":"IF(C473=\"\",\"\",IF(LEN(Tabel2[[#This Row],[Entiteit of attribuut]])=2,\"\",Tabel2[[#This Row],[Entiteit]]&\"_\"&Tabel2[[#This Row],[Entiteit of attribuut]]))","v":{"$error":"#REF!"}},{"$f":"IF(Schema!#REF!=\"\",\"\",Schema!#REF!)","v":{"$error":"#REF!"}},{"$f":"IF(Schema!#REF!=\"\",\"\",Schema!#REF!)","v":{"$error":"#REF!"}},{"$f":"IF(Schema!#REF!=\"\",\"\",Schema!#REF!)","v":{"$error":"#REF!"}},{"$f":"IF(Schema!#REF!=\"\",\"\",Schema!#REF!)","v":{"$error":"#REF!"}},{"$f":"IF(Schema!#REF!=\"\",\"\",Schema!#REF!)","v":{"$error":"#REF!"}}]
[{"$f":"Schema!#REF!&Schema!#REF!&Schema!#REF!&Schema!#REF!","v":{"$error":"#REF!"}},{"$error":"#REF!"},{"$f":"IF(A474=\"\",\"\",IF(LEN(Schema!#REF!)=2,1,IF(LEN(Schema!#REF!)=2,10,IF(LEN(Schema!#REF!)=2,100,0))))","v":{"$error":"#REF!"}},{"$error":"#REF!"},{"$f":"IF(A474=\"\",\"\",SUM(Tabel2[[#This Row],[I1]:[I2]]))","v":{"$error":"#REF!"}},{"$error":"#REF!"},{"$error":"#REF!"},{"$error":"#REF!"},{"$error":"#REF!"},{"$f":"IF(C474=\"\",\"\",IF(LEN(Tabel2[[#This Row],[Entiteit of attribuut]])=2,\"\",Tabel2[[#This Row],[Entiteit]]&\"_\"&Tabel2[[#This Row],[Entiteit of attribuut]]))","v":{"$error":"#REF!"}},{"$f":"IF(Schema!#REF!=\"\",\"\",Schema!#REF!)","v":{"$error":"#REF!"}},{"$f":"IF(Schema!#REF!=\"\",\"\",Schema!#REF!)","v":{"$error":"#REF!"}},{"$f":"IF(Schema!#REF!=\"\",\"\",Schema!#REF!)","v":{"$error":"#REF!"}},{"$f":"IF(Schema!#REF!=\"\",\"\",Schema!#REF!)","v":{"$error":"#REF!"}},{"$f":"IF(Schema!#REF!=\"\",\"\",Schema!#REF!)","v":{"$error":"#REF!"}}]
[{"$f":"Schema!#REF!&Schema!#REF!&Schema!#REF!&Schema!#REF!","v":{"$error":"#REF!"}},{"$error":"#REF!"},{"$f":"IF(A475=\"\",\"\",IF(LEN(Schema!#REF!)=2,1,IF(LEN(Schema!#REF!)=2,10,IF(LEN(Schema!#REF!)=2,100,0))))","v":{"$error":"#REF!"}},{"$error":"#REF!"},{"$f":"IF(A475=\"\",\"\",SUM(Tabel2[[#This Row],[I1]:[I2]]))","v":{"$error":"#REF!"}},{"$error":"#REF!"},{"$error":"#REF!"},{"$error":"#REF!"},{"$error":"#REF!"},{"$f":"IF(C475=\"\",\"\",IF(LEN(Tabel2[[#This Row],[Entiteit of attribuut]])=2,\"\",Tabel2[[#This Row],[Entiteit]]&\"_\"&Tabel2[[#This Row],[Entiteit of attribuut]]))","v":{"$error":"#REF!"}},{"$f":"IF(Schema!#REF!=\"\",\"\",Schema!#REF!)","v":{"$error":"#REF!"}},{"$f":"IF(Schema!#REF!=\"\",\"\",Schema!#REF!)","v":{"$error":"#REF!"}},{"$f":"IF(Schema!#REF!=\"\",\"\",Schema!#REF!)","v":{"$error":"#REF!"}},{"$f":"IF(Schema!#REF!=\"\",\"\",Schema!#REF!)","v":{"$error":"#REF!"}},{"$f":"IF(Schema!#REF!=\"\",\"\",Schema!#REF!)","v":{"$error":"#REF!"}}]
[{"$f":"Schema!#REF!&Schema!#REF!&Schema!#REF!&Schema!#REF!","v":{"$error":"#REF!"}},{"$error":"#REF!"},{"$f":"IF(A476=\"\",\"\",IF(LEN(Schema!#REF!)=2,1,IF(LEN(Schema!#REF!)=2,10,IF(LEN(Schema!#REF!)=2,100,0))))","v":{"$error":"#REF!"}},{"$error":"#REF!"},{"$f":"IF(A476=\"\",\"\",SUM(Tabel2[[#This Row],[I1]:[I2]]))","v":{"$error":"#REF!"}},{"$error":"#REF!"},{"$error":"#REF!"},{"$error":"#REF!"},{"$error":"#REF!"},{"$f":"IF(C476=\"\",\"\",IF(LEN(Tabel2[[#This Row],[Entiteit of attribuut]])=2,\"\",Tabel2[[#This Row],[Entiteit]]&\"_\"&Tabel2[[#This Row],[Entiteit of attribuut]]))","v":{"$error":"#REF!"}},{"$f":"IF(Schema!#REF!=\"\",\"\",Schema!#REF!)","v":{"$error":"#REF!"}},{"$f":"IF(Schema!#REF!=\"\",\"\",Schema!#REF!)","v":{"$error":"#REF!"}},{"$f":"IF(Schema!#REF!=\"\",\"\",Schema!#REF!)","v":{"$error":"#REF!"}},{"$f":"IF(Schema!#REF!=\"\",\"\",Schema!#REF!)","v":{"$error":"#REF!"}},{"$f":"IF(Schema!#REF!=\"\",\"\",Schema!#REF!)","v":{"$error":"#REF!"}}]
[{"$f":"Schema!#REF!&Schema!#REF!&Schema!#REF!&Schema!#REF!","v":{"$error":"#REF!"}},{"$error":"#REF!"},{"$f":"IF(A477=\"\",\"\",IF(LEN(Schema!#REF!)=2,1,IF(LEN(Schema!#REF!)=2,10,IF(LEN(Schema!#REF!)=2,100,0))))","v":{"$error":"#REF!"}},{"$error":"#REF!"},{"$f":"IF(A477=\"\",\"\",SUM(Tabel2[[#This Row],[I1]:[I2]]))","v":{"$error":"#REF!"}},{"$error":"#REF!"},{"$error":"#REF!"},{"$error":"#REF!"},{"$error":"#REF!"},{"$f":"IF(C477=\"\",\"\",IF(LEN(Tabel2[[#This Row],[Entiteit of attribuut]])=2,\"\",Tabel2[[#This Row],[Entiteit]]&\"_\"&Tabel2[[#This Row],[Entiteit of attribuut]]))","v":{"$error":"#REF!"}},{"$f":"IF(Schema!#REF!=\"\",\"\",Schema!#REF!)","v":{"$error":"#REF!"}},{"$f":"IF(Schema!#REF!=\"\",\"\",Schema!#REF!)","v":{"$error":"#REF!"}},{"$f":"IF(Schema!#REF!=\"\",\"\",Schema!#REF!)","v":{"$error":"#REF!"}},{"$f":"IF(Schema!#REF!=\"\",\"\",Schema!#REF!)","v":{"$error":"#REF!"}},{"$f":"IF(Schema!#REF!=\"\",\"\",Schema!#REF!)","v":{"$error":"#REF!"}}]
[{"$f":"Schema!#REF!&Schema!#REF!&Schema!#REF!&Schema!#REF!","v":{"$error":"#REF!"}},{"$error":"#REF!"},{"$f":"IF(A478=\"\",\"\",IF(LEN(Schema!#REF!)=2,1,IF(LEN(Schema!#REF!)=2,10,IF(LEN(Schema!#REF!)=2,100,0))))","v":{"$error":"#REF!"}},{"$error":"#REF!"},{"$f":"IF(A478=\"\",\"\",SUM(Tabel2[[#This Row],[I1]:[I2]]))","v":{"$error":"#REF!"}},{"$error":"#REF!"},{"$error":"#REF!"},{"$error":"#REF!"},{"$error":"#REF!"},{"$f":"IF(C478=\"\",\"\",IF(LEN(Tabel2[[#This Row],[Entiteit of attribuut]])=2,\"\",Tabel2[[#This Row],[Entiteit]]&\"_\"&Tabel2[[#This Row],[Entiteit of attribuut]]))","v":{"$error":"#REF!"}},{"$f":"IF(Schema!#REF!=\"\",\"\",Schema!#REF!)","v":{"$error":"#REF!"}},{"$f":"IF(Schema!#REF!=\"\",\"\",Schema!#REF!)","v":{"$error":"#REF!"}},{"$f":"IF(Schema!#REF!=\"\",\"\",Schema!#REF!)","v":{"$error":"#REF!"}},{"$f":"IF(Schema!#REF!=\"\",\"\",Schema!#REF!)","v":{"$error":"#REF!"}},{"$f":"IF(Schema!#REF!=\"\",\"\",Schema!#REF!)","v":{"$error":"#REF!"}}]
[{"$f":"Schema!#REF!&Schema!#REF!&Schema!#REF!&Schema!#REF!","v":{"$error":"#REF!"}},{"$error":"#REF!"},{"$f":"IF(A479=\"\",\"\",IF(LEN(Schema!#REF!)=2,1,IF(LEN(Schema!#REF!)=2,10,IF(LEN(Schema!#REF!)=2,100,0))))","v":{"$error":"#REF!"}},{"$error":"#REF!"},{"$f":"IF(A479=\"\",\"\",SUM(Tabel2[[#This Row],[I1]:[I2]]))","v":{"$error":"#REF!"}},{"$error":"#REF!"},{"$error":"#REF!"},{"$error":"#REF!"},{"$error":"#REF!"},{"$f":"IF(C479=\"\",\"\",IF(LEN(Tabel2[[#This Row],[Entiteit of attribuut]])=2,\"\",Tabel2[[#This Row],[Entiteit]]&\"_\"&Tabel2[[#This Row],[Entiteit of attribuut]]))","v":{"$error":"#REF!"}},{"$f":"IF(Schema!#REF!=\"\",\"\",Schema!#REF!)","v":{"$error":"#REF!"}},{"$f":"IF(Schema!#REF!=\"\",\"\",Schema!#REF!)","v":{"$error":"#REF!"}},{"$f":"IF(Schema!#REF!=\"\",\"\",Schema!#REF!)","v":{"$error":"#REF!"}},{"$f":"IF(Schema!#REF!=\"\",\"\",Schema!#REF!)","v":{"$error":"#REF!"}},{"$f":"IF(Schema!#REF!=\"\",\"\",Schema!#REF!)","v":{"$error":"#REF!"}}]
[{"$f":"Schema!#REF!&Schema!#REF!&Schema!#REF!&Schema!#REF!","v":{"$error":"#REF!"}},{"$error":"#REF!"},{"$f":"IF(A480=\"\",\"\",IF(LEN(Schema!#REF!)=2,1,IF(LEN(Schema!#REF!)=2,10,IF(LEN(Schema!#REF!)=2,100,0))))","v":{"$error":"#REF!"}},{"$error":"#REF!"},{"$f":"IF(A480=\"\",\"\",SUM(Tabel2[[#This Row],[I1]:[I2]]))","v":{"$error":"#REF!"}},{"$error":"#REF!"},{"$error":"#REF!"},{"$error":"#REF!"},{"$error":"#REF!"},{"$f":"IF(C480=\"\",\"\",IF(LEN(Tabel2[[#This Row],[Entiteit of attribuut]])=2,\"\",Tabel2[[#This Row],[Entiteit]]&\"_\"&Tabel2[[#This Row],[Entiteit of attribuut]]))","v":{"$error":"#REF!"}},{"$f":"IF(Schema!#REF!=\"\",\"\",Schema!#REF!)","v":{"$error":"#REF!"}},{"$f":"IF(Schema!#REF!=\"\",\"\",Schema!#REF!)","v":{"$error":"#REF!"}},{"$f":"IF(Schema!#REF!=\"\",\"\",Schema!#REF!)","v":{"$error":"#REF!"}},{"$f":"IF(Schema!#REF!=\"\",\"\",Schema!#REF!)","v":{"$error":"#REF!"}},{"$f":"IF(Schema!#REF!=\"\",\"\",Schema!#REF!)","v":{"$error":"#REF!"}}]
[{"$f":"Schema!#REF!&Schema!#REF!&Schema!#REF!&Schema!#REF!","v":{"$error":"#REF!"}},{"$error":"#REF!"},{"$f":"IF(A481=\"\",\"\",IF(LEN(Schema!#REF!)=2,1,IF(LEN(Schema!#REF!)=2,10,IF(LEN(Schema!#REF!)=2,100,0))))","v":{"$error":"#REF!"}},{"$error":"#REF!"},{"$f":"IF(A481=\"\",\"\",SUM(Tabel2[[#This Row],[I1]:[I2]]))","v":{"$error":"#REF!"}},{"$error":"#REF!"},{"$error":"#REF!"},{"$error":"#REF!"},{"$error":"#REF!"},{"$f":"IF(C481=\"\",\"\",IF(LEN(Tabel2[[#This Row],[Entiteit of attribuut]])=2,\"\",Tabel2[[#This Row],[Entiteit]]&\"_\"&Tabel2[[#This Row],[Entiteit of attribuut]]))","v":{"$error":"#REF!"}},{"$f":"IF(Schema!#REF!=\"\",\"\",Schema!#REF!)","v":{"$error":"#REF!"}},{"$f":"IF(Schema!#REF!=\"\",\"\",Schema!#REF!)","v":{"$error":"#REF!"}},{"$f":"IF(Schema!#REF!=\"\",\"\",Schema!#REF!)","v":{"$error":"#REF!"}},{"$f":"IF(Schema!#REF!=\"\",\"\",Schema!#REF!)","v":{"$error":"#REF!"}},{"$f":"IF(Schema!#REF!=\"\",\"\",Schema!#REF!)","v":{"$error":"#REF!"}}]
[{"$f":"Schema!#REF!&Schema!#REF!&Schema!#REF!&Schema!#REF!","v":{"$error":"#REF!"}},{"$error":"#REF!"},{"$f":"IF(A482=\"\",\"\",IF(LEN(Schema!#REF!)=2,1,IF(LEN(Schema!#REF!)=2,10,IF(LEN(Schema!#REF!)=2,100,0))))","v":{"$error":"#REF!"}},{"$error":"#REF!"},{"$f":"IF(A482=\"\",\"\",SUM(Tabel2[[#This Row],[I1]:[I2]]))","v":{"$error":"#REF!"}},{"$error":"#REF!"},{"$error":"#REF!"},{"$error":"#REF!"},{"$error":"#REF!"},{"$f":"IF(C482=\"\",\"\",IF(LEN(Tabel2[[#This Row],[Entiteit of attribuut]])=2,\"\",Tabel2[[#This Row],[Entiteit]]&\"_\"&Tabel2[[#This Row],[Entiteit of attribuut]]))","v":{"$error":"#REF!"}},{"$f":"IF(Schema!#REF!=\"\",\"\",Schema!#REF!)","v":{"$error":"#REF!"}},{"$f":"IF(Schema!#REF!=\"\",\"\",Schema!#REF!)","v":{"$error":"#REF!"}},{"$f":"IF(Schema!#REF!=\"\",\"\",Schema!#REF!)","v":{"$error":"#REF!"}},{"$f":"IF(Schema!#REF!=\"\",\"\",Schema!#REF!)","v":{"$error":"#REF!"}},{"$f":"IF(Schema!#REF!=\"\",\"\",Schema!#REF!)","v":{"$error":"#REF!"}}]
[{"$f":"Schema!#REF!&Schema!#REF!&Schema!#REF!&Schema!#REF!","v":{"$error":"#REF!"}},{"$error":"#REF!"},{"$f":"IF(A483=\"\",\"\",IF(LEN(Schema!#REF!)=2,1,IF(LEN(Schema!#REF!)=2,10,IF(LEN(Schema!#REF!)=2,100,0))))","v":{"$error":"#REF!"}},{"$error":"#REF!"},{"$f":"IF(A483=\"\",\"\",SUM(Tabel2[[#This Row],[I1]:[I2]]))","v":{"$error":"#REF!"}},{"$error":"#REF!"},{"$error":"#REF!"},{"$error":"#REF!"},{"$error":"#REF!"},{"$f":"IF(C483=\"\",\"\",IF(LEN(Tabel2[[#This Row],[Entiteit of attribuut]])=2,\"\",Tabel2[[#This Row],[Entiteit]]&\"_\"&Tabel2[[#This Row],[Entiteit of attribuut]]))","v":{"$error":"#REF!"}},{"$f":"IF(Schema!#REF!=\"\",\"\",Schema!#REF!)","v":{"$error":"#REF!"}},{"$f":"IF(Schema!#REF!=\"\",\"\",Schema!#REF!)","v":{"$error":"#REF!"}},{"$f":"IF(Schema!#REF!=\"\",\"\",Schema!#REF!)","v":{"$error":"#REF!"}},{"$f":"IF(Schema!#REF!=\"\",\"\",Schema!#REF!)","v":{"$error":"#REF!"}},{"$f":"IF(Schema!#REF!=\"\",\"\",Schema!#REF!)","v":{"$error":"#REF!"}}]
[{"$f":"Schema!#REF!&Schema!#REF!&Schema!#REF!&Schema!#REF!","v":{"$error":"#REF!"}},{"$error":"#REF!"},{"$f":"IF(A484=\"\",\"\",IF(LEN(Schema!#REF!)=2,1,IF(LEN(Schema!#REF!)=2,10,IF(LEN(Schema!#REF!)=2,100,0))))","v":{"$error":"#REF!"}},{"$error":"#REF!"},{"$f":"IF(A484=\"\",\"\",SUM(Tabel2[[#This Row],[I1]:[I2]]))","v":{"$error":"#REF!"}},{"$error":"#REF!"},{"$error":"#REF!"},{"$error":"#REF!"},{"$error":"#REF!"},{"$f":"IF(C484=\"\",\"\",IF(LEN(Tabel2[[#This Row],[Entiteit of attribuut]])=2,\"\",Tabel2[[#This Row],[Entiteit]]&\"_\"&Tabel2[[#This Row],[Entiteit of attribuut]]))","v":{"$error":"#REF!"}},{"$f":"IF(Schema!#REF!=\"\",\"\",Schema!#REF!)","v":{"$error":"#REF!"}},{"$f":"IF(Schema!#REF!=\"\",\"\",Schema!#REF!)","v":{"$error":"#REF!"}},{"$f":"IF(Schema!#REF!=\"\",\"\",Schema!#REF!)","v":{"$error":"#REF!"}},{"$f":"IF(Schema!#REF!=\"\",\"\",Schema!#REF!)","v":{"$error":"#REF!"}},{"$f":"IF(Schema!#REF!=\"\",\"\",Schema!#REF!)","v":{"$error":"#REF!"}}]
[{"$f":"Schema!#REF!&Schema!#REF!&Schema!#REF!&Schema!#REF!","v":{"$error":"#REF!"}},{"$error":"#REF!"},{"$f":"IF(A485=\"\",\"\",IF(LEN(Schema!#REF!)=2,1,IF(LEN(Schema!#REF!)=2,10,IF(LEN(Schema!#REF!)=2,100,0))))","v":{"$error":"#REF!"}},{"$error":"#REF!"},{"$f":"IF(A485=\"\",\"\",SUM(Tabel2[[#This Row],[I1]:[I2]]))","v":{"$error":"#REF!"}},{"$error":"#REF!"},{"$error":"#REF!"},{"$error":"#REF!"},{"$error":"#REF!"},{"$f":"IF(C485=\"\",\"\",IF(LEN(Tabel2[[#This Row],[Entiteit of attribuut]])=2,\"\",Tabel2[[#This Row],[Entiteit]]&\"_\"&Tabel2[[#This Row],[Entiteit of attribuut]]))","v":{"$error":"#REF!"}},{"$f":"IF(Schema!#REF!=\"\",\"\",Schema!#REF!)","v":{"$error":"#REF!"}},{"$f":"IF(Schema!#REF!=\"\",\"\",Schema!#REF!)","v":{"$error":"#REF!"}},{"$f":"IF(Schema!#REF!=\"\",\"\",Schema!#REF!)","v":{"$error":"#REF!"}},{"$f":"IF(Schema!#REF!=\"\",\"\",Schema!#REF!)","v":{"$error":"#REF!"}},{"$f":"IF(Schema!#REF!=\"\",\"\",Schema!#REF!)","v":{"$error":"#REF!"}}]
[{"$f":"Schema!#REF!&Schema!#REF!&Schema!#REF!&Schema!#REF!","v":{"$error":"#REF!"}},{"$error":"#REF!"},{"$f":"IF(A486=\"\",\"\",IF(LEN(Schema!#REF!)=2,1,IF(LEN(Schema!#REF!)=2,10,IF(LEN(Schema!#REF!)=2,100,0))))","v":{"$error":"#REF!"}},{"$error":"#REF!"},{"$f":"IF(A486=\"\",\"\",SUM(Tabel2[[#This Row],[I1]:[I2]]))","v":{"$error":"#REF!"}},{"$error":"#REF!"},{"$error":"#REF!"},{"$error":"#REF!"},{"$error":"#REF!"},{"$f":"IF(C486=\"\",\"\",IF(LEN(Tabel2[[#This Row],[Entiteit of attribuut]])=2,\"\",Tabel2[[#This Row],[Entiteit]]&\"_\"&Tabel2[[#This Row],[Entiteit of attribuut]]))","v":{"$error":"#REF!"}},{"$f":"IF(Schema!#REF!=\"\",\"\",Schema!#REF!)","v":{"$error":"#REF!"}},{"$f":"IF(Schema!#REF!=\"\",\"\",Schema!#REF!)","v":{"$error":"#REF!"}},{"$f":"IF(Schema!#REF!=\"\",\"\",Schema!#REF!)","v":{"$error":"#REF!"}},{"$f":"IF(Schema!#REF!=\"\",\"\",Schema!#REF!)","v":{"$error":"#REF!"}},{"$f":"IF(Schema!#REF!=\"\",\"\",Schema!#REF!)","v":{"$error":"#REF!"}}]
[{"$f":"Schema!#REF!&Schema!#REF!&Schema!#REF!&Schema!#REF!","v":{"$error":"#REF!"}},{"$error":"#REF!"},{"$f":"IF(A487=\"\",\"\",IF(LEN(Schema!#REF!)=2,1,IF(LEN(Schema!#REF!)=2,10,IF(LEN(Schema!#REF!)=2,100,0))))","v":{"$error":"#REF!"}},{"$error":"#REF!"},{"$f":"IF(A487=\"\",\"\",SUM(Tabel2[[#This Row],[I1]:[I2]]))","v":{"$error":"#REF!"}},{"$error":"#REF!"},{"$error":"#REF!"},{"$error":"#REF!"},{"$error":"#REF!"},{"$f":"IF(C487=\"\",\"\",IF(LEN(Tabel2[[#This Row],[Entiteit of attribuut]])=2,\"\",Tabel2[[#This Row],[Entiteit]]&\"_\"&Tabel2[[#This Row],[Entiteit of attribuut]]))","v":{"$error":"#REF!"}},{"$f":"IF(Schema!#REF!=\"\",\"\",Schema!#REF!)","v":{"$error":"#REF!"}},{"$f":"IF(Schema!#REF!=\"\",\"\",Schema!#REF!)","v":{"$error":"#REF!"}},{"$f":"IF(Schema!#REF!=\"\",\"\",Schema!#REF!)","v":{"$error":"#REF!"}},{"$f":"IF(Schema!#REF!=\"\",\"\",Schema!#REF!)","v":{"$error":"#REF!"}},{"$f":"IF(Schema!#REF!=\"\",\"\",Schema!#REF!)","v":{"$error":"#REF!"}}]
[{"$f":"Schema!#REF!&Schema!#REF!&Schema!#REF!&Schema!#REF!","v":{"$error":"#REF!"}},{"$error":"#REF!"},{"$f":"IF(A488=\"\",\"\",IF(LEN(Schema!#REF!)=2,1,IF(LEN(Schema!#REF!)=2,10,IF(LEN(Schema!#REF!)=2,100,0))))","v":{"$error":"#REF!"}},{"$error":"#REF!"},{"$f":"IF(A488=\"\",\"\",SUM(Tabel2[[#This Row],[I1]:[I2]]))","v":{"$error":"#REF!"}},{"$error":"#REF!"},{"$error":"#REF!"},{"$error":"#REF!"},{"$error":"#REF!"},{"$f":"IF(C488=\"\",\"\",IF(LEN(Tabel2[[#This Row],[Entiteit of attribuut]])=2,\"\",Tabel2[[#This Row],[Entiteit]]&\"_\"&Tabel2[[#This Row],[Entiteit of attribuut]]))","v":{"$error":"#REF!"}},{"$f":"IF(Schema!#REF!=\"\",\"\",Schema!#REF!)","v":{"$error":"#REF!"}},{"$f":"IF(Schema!#REF!=\"\",\"\",Schema!#REF!)","v":{"$error":"#REF!"}},{"$f":"IF(Schema!#REF!=\"\",\"\",Schema!#REF!)","v":{"$error":"#REF!"}},{"$f":"IF(Schema!#REF!=\"\",\"\",Schema!#REF!)","v":{"$error":"#REF!"}},{"$f":"IF(Schema!#REF!=\"\",\"\",Schema!#REF!)","v":{"$error":"#REF!"}}]
[{"$f":"Schema!#REF!&Schema!#REF!&Schema!#REF!&Schema!#REF!","v":{"$error":"#REF!"}},{"$error":"#REF!"},{"$f":"IF(A489=\"\",\"\",IF(LEN(Schema!#REF!)=2,1,IF(LEN(Schema!#REF!)=2,10,IF(LEN(Schema!#REF!)=2,100,0))))","v":{"$error":"#REF!"}},{"$error":"#REF!"},{"$f":"IF(A489=\"\",\"\",SUM(Tabel2[[#This Row],[I1]:[I2]]))","v":{"$error":"#REF!"}},{"$error":"#REF!"},{"$error":"#REF!"},{"$error":"#REF!"},{"$error":"#REF!"},{"$f":"IF(C489=\"\",\"\",IF(LEN(Tabel2[[#This Row],[Entiteit of attribuut]])=2,\"\",Tabel2[[#This Row],[Entiteit]]&\"_\"&Tabel2[[#This Row],[Entiteit of attribuut]]))","v":{"$error":"#REF!"}},{"$f":"IF(Schema!#REF!=\"\",\"\",Schema!#REF!)","v":{"$error":"#REF!"}},{"$f":"IF(Schema!#REF!=\"\",\"\",Schema!#REF!)","v":{"$error":"#REF!"}},{"$f":"IF(Schema!#REF!=\"\",\"\",Schema!#REF!)","v":{"$error":"#REF!"}},{"$f":"IF(Schema!#REF!=\"\",\"\",Schema!#REF!)","v":{"$error":"#REF!"}},{"$f":"IF(Schema!#REF!=\"\",\"\",Schema!#REF!)","v":{"$error":"#REF!"}}]
[{"$f":"Schema!#REF!&Schema!#REF!&Schema!#REF!&Schema!#REF!","v":{"$error":"#REF!"}},{"$error":"#REF!"},{"$f":"IF(A490=\"\",\"\",IF(LEN(Schema!#REF!)=2,1,IF(LEN(Schema!#REF!)=2,10,IF(LEN(Schema!#REF!)=2,100,0))))","v":{"$error":"#REF!"}},{"$error":"#REF!"},{"$f":"IF(A490=\"\",\"\",SUM(Tabel2[[#This Row],[I1]:[I2]]))","v":{"$error":"#REF!"}},{"$error":"#REF!"},{"$error":"#REF!"},{"$error":"#REF!"},{"$error":"#REF!"},{"$f":"IF(C490=\"\",\"\",IF(LEN(Tabel2[[#This Row],[Entiteit of attribuut]])=2,\"\",Tabel2[[#This Row],[Entiteit]]&\"_\"&Tabel2[[#This Row],[Entiteit of attribuut]]))","v":{"$error":"#REF!"}},{"$f":"IF(Schema!#REF!=\"\",\"\",Schema!#REF!)","v":{"$error":"#REF!"}},{"$f":"IF(Schema!#REF!=\"\",\"\",Schema!#REF!)","v":{"$error":"#REF!"}},{"$f":"IF(Schema!#REF!=\"\",\"\",Schema!#REF!)","v":{"$error":"#REF!"}},{"$f":"IF(Schema!#REF!=\"\",\"\",Schema!#REF!)","v":{"$error":"#REF!"}},{"$f":"IF(Schema!#REF!=\"\",\"\",Schema!#REF!)","v":{"$error":"#REF!"}}]
[{"$f":"Schema!#REF!&Schema!#REF!&Schema!#REF!&Schema!#REF!","v":{"$error":"#REF!"}},{"$error":"#REF!"},{"$f":"IF(A491=\"\",\"\",IF(LEN(Schema!#REF!)=2,1,IF(LEN(Schema!#REF!)=2,10,IF(LEN(Schema!#REF!)=2,100,0))))","v":{"$error":"#REF!"}},{"$error":"#REF!"},{"$f":"IF(A491=\"\",\"\",SUM(Tabel2[[#This Row],[I1]:[I2]]))","v":{"$error":"#REF!"}},{"$error":"#REF!"},{"$error":"#REF!"},{"$error":"#REF!"},{"$error":"#REF!"},{"$f":"IF(C491=\"\",\"\",IF(LEN(Tabel2[[#This Row],[Entiteit of attribuut]])=2,\"\",Tabel2[[#This Row],[Entiteit]]&\"_\"&Tabel2[[#This Row],[Entiteit of attribuut]]))","v":{"$error":"#REF!"}},{"$f":"IF(Schema!#REF!=\"\",\"\",Schema!#REF!)","v":{"$error":"#REF!"}},{"$f":"IF(Schema!#REF!=\"\",\"\",Schema!#REF!)","v":{"$error":"#REF!"}},{"$f":"IF(Schema!#REF!=\"\",\"\",Schema!#REF!)","v":{"$error":"#REF!"}},{"$f":"IF(Schema!#REF!=\"\",\"\",Schema!#REF!)","v":{"$error":"#REF!"}},{"$f":"IF(Schema!#REF!=\"\",\"\",Schema!#REF!)","v":{"$error":"#REF!"}}]
[{"$f":"Schema!#REF!&Schema!#REF!&Schema!#REF!&Schema!#REF!","v":{"$error":"#REF!"}},{"$error":"#REF!"},{"$f":"IF(A492=\"\",\"\",IF(LEN(Schema!#REF!)=2,1,IF(LEN(Schema!#REF!)=2,10,IF(LEN(Schema!#REF!)=2,100,0))))","v":{"$error":"#REF!"}},{"$error":"#REF!"},{"$f":"IF(A492=\"\",\"\",SUM(Tabel2[[#This Row],[I1]:[I2]]))","v":{"$error":"#REF!"}},{"$error":"#REF!"},{"$error":"#REF!"},{"$error":"#REF!"},{"$error":"#REF!"},{"$f":"IF(C492=\"\",\"\",IF(LEN(Tabel2[[#This Row],[Entiteit of attribuut]])=2,\"\",Tabel2[[#This Row],[Entiteit]]&\"_\"&Tabel2[[#This Row],[Entiteit of attribuut]]))","v":{"$error":"#REF!"}},{"$f":"IF(Schema!#REF!=\"\",\"\",Schema!#REF!)","v":{"$error":"#REF!"}},{"$f":"IF(Schema!#REF!=\"\",\"\",Schema!#REF!)","v":{"$error":"#REF!"}},{"$f":"IF(Schema!#REF!=\"\",\"\",Schema!#REF!)","v":{"$error":"#REF!"}},{"$f":"IF(Schema!#REF!=\"\",\"\",Schema!#REF!)","v":{"$error":"#REF!"}},{"$f":"IF(Schema!#REF!=\"\",\"\",Schema!#REF!)","v":{"$error":"#REF!"}}]
[{"$f":"Schema!#REF!&Schema!#REF!&Schema!#REF!&Schema!#REF!","v":{"$error":"#REF!"}},{"$error":"#REF!"},{"$f":"IF(A493=\"\",\"\",IF(LEN(Schema!#REF!)=2,1,IF(LEN(Schema!#REF!)=2,10,IF(LEN(Schema!#REF!)=2,100,0))))","v":{"$error":"#REF!"}},{"$error":"#REF!"},{"$f":"IF(A493=\"\",\"\",SUM(Tabel2[[#This Row],[I1]:[I2]]))","v":{"$error":"#REF!"}},{"$error":"#REF!"},{"$error":"#REF!"},{"$error":"#REF!"},{"$error":"#REF!"},{"$f":"IF(C493=\"\",\"\",IF(LEN(Tabel2[[#This Row],[Entiteit of attribuut]])=2,\"\",Tabel2[[#This Row],[Entiteit]]&\"_\"&Tabel2[[#This Row],[Entiteit of attribuut]]))","v":{"$error":"#REF!"}},{"$f":"IF(Schema!#REF!=\"\",\"\",Schema!#REF!)","v":{"$error":"#REF!"}},{"$f":"IF(Schema!#REF!=\"\",\"\",Schema!#REF!)","v":{"$error":"#REF!"}},{"$f":"IF(Schema!#REF!=\"\",\"\",Schema!#REF!)","v":{"$error":"#REF!"}},{"$f":"IF(Schema!#REF!=\"\",\"\",Schema!#REF!)","v":{"$error":"#REF!"}},{"$f":"IF(Schema!#REF!=\"\",\"\",Schema!#REF!)","v":{"$error":"#REF!"}}]
[{"$f":"Schema!#REF!&Schema!#REF!&Schema!#REF!&Schema!#REF!","v":{"$error":"#REF!"}},{"$error":"#REF!"},{"$f":"IF(A494=\"\",\"\",IF(LEN(Schema!#REF!)=2,1,IF(LEN(Schema!#REF!)=2,10,IF(LEN(Schema!#REF!)=2,100,0))))","v":{"$error":"#REF!"}},{"$error":"#REF!"},{"$f":"IF(A494=\"\",\"\",SUM(Tabel2[[#This Row],[I1]:[I2]]))","v":{"$error":"#REF!"}},{"$error":"#REF!"},{"$error":"#REF!"},{"$error":"#REF!"},{"$error":"#REF!"},{"$f":"IF(C494=\"\",\"\",IF(LEN(Tabel2[[#This Row],[Entiteit of attribuut]])=2,\"\",Tabel2[[#This Row],[Entiteit]]&\"_\"&Tabel2[[#This Row],[Entiteit of attribuut]]))","v":{"$error":"#REF!"}},{"$f":"IF(Schema!#REF!=\"\",\"\",Schema!#REF!)","v":{"$error":"#REF!"}},{"$f":"IF(Schema!#REF!=\"\",\"\",Schema!#REF!)","v":{"$error":"#REF!"}},{"$f":"IF(Schema!#REF!=\"\",\"\",Schema!#REF!)","v":{"$error":"#REF!"}},{"$f":"IF(Schema!#REF!=\"\",\"\",Schema!#REF!)","v":{"$error":"#REF!"}},{"$f":"IF(Schema!#REF!=\"\",\"\",Schema!#REF!)","v":{"$error":"#REF!"}}]
[{"$f":"Schema!#REF!&Schema!#REF!&Schema!#REF!&Schema!#REF!","v":{"$error":"#REF!"}},{"$error":"#REF!"},{"$f":"IF(A495=\"\",\"\",IF(LEN(Schema!#REF!)=2,1,IF(LEN(Schema!#REF!)=2,10,IF(LEN(Schema!#REF!)=2,100,0))))","v":{"$error":"#REF!"}},{"$error":"#REF!"},{"$f":"IF(A495=\"\",\"\",SUM(Tabel2[[#This Row],[I1]:[I2]]))","v":{"$error":"#REF!"}},{"$error":"#REF!"},{"$error":"#REF!"},{"$error":"#REF!"},{"$error":"#REF!"},{"$f":"IF(C495=\"\",\"\",IF(LEN(Tabel2[[#This Row],[Entiteit of attribuut]])=2,\"\",Tabel2[[#This Row],[Entiteit]]&\"_\"&Tabel2[[#This Row],[Entiteit of attribuut]]))","v":{"$error":"#REF!"}},{"$f":"IF(Schema!#REF!=\"\",\"\",Schema!#REF!)","v":{"$error":"#REF!"}},{"$f":"IF(Schema!#REF!=\"\",\"\",Schema!#REF!)","v":{"$error":"#REF!"}},{"$f":"IF(Schema!#REF!=\"\",\"\",Schema!#REF!)","v":{"$error":"#REF!"}},{"$f":"IF(Schema!#REF!=\"\",\"\",Schema!#REF!)","v":{"$error":"#REF!"}},{"$f":"IF(Schema!#REF!=\"\",\"\",Schema!#REF!)","v":{"$error":"#REF!"}}]
[{"$f":"Schema!#REF!&Schema!#REF!&Schema!#REF!&Schema!#REF!","v":{"$error":"#REF!"}},{"$error":"#REF!"},{"$f":"IF(A496=\"\",\"\",IF(LEN(Schema!#REF!)=2,1,IF(LEN(Schema!#REF!)=2,10,IF(LEN(Schema!#REF!)=2,100,0))))","v":{"$error":"#REF!"}},{"$error":"#REF!"},{"$f":"IF(A496=\"\",\"\",SUM(Tabel2[[#This Row],[I1]:[I2]]))","v":{"$error":"#REF!"}},{"$error":"#REF!"},{"$error":"#REF!"},{"$error":"#REF!"},{"$error":"#REF!"},{"$f":"IF(C496=\"\",\"\",IF(LEN(Tabel2[[#This Row],[Entiteit of attribuut]])=2,\"\",Tabel2[[#This Row],[Entiteit]]&\"_\"&Tabel2[[#This Row],[Entiteit of attribuut]]))","v":{"$error":"#REF!"}},{"$f":"IF(Schema!#REF!=\"\",\"\",Schema!#REF!)","v":{"$error":"#REF!"}},{"$f":"IF(Schema!#REF!=\"\",\"\",Schema!#REF!)","v":{"$error":"#REF!"}},{"$f":"IF(Schema!#REF!=\"\",\"\",Schema!#REF!)","v":{"$error":"#REF!"}},{"$f":"IF(Schema!#REF!=\"\",\"\",Schema!#REF!)","v":{"$error":"#REF!"}},{"$f":"IF(Schema!#REF!=\"\",\"\",Schema!#REF!)","v":{"$error":"#REF!"}}]
[{"$f":"Schema!#REF!&Schema!#REF!&Schema!#REF!&Schema!#REF!","v":{"$error":"#REF!"}},{"$error":"#REF!"},{"$f":"IF(A497=\"\",\"\",IF(LEN(Schema!#REF!)=2,1,IF(LEN(Schema!#REF!)=2,10,IF(LEN(Schema!#REF!)=2,100,0))))","v":{"$error":"#REF!"}},{"$error":"#REF!"},{"$f":"IF(A497=\"\",\"\",SUM(Tabel2[[#This Row],[I1]:[I2]]))","v":{"$error":"#REF!"}},{"$error":"#REF!"},{"$error":"#REF!"},{"$error":"#REF!"},{"$error":"#REF!"},{"$f":"IF(C497=\"\",\"\",IF(LEN(Tabel2[[#This Row],[Entiteit of attribuut]])=2,\"\",Tabel2[[#This Row],[Entiteit]]&\"_\"&Tabel2[[#This Row],[Entiteit of attribuut]]))","v":{"$error":"#REF!"}},{"$f":"IF(Schema!#REF!=\"\",\"\",Schema!#REF!)","v":{"$error":"#REF!"}},{"$f":"IF(Schema!#REF!=\"\",\"\",Schema!#REF!)","v":{"$error":"#REF!"}},{"$f":"IF(Schema!#REF!=\"\",\"\",Schema!#REF!)","v":{"$error":"#REF!"}},{"$f":"IF(Schema!#REF!=\"\",\"\",Schema!#REF!)","v":{"$error":"#REF!"}},{"$f":"IF(Schema!#REF!=\"\",\"\",Schema!#REF!)","v":{"$error":"#REF!"}}]
[{"$f":"Schema!#REF!&Schema!#REF!&Schema!#REF!&Schema!#REF!","v":{"$error":"#REF!"}},{"$error":"#REF!"},{"$f":"IF(A498=\"\",\"\",IF(LEN(Schema!#REF!)=2,1,IF(LEN(Schema!#REF!)=2,10,IF(LEN(Schema!#REF!)=2,100,0))))","v":{"$error":"#REF!"}},{"$error":"#REF!"},{"$f":"IF(A498=\"\",\"\",SUM(Tabel2[[#This Row],[I1]:[I2]]))","v":{"$error":"#REF!"}},{"$error":"#REF!"},{"$error":"#REF!"},{"$error":"#REF!"},{"$error":"#REF!"},{"$f":"IF(C498=\"\",\"\",IF(LEN(Tabel2[[#This Row],[Entiteit of attribuut]])=2,\"\",Tabel2[[#This Row],[Entiteit]]&\"_\"&Tabel2[[#This Row],[Entiteit of attribuut]]))","v":{"$error":"#REF!"}},{"$f":"IF(Schema!#REF!=\"\",\"\",Schema!#REF!)","v":{"$error":"#REF!"}},{"$f":"IF(Schema!#REF!=\"\",\"\",Schema!#REF!)","v":{"$error":"#REF!"}},{"$f":"IF(Schema!#REF!=\"\",\"\",Schema!#REF!)","v":{"$error":"#REF!"}},{"$f":"IF(Schema!#REF!=\"\",\"\",Schema!#REF!)","v":{"$error":"#REF!"}},{"$f":"IF(Schema!#REF!=\"\",\"\",Schema!#REF!)","v":{"$error":"#REF!"}}]
[{"$f":"Schema!#REF!&Schema!#REF!&Schema!#REF!&Schema!#REF!","v":{"$error":"#REF!"}},{"$error":"#REF!"},{"$f":"IF(A499=\"\",\"\",IF(LEN(Schema!#REF!)=2,1,IF(LEN(Schema!#REF!)=2,10,IF(LEN(Schema!#REF!)=2,100,0))))","v":{"$error":"#REF!"}},{"$error":"#REF!"},{"$f":"IF(A499=\"\",\"\",SUM(Tabel2[[#This Row],[I1]:[I2]]))","v":{"$error":"#REF!"}},{"$error":"#REF!"},{"$error":"#REF!"},{"$error":"#REF!"},{"$error":"#REF!"},{"$f":"IF(C499=\"\",\"\",IF(LEN(Tabel2[[#This Row],[Entiteit of attribuut]])=2,\"\",Tabel2[[#This Row],[Entiteit]]&\"_\"&Tabel2[[#This Row],[Entiteit of attribuut]]))","v":{"$error":"#REF!"}},{"$f":"IF(Schema!#REF!=\"\",\"\",Schema!#REF!)","v":{"$error":"#REF!"}},{"$f":"IF(Schema!#REF!=\"\",\"\",Schema!#REF!)","v":{"$error":"#REF!"}},{"$f":"IF(Schema!#REF!=\"\",\"\",Schema!#REF!)","v":{"$error":"#REF!"}},{"$f":"IF(Schema!#REF!=\"\",\"\",Schema!#REF!)","v":{"$error":"#REF!"}},{"$f":"IF(Schema!#REF!=\"\",\"\",Schema!#REF!)","v":{"$error":"#REF!"}}]
[{"$f":"Schema!#REF!&Schema!#REF!&Schema!#REF!&Schema!#REF!","v":{"$error":"#REF!"}},{"$error":"#REF!"},{"$f":"IF(A500=\"\",\"\",IF(LEN(Schema!#REF!)=2,1,IF(LEN(Schema!#REF!)=2,10,IF(LEN(Schema!#REF!)=2,100,0))))","v":{"$error":"#REF!"}},{"$error":"#REF!"},{"$f":"IF(A500=\"\",\"\",SUM(Tabel2[[#This Row],[I1]:[I2]]))","v":{"$error":"#REF!"}},{"$error":"#REF!"},{"$error":"#REF!"},{"$error":"#REF!"},{"$error":"#REF!"},{"$f":"IF(C500=\"\",\"\",IF(LEN(Tabel2[[#This Row],[Entiteit of attribuut]])=2,\"\",Tabel2[[#This Row],[Entiteit]]&\"_\"&Tabel2[[#This Row],[Entiteit of attribuut]]))","v":{"$error":"#REF!"}},{"$f":"IF(Schema!#REF!=\"\",\"\",Schema!#REF!)","v":{"$error":"#REF!"}},{"$f":"IF(Schema!#REF!=\"\",\"\",Schema!#REF!)","v":{"$error":"#REF!"}},{"$f":"IF(Schema!#REF!=\"\",\"\",Schema!#REF!)","v":{"$error":"#REF!"}},{"$f":"IF(Schema!#REF!=\"\",\"\",Schema!#REF!)","v":{"$error":"#REF!"}},{"$f":"IF(Schema!#REF!=\"\",\"\",Schema!#REF!)","v":{"$error":"#REF!"}}]
[{"$f":"Schema!#REF!&Schema!#REF!&Schema!#REF!&Schema!#REF!","v":{"$error":"#REF!"}},{"$error":"#REF!"},{"$f":"IF(A501=\"\",\"\",IF(LEN(Schema!#REF!)=2,1,IF(LEN(Schema!#REF!)=2,10,IF(LEN(Schema!#REF!)=2,100,0))))","v":{"$error":"#REF!"}},{"$error":"#REF!"},{"$f":"IF(A501=\"\",\"\",SUM(Tabel2[[#This Row],[I1]:[I2]]))","v":{"$error":"#REF!"}},{"$error":"#REF!"},{"$error":"#REF!"},{"$error":"#REF!"},{"$error":"#REF!"},{"$f":"IF(C501=\"\",\"\",IF(LEN(Tabel2[[#This Row],[Entiteit of attribuut]])=2,\"\",Tabel2[[#This Row],[Entiteit]]&\"_\"&Tabel2[[#This Row],[Entiteit of attribuut]]))","v":{"$error":"#REF!"}},{"$f":"IF(Schema!#REF!=\"\",\"\",Schema!#REF!)","v":{"$error":"#REF!"}},{"$f":"IF(Schema!#REF!=\"\",\"\",Schema!#REF!)","v":{"$error":"#REF!"}},{"$f":"IF(Schema!#REF!=\"\",\"\",Schema!#REF!)","v":{"$error":"#REF!"}},{"$f":"IF(Schema!#REF!=\"\",\"\",Schema!#REF!)","v":{"$error":"#REF!"}},{"$f":"IF(Schema!#REF!=\"\",\"\",Schema!#REF!)","v":{"$error":"#REF!"}}]
[{"$f":"Schema!#REF!&Schema!#REF!&Schema!#REF!&Schema!#REF!","v":{"$error":"#REF!"}},{"$error":"#REF!"},{"$f":"IF(A502=\"\",\"\",IF(LEN(Schema!#REF!)=2,1,IF(LEN(Schema!#REF!)=2,10,IF(LEN(Schema!#REF!)=2,100,0))))","v":{"$error":"#REF!"}},{"$error":"#REF!"},{"$f":"IF(A502=\"\",\"\",SUM(Tabel2[[#This Row],[I1]:[I2]]))","v":{"$error":"#REF!"}},{"$error":"#REF!"},{"$error":"#REF!"},{"$error":"#REF!"},{"$error":"#REF!"},{"$f":"IF(C502=\"\",\"\",IF(LEN(Tabel2[[#This Row],[Entiteit of attribuut]])=2,\"\",Tabel2[[#This Row],[Entiteit]]&\"_\"&Tabel2[[#This Row],[Entiteit of attribuut]]))","v":{"$error":"#REF!"}},{"$f":"IF(Schema!#REF!=\"\",\"\",Schema!#REF!)","v":{"$error":"#REF!"}},{"$f":"IF(Schema!#REF!=\"\",\"\",Schema!#REF!)","v":{"$error":"#REF!"}},{"$f":"IF(Schema!#REF!=\"\",\"\",Schema!#REF!)","v":{"$error":"#REF!"}},{"$f":"IF(Schema!#REF!=\"\",\"\",Schema!#REF!)","v":{"$error":"#REF!"}},{"$f":"IF(Schema!#REF!=\"\",\"\",Schema!#REF!)","v":{"$error":"#REF!"}}]
[{"$f":"Schema!#REF!&Schema!#REF!&Schema!#REF!&Schema!#REF!","v":{"$error":"#REF!"}},{"$error":"#REF!"},{"$f":"IF(A503=\"\",\"\",IF(LEN(Schema!#REF!)=2,1,IF(LEN(Schema!#REF!)=2,10,IF(LEN(Schema!#REF!)=2,100,0))))","v":{"$error":"#REF!"}},{"$error":"#REF!"},{"$f":"IF(A503=\"\",\"\",SUM(Tabel2[[#This Row],[I1]:[I2]]))","v":{"$error":"#REF!"}},{"$error":"#REF!"},{"$error":"#REF!"},{"$error":"#REF!"},{"$error":"#REF!"},{"$f":"IF(C503=\"\",\"\",IF(LEN(Tabel2[[#This Row],[Entiteit of attribuut]])=2,\"\",Tabel2[[#This Row],[Entiteit]]&\"_\"&Tabel2[[#This Row],[Entiteit of attribuut]]))","v":{"$error":"#REF!"}},{"$f":"IF(Schema!#REF!=\"\",\"\",Schema!#REF!)","v":{"$error":"#REF!"}},{"$f":"IF(Schema!#REF!=\"\",\"\",Schema!#REF!)","v":{"$error":"#REF!"}},{"$f":"IF(Schema!#REF!=\"\",\"\",Schema!#REF!)","v":{"$error":"#REF!"}},{"$f":"IF(Schema!#REF!=\"\",\"\",Schema!#REF!)","v":{"$error":"#REF!"}},{"$f":"IF(Schema!#REF!=\"\",\"\",Schema!#REF!)","v":{"$error":"#REF!"}}]
[{"$f":"Schema!#REF!&Schema!#REF!&Schema!#REF!&Schema!#REF!","v":{"$error":"#REF!"}},{"$error":"#REF!"},{"$f":"IF(A504=\"\",\"\",IF(LEN(Schema!#REF!)=2,1,IF(LEN(Schema!#REF!)=2,10,IF(LEN(Schema!#REF!)=2,100,0))))","v":{"$error":"#REF!"}},{"$error":"#REF!"},{"$f":"IF(A504=\"\",\"\",SUM(Tabel2[[#This Row],[I1]:[I2]]))","v":{"$error":"#REF!"}},{"$error":"#REF!"},{"$error":"#REF!"},{"$error":"#REF!"},{"$error":"#REF!"},{"$f":"IF(C504=\"\",\"\",IF(LEN(Tabel2[[#This Row],[Entiteit of attribuut]])=2,\"\",Tabel2[[#This Row],[Entiteit]]&\"_\"&Tabel2[[#This Row],[Entiteit of attribuut]]))","v":{"$error":"#REF!"}},{"$f":"IF(Schema!#REF!=\"\",\"\",Schema!#REF!)","v":{"$error":"#REF!"}},{"$f":"IF(Schema!#REF!=\"\",\"\",Schema!#REF!)","v":{"$error":"#REF!"}},{"$f":"IF(Schema!#REF!=\"\",\"\",Schema!#REF!)","v":{"$error":"#REF!"}},{"$f":"IF(Schema!#REF!=\"\",\"\",Schema!#REF!)","v":{"$error":"#REF!"}},{"$f":"IF(Schema!#REF!=\"\",\"\",Schema!#REF!)","v":{"$error":"#REF!"}}]
[{"$f":"Schema!#REF!&Schema!#REF!&Schema!#REF!&Schema!#REF!","v":{"$error":"#REF!"}},{"$error":"#REF!"},{"$f":"IF(A505=\"\",\"\",IF(LEN(Schema!#REF!)=2,1,IF(LEN(Schema!#REF!)=2,10,IF(LEN(Schema!#REF!)=2,100,0))))","v":{"$error":"#REF!"}},{"$error":"#REF!"},{"$f":"IF(A505=\"\",\"\",SUM(Tabel2[[#This Row],[I1]:[I2]]))","v":{"$error":"#REF!"}},{"$error":"#REF!"},{"$error":"#REF!"},{"$error":"#REF!"},{"$error":"#REF!"},{"$f":"IF(C505=\"\",\"\",IF(LEN(Tabel2[[#This Row],[Entiteit of attribuut]])=2,\"\",Tabel2[[#This Row],[Entiteit]]&\"_\"&Tabel2[[#This Row],[Entiteit of attribuut]]))","v":{"$error":"#REF!"}},{"$f":"IF(Schema!#REF!=\"\",\"\",Schema!#REF!)","v":{"$error":"#REF!"}},{"$f":"IF(Schema!#REF!=\"\",\"\",Schema!#REF!)","v":{"$error":"#REF!"}},{"$f":"IF(Schema!#REF!=\"\",\"\",Schema!#REF!)","v":{"$error":"#REF!"}},{"$f":"IF(Schema!#REF!=\"\",\"\",Schema!#REF!)","v":{"$error":"#REF!"}},{"$f":"IF(Schema!#REF!=\"\",\"\",Schema!#REF!)","v":{"$error":"#REF!"}}]
[{"$f":"Schema!#REF!&Schema!#REF!&Schema!#REF!&Schema!#REF!","v":{"$error":"#REF!"}},{"$error":"#REF!"},{"$f":"IF(A506=\"\",\"\",IF(LEN(Schema!#REF!)=2,1,IF(LEN(Schema!#REF!)=2,10,IF(LEN(Schema!#REF!)=2,100,0))))","v":{"$error":"#REF!"}},{"$error":"#REF!"},{"$f":"IF(A506=\"\",\"\",SUM(Tabel2[[#This Row],[I1]:[I2]]))","v":{"$error":"#REF!"}},{"$error":"#REF!"},{"$error":"#REF!"},{"$error":"#REF!"},{"$error":"#REF!"},{"$f":"IF(C506=\"\",\"\",IF(LEN(Tabel2[[#This Row],[Entiteit of attribuut]])=2,\"\",Tabel2[[#This Row],[Entiteit]]&\"_\"&Tabel2[[#This Row],[Entiteit of attribuut]]))","v":{"$error":"#REF!"}},{"$f":"IF(Schema!#REF!=\"\",\"\",Schema!#REF!)","v":{"$error":"#REF!"}},{"$f":"IF(Schema!#REF!=\"\",\"\",Schema!#REF!)","v":{"$error":"#REF!"}},{"$f":"IF(Schema!#REF!=\"\",\"\",Schema!#REF!)","v":{"$error":"#REF!"}},{"$f":"IF(Schema!#REF!=\"\",\"\",Schema!#REF!)","v":{"$error":"#REF!"}},{"$f":"IF(Schema!#REF!=\"\",\"\",Schema!#REF!)","v":{"$error":"#REF!"}}]
[{"$f":"Schema!#REF!&Schema!#REF!&Schema!#REF!&Schema!#REF!","v":{"$error":"#REF!"}},{"$error":"#REF!"},{"$f":"IF(A507=\"\",\"\",IF(LEN(Schema!#REF!)=2,1,IF(LEN(Schema!#REF!)=2,10,IF(LEN(Schema!#REF!)=2,100,0))))","v":{"$error":"#REF!"}},{"$error":"#REF!"},{"$f":"IF(A507=\"\",\"\",SUM(Tabel2[[#This Row],[I1]:[I2]]))","v":{"$error":"#REF!"}},{"$error":"#REF!"},{"$error":"#REF!"},{"$error":"#REF!"},{"$error":"#REF!"},{"$f":"IF(C507=\"\",\"\",IF(LEN(Tabel2[[#This Row],[Entiteit of attribuut]])=2,\"\",Tabel2[[#This Row],[Entiteit]]&\"_\"&Tabel2[[#This Row],[Entiteit of attribuut]]))","v":{"$error":"#REF!"}},{"$f":"IF(Schema!#REF!=\"\",\"\",Schema!#REF!)","v":{"$error":"#REF!"}},{"$f":"IF(Schema!#REF!=\"\",\"\",Schema!#REF!)","v":{"$error":"#REF!"}},{"$f":"IF(Schema!#REF!=\"\",\"\",Schema!#REF!)","v":{"$error":"#REF!"}},{"$f":"IF(Schema!#REF!=\"\",\"\",Schema!#REF!)","v":{"$error":"#REF!"}},{"$f":"IF(Schema!#REF!=\"\",\"\",Schema!#REF!)","v":{"$error":"#REF!"}}]
[{"$f":"Schema!#REF!&Schema!#REF!&Schema!#REF!&Schema!#REF!","v":{"$error":"#REF!"}},{"$error":"#REF!"},{"$f":"IF(A508=\"\",\"\",IF(LEN(Schema!#REF!)=2,1,IF(LEN(Schema!#REF!)=2,10,IF(LEN(Schema!#REF!)=2,100,0))))","v":{"$error":"#REF!"}},{"$error":"#REF!"},{"$f":"IF(A508=\"\",\"\",SUM(Tabel2[[#This Row],[I1]:[I2]]))","v":{"$error":"#REF!"}},{"$error":"#REF!"},{"$error":"#REF!"},{"$error":"#REF!"},{"$error":"#REF!"},{"$f":"IF(C508=\"\",\"\",IF(LEN(Tabel2[[#This Row],[Entiteit of attribuut]])=2,\"\",Tabel2[[#This Row],[Entiteit]]&\"_\"&Tabel2[[#This Row],[Entiteit of attribuut]]))","v":{"$error":"#REF!"}},{"$f":"IF(Schema!#REF!=\"\",\"\",Schema!#REF!)","v":{"$error":"#REF!"}},{"$f":"IF(Schema!#REF!=\"\",\"\",Schema!#REF!)","v":{"$error":"#REF!"}},{"$f":"IF(Schema!#REF!=\"\",\"\",Schema!#REF!)","v":{"$error":"#REF!"}},{"$f":"IF(Schema!#REF!=\"\",\"\",Schema!#REF!)","v":{"$error":"#REF!"}},{"$f":"IF(Schema!#REF!=\"\",\"\",Schema!#REF!)","v":{"$error":"#REF!"}}]
[{"$f":"Schema!#REF!&Schema!#REF!&Schema!#REF!&Schema!#REF!","v":{"$error":"#REF!"}},{"$error":"#REF!"},{"$f":"IF(A509=\"\",\"\",IF(LEN(Schema!#REF!)=2,1,IF(LEN(Schema!#REF!)=2,10,IF(LEN(Schema!#REF!)=2,100,0))))","v":{"$error":"#REF!"}},{"$error":"#REF!"},{"$f":"IF(A509=\"\",\"\",SUM(Tabel2[[#This Row],[I1]:[I2]]))","v":{"$error":"#REF!"}},{"$error":"#REF!"},{"$error":"#REF!"},{"$error":"#REF!"},{"$error":"#REF!"},{"$f":"IF(C509=\"\",\"\",IF(LEN(Tabel2[[#This Row],[Entiteit of attribuut]])=2,\"\",Tabel2[[#This Row],[Entiteit]]&\"_\"&Tabel2[[#This Row],[Entiteit of attribuut]]))","v":{"$error":"#REF!"}},{"$f":"IF(Schema!#REF!=\"\",\"\",Schema!#REF!)","v":{"$error":"#REF!"}},{"$f":"IF(Schema!#REF!=\"\",\"\",Schema!#REF!)","v":{"$error":"#REF!"}},{"$f":"IF(Schema!#REF!=\"\",\"\",Schema!#REF!)","v":{"$error":"#REF!"}},{"$f":"IF(Schema!#REF!=\"\",\"\",Schema!#REF!)","v":{"$error":"#REF!"}},{"$f":"IF(Schema!#REF!=\"\",\"\",Schema!#REF!)","v":{"$error":"#REF!"}}]
[{"$f":"Schema!#REF!&Schema!#REF!&Schema!#REF!&Schema!#REF!","v":{"$error":"#REF!"}},{"$error":"#REF!"},{"$f":"IF(A510=\"\",\"\",IF(LEN(Schema!#REF!)=2,1,IF(LEN(Schema!#REF!)=2,10,IF(LEN(Schema!#REF!)=2,100,0))))","v":{"$error":"#REF!"}},{"$error":"#REF!"},{"$f":"IF(A510=\"\",\"\",SUM(Tabel2[[#This Row],[I1]:[I2]]))","v":{"$error":"#REF!"}},{"$error":"#REF!"},{"$error":"#REF!"},{"$error":"#REF!"},{"$error":"#REF!"},{"$f":"IF(C510=\"\",\"\",IF(LEN(Tabel2[[#This Row],[Entiteit of attribuut]])=2,\"\",Tabel2[[#This Row],[Entiteit]]&\"_\"&Tabel2[[#This Row],[Entiteit of attribuut]]))","v":{"$error":"#REF!"}},{"$f":"IF(Schema!#REF!=\"\",\"\",Schema!#REF!)","v":{"$error":"#REF!"}},{"$f":"IF(Schema!#REF!=\"\",\"\",Schema!#REF!)","v":{"$error":"#REF!"}},{"$f":"IF(Schema!#REF!=\"\",\"\",Schema!#REF!)","v":{"$error":"#REF!"}},{"$f":"IF(Schema!#REF!=\"\",\"\",Schema!#REF!)","v":{"$error":"#REF!"}},{"$f":"IF(Schema!#REF!=\"\",\"\",Schema!#REF!)","v":{"$error":"#REF!"}}]
[{"$f":"Schema!#REF!&Schema!#REF!&Schema!#REF!&Schema!#REF!","v":{"$error":"#REF!"}},{"$error":"#REF!"},{"$f":"IF(A511=\"\",\"\",IF(LEN(Schema!#REF!)=2,1,IF(LEN(Schema!#REF!)=2,10,IF(LEN(Schema!#REF!)=2,100,0))))","v":{"$error":"#REF!"}},{"$error":"#REF!"},{"$f":"IF(A511=\"\",\"\",SUM(Tabel2[[#This Row],[I1]:[I2]]))","v":{"$error":"#REF!"}},{"$error":"#REF!"},{"$error":"#REF!"},{"$error":"#REF!"},{"$error":"#REF!"},{"$f":"IF(C511=\"\",\"\",IF(LEN(Tabel2[[#This Row],[Entiteit of attribuut]])=2,\"\",Tabel2[[#This Row],[Entiteit]]&\"_\"&Tabel2[[#This Row],[Entiteit of attribuut]]))","v":{"$error":"#REF!"}},{"$f":"IF(Schema!#REF!=\"\",\"\",Schema!#REF!)","v":{"$error":"#REF!"}},{"$f":"IF(Schema!#REF!=\"\",\"\",Schema!#REF!)","v":{"$error":"#REF!"}},{"$f":"IF(Schema!#REF!=\"\",\"\",Schema!#REF!)","v":{"$error":"#REF!"}},{"$f":"IF(Schema!#REF!=\"\",\"\",Schema!#REF!)","v":{"$error":"#REF!"}},{"$f":"IF(Schema!#REF!=\"\",\"\",Schema!#REF!)","v":{"$error":"#REF!"}}]
[{"$f":"Schema!#REF!&Schema!#REF!&Schema!#REF!&Schema!#REF!","v":{"$error":"#REF!"}},{"$error":"#REF!"},{"$f":"IF(A512=\"\",\"\",IF(LEN(Schema!#REF!)=2,1,IF(LEN(Schema!#REF!)=2,10,IF(LEN(Schema!#REF!)=2,100,0))))","v":{"$error":"#REF!"}},{"$error":"#REF!"},{"$f":"IF(A512=\"\",\"\",SUM(Tabel2[[#This Row],[I1]:[I2]]))","v":{"$error":"#REF!"}},{"$error":"#REF!"},{"$error":"#REF!"},{"$error":"#REF!"},{"$error":"#REF!"},{"$f":"IF(C512=\"\",\"\",IF(LEN(Tabel2[[#This Row],[Entiteit of attribuut]])=2,\"\",Tabel2[[#This Row],[Entiteit]]&\"_\"&Tabel2[[#This Row],[Entiteit of attribuut]]))","v":{"$error":"#REF!"}},{"$f":"IF(Schema!#REF!=\"\",\"\",Schema!#REF!)","v":{"$error":"#REF!"}},{"$f":"IF(Schema!#REF!=\"\",\"\",Schema!#REF!)","v":{"$error":"#REF!"}},{"$f":"IF(Schema!#REF!=\"\",\"\",Schema!#REF!)","v":{"$error":"#REF!"}},{"$f":"IF(Schema!#REF!=\"\",\"\",Schema!#REF!)","v":{"$error":"#REF!"}},{"$f":"IF(Schema!#REF!=\"\",\"\",Schema!#REF!)","v":{"$error":"#REF!"}}]
[{"$f":"Schema!#REF!&Schema!#REF!&Schema!#REF!&Schema!#REF!","v":{"$error":"#REF!"}},{"$error":"#REF!"},{"$f":"IF(A513=\"\",\"\",IF(LEN(Schema!#REF!)=2,1,IF(LEN(Schema!#REF!)=2,10,IF(LEN(Schema!#REF!)=2,100,0))))","v":{"$error":"#REF!"}},{"$error":"#REF!"},{"$f":"IF(A513=\"\",\"\",SUM(Tabel2[[#This Row],[I1]:[I2]]))","v":{"$error":"#REF!"}},{"$error":"#REF!"},{"$error":"#REF!"},{"$error":"#REF!"},{"$error":"#REF!"},{"$f":"IF(C513=\"\",\"\",IF(LEN(Tabel2[[#This Row],[Entiteit of attribuut]])=2,\"\",Tabel2[[#This Row],[Entiteit]]&\"_\"&Tabel2[[#This Row],[Entiteit of attribuut]]))","v":{"$error":"#REF!"}},{"$f":"IF(Schema!#REF!=\"\",\"\",Schema!#REF!)","v":{"$error":"#REF!"}},{"$f":"IF(Schema!#REF!=\"\",\"\",Schema!#REF!)","v":{"$error":"#REF!"}},{"$f":"IF(Schema!#REF!=\"\",\"\",Schema!#REF!)","v":{"$error":"#REF!"}},{"$f":"IF(Schema!#REF!=\"\",\"\",Schema!#REF!)","v":{"$error":"#REF!"}},{"$f":"IF(Schema!#REF!=\"\",\"\",Schema!#REF!)","v":{"$error":"#REF!"}}]
[{"$f":"Schema!#REF!&Schema!#REF!&Schema!#REF!&Schema!#REF!","v":{"$error":"#REF!"}},{"$error":"#REF!"},{"$f":"IF(A514=\"\",\"\",IF(LEN(Schema!#REF!)=2,1,IF(LEN(Schema!#REF!)=2,10,IF(LEN(Schema!#REF!)=2,100,0))))","v":{"$error":"#REF!"}},{"$error":"#REF!"},{"$f":"IF(A514=\"\",\"\",SUM(Tabel2[[#This Row],[I1]:[I2]]))","v":{"$error":"#REF!"}},{"$error":"#REF!"},{"$error":"#REF!"},{"$error":"#REF!"},{"$error":"#REF!"},{"$f":"IF(C514=\"\",\"\",IF(LEN(Tabel2[[#This Row],[Entiteit of attribuut]])=2,\"\",Tabel2[[#This Row],[Entiteit]]&\"_\"&Tabel2[[#This Row],[Entiteit of attribuut]]))","v":{"$error":"#REF!"}},{"$f":"IF(Schema!#REF!=\"\",\"\",Schema!#REF!)","v":{"$error":"#REF!"}},{"$f":"IF(Schema!#REF!=\"\",\"\",Schema!#REF!)","v":{"$error":"#REF!"}},{"$f":"IF(Schema!#REF!=\"\",\"\",Schema!#REF!)","v":{"$error":"#REF!"}},{"$f":"IF(Schema!#REF!=\"\",\"\",Schema!#REF!)","v":{"$error":"#REF!"}},{"$f":"IF(Schema!#REF!=\"\",\"\",Schema!#REF!)","v":{"$error":"#REF!"}}]
[{"$f":"Schema!#REF!&Schema!#REF!&Schema!#REF!&Schema!#REF!","v":{"$error":"#REF!"}},{"$f":"IF(LEN(A515)=2,A515,IF(A515=\"\",\"Leeg\",B514))","v":{"$error":"#REF!"}},{"$f":"IF(A515=\"\",\"\",IF(LEN(Schema!#REF!)=2,1,IF(LEN(Schema!#REF!)=2,10,IF(LEN(Schema!#REF!)=2,100,0))))","v":{"$error":"#REF!"}},{"$f":"IF(C515=0,D514,C515)","v":{"$error":"#REF!"}},{"$f":"IF(A515=\"\",\"\",SUM(Tabel2[[#This Row],[I1]:[I2]]))","v":{"$error":"#REF!"}},{"$f":"IF(A515=\"\",\"\",IF(C515=1,B515,F514))","v":{"$error":"#REF!"}},{"$f":"IF(C515=10,A515,IF(OR(C515=0,C515=100),G514,\"\"))","v":{"$error":"#REF!"}},{"$f":"IF(E515=200,B515,IF(C515=0,H514,\"\"))","v":{"$error":"#REF!"}},{"$f":"IF(C515=\"\",\"\",IF(OR(E515=1,E515=10,E515=100),I514,IF(E515=2,F515,IF(E515=20,F515&\"/\"&G515,IF(E515=200,F515&\"/\"&G515&\"/\"&H515)))))","v":{"$error":"#REF!"}},{"$f":"IF(C515=\"\",\"\",IF(LEN(Tabel2[[#This Row],[Entiteit of attribuut]])=2,\"\",Tabel2[[#This Row],[Entiteit]]&\"_\"&Tabel2[[#This Row],[Entiteit of attribuut]]))","v":{"$error":"#REF!"}},{"$f":"IF(Schema!#REF!=\"\",\"\",Schema!#REF!)","v":{"$error":"#REF!"}},{"$f":"IF(Schema!#REF!=\"\",\"\",Schema!#REF!)","v":{"$error":"#REF!"}},{"$f":"IF(Schema!#REF!=\"\",\"\",Schema!#REF!)","v":{"$error":"#REF!"}},{"$f":"IF(Schema!#REF!=\"\",\"\",Schema!#REF!)","v":{"$error":"#REF!"}},{"$f":"IF(Schema!#REF!=\"\",\"\",Schema!#REF!)","v":{"$error":"#REF!"}}]
[{"$f":"Schema!#REF!&Schema!#REF!&Schema!#REF!&Schema!#REF!","v":{"$error":"#REF!"}},{"$error":"#REF!"},{"$f":"IF(A516=\"\",\"\",IF(LEN(Schema!#REF!)=2,1,IF(LEN(Schema!#REF!)=2,10,IF(LEN(Schema!#REF!)=2,100,0))))","v":{"$error":"#REF!"}},{"$error":"#REF!"},{"$f":"IF(A516=\"\",\"\",SUM(Tabel2[[#This Row],[I1]:[I2]]))","v":{"$error":"#REF!"}},{"$error":"#REF!"},{"$error":"#REF!"},{"$error":"#REF!"},{"$error":"#REF!"},{"$f":"IF(C516=\"\",\"\",IF(LEN(Tabel2[[#This Row],[Entiteit of attribuut]])=2,\"\",Tabel2[[#This Row],[Entiteit]]&\"_\"&Tabel2[[#This Row],[Entiteit of attribuut]]))","v":{"$error":"#REF!"}},{"$f":"IF(Schema!#REF!=\"\",\"\",Schema!#REF!)","v":{"$error":"#REF!"}},{"$f":"IF(Schema!#REF!=\"\",\"\",Schema!#REF!)","v":{"$error":"#REF!"}},{"$f":"IF(Schema!#REF!=\"\",\"\",Schema!#REF!)","v":{"$error":"#REF!"}},{"$f":"IF(Schema!#REF!=\"\",\"\",Schema!#REF!)","v":{"$error":"#REF!"}},{"$f":"IF(Schema!#REF!=\"\",\"\",Schema!#REF!)","v":{"$error":"#REF!"}}]
[{"$f":"Schema!#REF!&Schema!#REF!&Schema!#REF!&Schema!#REF!","v":{"$error":"#REF!"}},{"$error":"#REF!"},{"$f":"IF(A517=\"\",\"\",IF(LEN(Schema!#REF!)=2,1,IF(LEN(Schema!#REF!)=2,10,IF(LEN(Schema!#REF!)=2,100,0))))","v":{"$error":"#REF!"}},{"$error":"#REF!"},{"$f":"IF(A517=\"\",\"\",SUM(Tabel2[[#This Row],[I1]:[I2]]))","v":{"$error":"#REF!"}},{"$error":"#REF!"},{"$error":"#REF!"},{"$error":"#REF!"},{"$error":"#REF!"},{"$f":"IF(C517=\"\",\"\",IF(LEN(Tabel2[[#This Row],[Entiteit of attribuut]])=2,\"\",Tabel2[[#This Row],[Entiteit]]&\"_\"&Tabel2[[#This Row],[Entiteit of attribuut]]))","v":{"$error":"#REF!"}},{"$f":"IF(Schema!#REF!=\"\",\"\",Schema!#REF!)","v":{"$error":"#REF!"}},{"$f":"IF(Schema!#REF!=\"\",\"\",Schema!#REF!)","v":{"$error":"#REF!"}},{"$f":"IF(Schema!#REF!=\"\",\"\",Schema!#REF!)","v":{"$error":"#REF!"}},{"$f":"IF(Schema!#REF!=\"\",\"\",Schema!#REF!)","v":{"$error":"#REF!"}},{"$f":"IF(Schema!#REF!=\"\",\"\",Schema!#REF!)","v":{"$error":"#REF!"}}]
[{"$f":"Schema!#REF!&Schema!#REF!&Schema!#REF!&Schema!#REF!","v":{"$error":"#REF!"}},{"$error":"#REF!"},{"$f":"IF(A518=\"\",\"\",IF(LEN(Schema!#REF!)=2,1,IF(LEN(Schema!#REF!)=2,10,IF(LEN(Schema!#REF!)=2,100,0))))","v":{"$error":"#REF!"}},{"$error":"#REF!"},{"$f":"IF(A518=\"\",\"\",SUM(Tabel2[[#This Row],[I1]:[I2]]))","v":{"$error":"#REF!"}},{"$error":"#REF!"},{"$error":"#REF!"},{"$error":"#REF!"},{"$error":"#REF!"},{"$f":"IF(C518=\"\",\"\",IF(LEN(Tabel2[[#This Row],[Entiteit of attribuut]])=2,\"\",Tabel2[[#This Row],[Entiteit]]&\"_\"&Tabel2[[#This Row],[Entiteit of attribuut]]))","v":{"$error":"#REF!"}},{"$f":"IF(Schema!#REF!=\"\",\"\",Schema!#REF!)","v":{"$error":"#REF!"}},{"$f":"IF(Schema!#REF!=\"\",\"\",Schema!#REF!)","v":{"$error":"#REF!"}},{"$f":"IF(Schema!#REF!=\"\",\"\",Schema!#REF!)","v":{"$error":"#REF!"}},{"$f":"IF(Schema!#REF!=\"\",\"\",Schema!#REF!)","v":{"$error":"#REF!"}},{"$f":"IF(Schema!#REF!=\"\",\"\",Schema!#REF!)","v":{"$error":"#REF!"}}]
[{"$f":"Schema!#REF!&Schema!#REF!&Schema!#REF!&Schema!#REF!","v":{"$error":"#REF!"}},{"$error":"#REF!"},{"$f":"IF(A519=\"\",\"\",IF(LEN(Schema!#REF!)=2,1,IF(LEN(Schema!#REF!)=2,10,IF(LEN(Schema!#REF!)=2,100,0))))","v":{"$error":"#REF!"}},{"$error":"#REF!"},{"$f":"IF(A519=\"\",\"\",SUM(Tabel2[[#This Row],[I1]:[I2]]))","v":{"$error":"#REF!"}},{"$error":"#REF!"},{"$error":"#REF!"},{"$error":"#REF!"},{"$error":"#REF!"},{"$f":"IF(C519=\"\",\"\",IF(LEN(Tabel2[[#This Row],[Entiteit of attribuut]])=2,\"\",Tabel2[[#This Row],[Entiteit]]&\"_\"&Tabel2[[#This Row],[Entiteit of attribuut]]))","v":{"$error":"#REF!"}},{"$f":"IF(Schema!#REF!=\"\",\"\",Schema!#REF!)","v":{"$error":"#REF!"}},{"$f":"IF(Schema!#REF!=\"\",\"\",Schema!#REF!)","v":{"$error":"#REF!"}},{"$f":"IF(Schema!#REF!=\"\",\"\",Schema!#REF!)","v":{"$error":"#REF!"}},{"$f":"IF(Schema!#REF!=\"\",\"\",Schema!#REF!)","v":{"$error":"#REF!"}},{"$f":"IF(Schema!#REF!=\"\",\"\",Schema!#REF!)","v":{"$error":"#REF!"}}]
[{"$f":"Schema!#REF!&Schema!#REF!&Schema!#REF!&Schema!#REF!","v":{"$error":"#REF!"}},{"$error":"#REF!"},{"$f":"IF(A520=\"\",\"\",IF(LEN(Schema!#REF!)=2,1,IF(LEN(Schema!#REF!)=2,10,IF(LEN(Schema!#REF!)=2,100,0))))","v":{"$error":"#REF!"}},{"$error":"#REF!"},{"$f":"IF(A520=\"\",\"\",SUM(Tabel2[[#This Row],[I1]:[I2]]))","v":{"$error":"#REF!"}},{"$error":"#REF!"},{"$error":"#REF!"},{"$error":"#REF!"},{"$error":"#REF!"},{"$f":"IF(C520=\"\",\"\",IF(LEN(Tabel2[[#This Row],[Entiteit of attribuut]])=2,\"\",Tabel2[[#This Row],[Entiteit]]&\"_\"&Tabel2[[#This Row],[Entiteit of attribuut]]))","v":{"$error":"#REF!"}},{"$f":"IF(Schema!#REF!=\"\",\"\",Schema!#REF!)","v":{"$error":"#REF!"}},{"$f":"IF(Schema!#REF!=\"\",\"\",Schema!#REF!)","v":{"$error":"#REF!"}},{"$f":"IF(Schema!#REF!=\"\",\"\",Schema!#REF!)","v":{"$error":"#REF!"}},{"$f":"IF(Schema!#REF!=\"\",\"\",Schema!#REF!)","v":{"$error":"#REF!"}},{"$f":"IF(Schema!#REF!=\"\",\"\",Schema!#REF!)","v":{"$error":"#REF!"}}]
[{"$f":"Schema!#REF!&Schema!#REF!&Schema!#REF!&Schema!#REF!","v":{"$error":"#REF!"}},{"$error":"#REF!"},{"$f":"IF(A521=\"\",\"\",IF(LEN(Schema!#REF!)=2,1,IF(LEN(Schema!#REF!)=2,10,IF(LEN(Schema!#REF!)=2,100,0))))","v":{"$error":"#REF!"}},{"$error":"#REF!"},{"$f":"IF(A521=\"\",\"\",SUM(Tabel2[[#This Row],[I1]:[I2]]))","v":{"$error":"#REF!"}},{"$error":"#REF!"},{"$error":"#REF!"},{"$error":"#REF!"},{"$error":"#REF!"},{"$f":"IF(C521=\"\",\"\",IF(LEN(Tabel2[[#This Row],[Entiteit of attribuut]])=2,\"\",Tabel2[[#This Row],[Entiteit]]&\"_\"&Tabel2[[#This Row],[Entiteit of attribuut]]))","v":{"$error":"#REF!"}},{"$f":"IF(Schema!#REF!=\"\",\"\",Schema!#REF!)","v":{"$error":"#REF!"}},{"$f":"IF(Schema!#REF!=\"\",\"\",Schema!#REF!)","v":{"$error":"#REF!"}},{"$f":"IF(Schema!#REF!=\"\",\"\",Schema!#REF!)","v":{"$error":"#REF!"}},{"$f":"IF(Schema!#REF!=\"\",\"\",Schema!#REF!)","v":{"$error":"#REF!"}},{"$f":"IF(Schema!#REF!=\"\",\"\",Schema!#REF!)","v":{"$error":"#REF!"}}]
[{"$f":"Schema!#REF!&Schema!#REF!&Schema!#REF!&Schema!#REF!","v":{"$error":"#REF!"}},{"$error":"#REF!"},{"$f":"IF(A522=\"\",\"\",IF(LEN(Schema!#REF!)=2,1,IF(LEN(Schema!#REF!)=2,10,IF(LEN(Schema!#REF!)=2,100,0))))","v":{"$error":"#REF!"}},{"$error":"#REF!"},{"$f":"IF(A522=\"\",\"\",SUM(Tabel2[[#This Row],[I1]:[I2]]))","v":{"$error":"#REF!"}},{"$error":"#REF!"},{"$error":"#REF!"},{"$error":"#REF!"},{"$error":"#REF!"},{"$f":"IF(C522=\"\",\"\",IF(LEN(Tabel2[[#This Row],[Entiteit of attribuut]])=2,\"\",Tabel2[[#This Row],[Entiteit]]&\"_\"&Tabel2[[#This Row],[Entiteit of attribuut]]))","v":{"$error":"#REF!"}},{"$f":"IF(Schema!#REF!=\"\",\"\",Schema!#REF!)","v":{"$error":"#REF!"}},{"$f":"IF(Schema!#REF!=\"\",\"\",Schema!#REF!)","v":{"$error":"#REF!"}},{"$f":"IF(Schema!#REF!=\"\",\"\",Schema!#REF!)","v":{"$error":"#REF!"}},{"$f":"IF(Schema!#REF!=\"\",\"\",Schema!#REF!)","v":{"$error":"#REF!"}},{"$f":"IF(Schema!#REF!=\"\",\"\",Schema!#REF!)","v":{"$error":"#REF!"}}]
[{"$f":"Schema!#REF!&Schema!#REF!&Schema!#REF!&Schema!#REF!","v":{"$error":"#REF!"}},{"$error":"#REF!"},{"$f":"IF(A523=\"\",\"\",IF(LEN(Schema!#REF!)=2,1,IF(LEN(Schema!#REF!)=2,10,IF(LEN(Schema!#REF!)=2,100,0))))","v":{"$error":"#REF!"}},{"$error":"#REF!"},{"$f":"IF(A523=\"\",\"\",SUM(Tabel2[[#This Row],[I1]:[I2]]))","v":{"$error":"#REF!"}},{"$error":"#REF!"},{"$error":"#REF!"},{"$error":"#REF!"},{"$error":"#REF!"},{"$f":"IF(C523=\"\",\"\",IF(LEN(Tabel2[[#This Row],[Entiteit of attribuut]])=2,\"\",Tabel2[[#This Row],[Entiteit]]&\"_\"&Tabel2[[#This Row],[Entiteit of attribuut]]))","v":{"$error":"#REF!"}},{"$f":"IF(Schema!#REF!=\"\",\"\",Schema!#REF!)","v":{"$error":"#REF!"}},{"$f":"IF(Schema!#REF!=\"\",\"\",Schema!#REF!)","v":{"$error":"#REF!"}},{"$f":"IF(Schema!#REF!=\"\",\"\",Schema!#REF!)","v":{"$error":"#REF!"}},{"$f":"IF(Schema!#REF!=\"\",\"\",Schema!#REF!)","v":{"$error":"#REF!"}},{"$f":"IF(Schema!#REF!=\"\",\"\",Schema!#REF!)","v":{"$error":"#REF!"}}]
[{"$f":"Schema!#REF!&Schema!#REF!&Schema!#REF!&Schema!#REF!","v":{"$error":"#REF!"}},{"$error":"#REF!"},{"$f":"IF(A524=\"\",\"\",IF(LEN(Schema!#REF!)=2,1,IF(LEN(Schema!#REF!)=2,10,IF(LEN(Schema!#REF!)=2,100,0))))","v":{"$error":"#REF!"}},{"$error":"#REF!"},{"$f":"IF(A524=\"\",\"\",SUM(Tabel2[[#This Row],[I1]:[I2]]))","v":{"$error":"#REF!"}},{"$error":"#REF!"},{"$error":"#REF!"},{"$error":"#REF!"},{"$error":"#REF!"},{"$f":"IF(C524=\"\",\"\",IF(LEN(Tabel2[[#This Row],[Entiteit of attribuut]])=2,\"\",Tabel2[[#This Row],[Entiteit]]&\"_\"&Tabel2[[#This Row],[Entiteit of attribuut]]))","v":{"$error":"#REF!"}},{"$f":"IF(Schema!#REF!=\"\",\"\",Schema!#REF!)","v":{"$error":"#REF!"}},{"$f":"IF(Schema!#REF!=\"\",\"\",Schema!#REF!)","v":{"$error":"#REF!"}},{"$f":"IF(Schema!#REF!=\"\",\"\",Schema!#REF!)","v":{"$error":"#REF!"}},{"$f":"IF(Schema!#REF!=\"\",\"\",Schema!#REF!)","v":{"$error":"#REF!"}},{"$f":"IF(Schema!#REF!=\"\",\"\",Schema!#REF!)","v":{"$error":"#REF!"}}]
[{"$f":"Schema!#REF!&Schema!#REF!&Schema!#REF!&Schema!#REF!","v":{"$error":"#REF!"}},{"$error":"#REF!"},{"$f":"IF(A525=\"\",\"\",IF(LEN(Schema!#REF!)=2,1,IF(LEN(Schema!#REF!)=2,10,IF(LEN(Schema!#REF!)=2,100,0))))","v":{"$error":"#REF!"}},{"$error":"#REF!"},{"$f":"IF(A525=\"\",\"\",SUM(Tabel2[[#This Row],[I1]:[I2]]))","v":{"$error":"#REF!"}},{"$error":"#REF!"},{"$error":"#REF!"},{"$error":"#REF!"},{"$error":"#REF!"},{"$f":"IF(C525=\"\",\"\",IF(LEN(Tabel2[[#This Row],[Entiteit of attribuut]])=2,\"\",Tabel2[[#This Row],[Entiteit]]&\"_\"&Tabel2[[#This Row],[Entiteit of attribuut]]))","v":{"$error":"#REF!"}},{"$f":"IF(Schema!#REF!=\"\",\"\",Schema!#REF!)","v":{"$error":"#REF!"}},{"$f":"IF(Schema!#REF!=\"\",\"\",Schema!#REF!)","v":{"$error":"#REF!"}},{"$f":"IF(Schema!#REF!=\"\",\"\",Schema!#REF!)","v":{"$error":"#REF!"}},{"$f":"IF(Schema!#REF!=\"\",\"\",Schema!#REF!)","v":{"$error":"#REF!"}},{"$f":"IF(Schema!#REF!=\"\",\"\",Schema!#REF!)","v":{"$error":"#REF!"}}]
[{"$f":"Schema!#REF!&Schema!#REF!&Schema!#REF!&Schema!#REF!","v":{"$error":"#REF!"}},{"$error":"#REF!"},{"$f":"IF(A526=\"\",\"\",IF(LEN(Schema!#REF!)=2,1,IF(LEN(Schema!#REF!)=2,10,IF(LEN(Schema!#REF!)=2,100,0))))","v":{"$error":"#REF!"}},{"$error":"#REF!"},{"$f":"IF(A526=\"\",\"\",SUM(Tabel2[[#This Row],[I1]:[I2]]))","v":{"$error":"#REF!"}},{"$error":"#REF!"},{"$error":"#REF!"},{"$error":"#REF!"},{"$error":"#REF!"},{"$f":"IF(C526=\"\",\"\",IF(LEN(Tabel2[[#This Row],[Entiteit of attribuut]])=2,\"\",Tabel2[[#This Row],[Entiteit]]&\"_\"&Tabel2[[#This Row],[Entiteit of attribuut]]))","v":{"$error":"#REF!"}},{"$f":"IF(Schema!#REF!=\"\",\"\",Schema!#REF!)","v":{"$error":"#REF!"}},{"$f":"IF(Schema!#REF!=\"\",\"\",Schema!#REF!)","v":{"$error":"#REF!"}},{"$f":"IF(Schema!#REF!=\"\",\"\",Schema!#REF!)","v":{"$error":"#REF!"}},{"$f":"IF(Schema!#REF!=\"\",\"\",Schema!#REF!)","v":{"$error":"#REF!"}},{"$f":"IF(Schema!#REF!=\"\",\"\",Schema!#REF!)","v":{"$error":"#REF!"}}]
[{"$f":"Schema!#REF!&Schema!#REF!&Schema!#REF!&Schema!#REF!","v":{"$error":"#REF!"}},{"$error":"#REF!"},{"$f":"IF(A527=\"\",\"\",IF(LEN(Schema!#REF!)=2,1,IF(LEN(Schema!#REF!)=2,10,IF(LEN(Schema!#REF!)=2,100,0))))","v":{"$error":"#REF!"}},{"$error":"#REF!"},{"$f":"IF(A527=\"\",\"\",SUM(Tabel2[[#This Row],[I1]:[I2]]))","v":{"$error":"#REF!"}},{"$error":"#REF!"},{"$error":"#REF!"},{"$error":"#REF!"},{"$error":"#REF!"},{"$f":"IF(C527=\"\",\"\",IF(LEN(Tabel2[[#This Row],[Entiteit of attribuut]])=2,\"\",Tabel2[[#This Row],[Entiteit]]&\"_\"&Tabel2[[#This Row],[Entiteit of attribuut]]))","v":{"$error":"#REF!"}},{"$f":"IF(Schema!#REF!=\"\",\"\",Schema!#REF!)","v":{"$error":"#REF!"}},{"$f":"IF(Schema!#REF!=\"\",\"\",Schema!#REF!)","v":{"$error":"#REF!"}},{"$f":"IF(Schema!#REF!=\"\",\"\",Schema!#REF!)","v":{"$error":"#REF!"}},{"$f":"IF(Schema!#REF!=\"\",\"\",Schema!#REF!)","v":{"$error":"#REF!"}},{"$f":"IF(Schema!#REF!=\"\",\"\",Schema!#REF!)","v":{"$error":"#REF!"}}]
[{"$f":"Schema!#REF!&Schema!#REF!&Schema!#REF!&Schema!#REF!","v":{"$error":"#REF!"}},{"$error":"#REF!"},{"$f":"IF(A528=\"\",\"\",IF(LEN(Schema!#REF!)=2,1,IF(LEN(Schema!#REF!)=2,10,IF(LEN(Schema!#REF!)=2,100,0))))","v":{"$error":"#REF!"}},{"$error":"#REF!"},{"$f":"IF(A528=\"\",\"\",SUM(Tabel2[[#This Row],[I1]:[I2]]))","v":{"$error":"#REF!"}},{"$error":"#REF!"},{"$error":"#REF!"},{"$error":"#REF!"},{"$error":"#REF!"},{"$f":"IF(C528=\"\",\"\",IF(LEN(Tabel2[[#This Row],[Entiteit of attribuut]])=2,\"\",Tabel2[[#This Row],[Entiteit]]&\"_\"&Tabel2[[#This Row],[Entiteit of attribuut]]))","v":{"$error":"#REF!"}},{"$f":"IF(Schema!#REF!=\"\",\"\",Schema!#REF!)","v":{"$error":"#REF!"}},{"$f":"IF(Schema!#REF!=\"\",\"\",Schema!#REF!)","v":{"$error":"#REF!"}},{"$f":"IF(Schema!#REF!=\"\",\"\",Schema!#REF!)","v":{"$error":"#REF!"}},{"$f":"IF(Schema!#REF!=\"\",\"\",Schema!#REF!)","v":{"$error":"#REF!"}},{"$f":"IF(Schema!#REF!=\"\",\"\",Schema!#REF!)","v":{"$error":"#REF!"}}]
[{"$f":"Schema!#REF!&Schema!#REF!&Schema!#REF!&Schema!#REF!","v":{"$error":"#REF!"}},{"$error":"#REF!"},{"$f":"IF(A529=\"\",\"\",IF(LEN(Schema!#REF!)=2,1,IF(LEN(Schema!#REF!)=2,10,IF(LEN(Schema!#REF!)=2,100,0))))","v":{"$error":"#REF!"}},{"$error":"#REF!"},{"$f":"IF(A529=\"\",\"\",SUM(Tabel2[[#This Row],[I1]:[I2]]))","v":{"$error":"#REF!"}},{"$error":"#REF!"},{"$error":"#REF!"},{"$error":"#REF!"},{"$error":"#REF!"},{"$f":"IF(C529=\"\",\"\",IF(LEN(Tabel2[[#This Row],[Entiteit of attribuut]])=2,\"\",Tabel2[[#This Row],[Entiteit]]&\"_\"&Tabel2[[#This Row],[Entiteit of attribuut]]))","v":{"$error":"#REF!"}},{"$f":"IF(Schema!#REF!=\"\",\"\",Schema!#REF!)","v":{"$error":"#REF!"}},{"$f":"IF(Schema!#REF!=\"\",\"\",Schema!#REF!)","v":{"$error":"#REF!"}},{"$f":"IF(Schema!#REF!=\"\",\"\",Schema!#REF!)","v":{"$error":"#REF!"}},{"$f":"IF(Schema!#REF!=\"\",\"\",Schema!#REF!)","v":{"$error":"#REF!"}},{"$f":"IF(Schema!#REF!=\"\",\"\",Schema!#REF!)","v":{"$error":"#REF!"}}]
[{"$f":"Schema!#REF!&Schema!#REF!&Schema!#REF!&Schema!#REF!","v":{"$error":"#REF!"}},{"$error":"#REF!"},{"$f":"IF(A530=\"\",\"\",IF(LEN(Schema!#REF!)=2,1,IF(LEN(Schema!#REF!)=2,10,IF(LEN(Schema!#REF!)=2,100,0))))","v":{"$error":"#REF!"}},{"$error":"#REF!"},{"$f":"IF(A530=\"\",\"\",SUM(Tabel2[[#This Row],[I1]:[I2]]))","v":{"$error":"#REF!"}},{"$error":"#REF!"},{"$error":"#REF!"},{"$error":"#REF!"},{"$error":"#REF!"},{"$f":"IF(C530=\"\",\"\",IF(LEN(Tabel2[[#This Row],[Entiteit of attribuut]])=2,\"\",Tabel2[[#This Row],[Entiteit]]&\"_\"&Tabel2[[#This Row],[Entiteit of attribuut]]))","v":{"$error":"#REF!"}},{"$f":"IF(Schema!#REF!=\"\",\"\",Schema!#REF!)","v":{"$error":"#REF!"}},{"$f":"IF(Schema!#REF!=\"\",\"\",Schema!#REF!)","v":{"$error":"#REF!"}},{"$f":"IF(Schema!#REF!=\"\",\"\",Schema!#REF!)","v":{"$error":"#REF!"}},{"$f":"IF(Schema!#REF!=\"\",\"\",Schema!#REF!)","v":{"$error":"#REF!"}},{"$f":"IF(Schema!#REF!=\"\",\"\",Schema!#REF!)","v":{"$error":"#REF!"}}]
[{"$f":"Schema!#REF!&Schema!#REF!&Schema!#REF!&Schema!#REF!","v":{"$error":"#REF!"}},{"$error":"#REF!"},{"$f":"IF(A531=\"\",\"\",IF(LEN(Schema!#REF!)=2,1,IF(LEN(Schema!#REF!)=2,10,IF(LEN(Schema!#REF!)=2,100,0))))","v":{"$error":"#REF!"}},{"$error":"#REF!"},{"$f":"IF(A531=\"\",\"\",SUM(Tabel2[[#This Row],[I1]:[I2]]))","v":{"$error":"#REF!"}},{"$error":"#REF!"},{"$error":"#REF!"},{"$error":"#REF!"},{"$error":"#REF!"},{"$f":"IF(C531=\"\",\"\",IF(LEN(Tabel2[[#This Row],[Entiteit of attribuut]])=2,\"\",Tabel2[[#This Row],[Entiteit]]&\"_\"&Tabel2[[#This Row],[Entiteit of attribuut]]))","v":{"$error":"#REF!"}},{"$f":"IF(Schema!#REF!=\"\",\"\",Schema!#REF!)","v":{"$error":"#REF!"}},{"$f":"IF(Schema!#REF!=\"\",\"\",Schema!#REF!)","v":{"$error":"#REF!"}},{"$f":"IF(Schema!#REF!=\"\",\"\",Schema!#REF!)","v":{"$error":"#REF!"}},{"$f":"IF(Schema!#REF!=\"\",\"\",Schema!#REF!)","v":{"$error":"#REF!"}},{"$f":"IF(Schema!#REF!=\"\",\"\",Schema!#REF!)","v":{"$error":"#REF!"}}]
[{"$f":"Schema!#REF!&Schema!#REF!&Schema!#REF!&Schema!#REF!","v":{"$error":"#REF!"}},{"$error":"#REF!"},{"$f":"IF(A532=\"\",\"\",IF(LEN(Schema!#REF!)=2,1,IF(LEN(Schema!#REF!)=2,10,IF(LEN(Schema!#REF!)=2,100,0))))","v":{"$error":"#REF!"}},{"$error":"#REF!"},{"$f":"IF(A532=\"\",\"\",SUM(Tabel2[[#This Row],[I1]:[I2]]))","v":{"$error":"#REF!"}},{"$error":"#REF!"},{"$error":"#REF!"},{"$error":"#REF!"},{"$error":"#REF!"},{"$f":"IF(C532=\"\",\"\",IF(LEN(Tabel2[[#This Row],[Entiteit of attribuut]])=2,\"\",Tabel2[[#This Row],[Entiteit]]&\"_\"&Tabel2[[#This Row],[Entiteit of attribuut]]))","v":{"$error":"#REF!"}},{"$f":"IF(Schema!#REF!=\"\",\"\",Schema!#REF!)","v":{"$error":"#REF!"}},{"$f":"IF(Schema!#REF!=\"\",\"\",Schema!#REF!)","v":{"$error":"#REF!"}},{"$f":"IF(Schema!#REF!=\"\",\"\",Schema!#REF!)","v":{"$error":"#REF!"}},{"$f":"IF(Schema!#REF!=\"\",\"\",Schema!#REF!)","v":{"$error":"#REF!"}},{"$f":"IF(Schema!#REF!=\"\",\"\",Schema!#REF!)","v":{"$error":"#REF!"}}]
[{"$f":"Schema!#REF!&Schema!#REF!&Schema!#REF!&Schema!#REF!","v":{"$error":"#REF!"}},{"$error":"#REF!"},{"$f":"IF(A533=\"\",\"\",IF(LEN(Schema!#REF!)=2,1,IF(LEN(Schema!#REF!)=2,10,IF(LEN(Schema!#REF!)=2,100,0))))","v":{"$error":"#REF!"}},{"$error":"#REF!"},{"$f":"IF(A533=\"\",\"\",SUM(Tabel2[[#This Row],[I1]:[I2]]))","v":{"$error":"#REF!"}},{"$error":"#REF!"},{"$error":"#REF!"},{"$error":"#REF!"},{"$error":"#REF!"},{"$f":"IF(C533=\"\",\"\",IF(LEN(Tabel2[[#This Row],[Entiteit of attribuut]])=2,\"\",Tabel2[[#This Row],[Entiteit]]&\"_\"&Tabel2[[#This Row],[Entiteit of attribuut]]))","v":{"$error":"#REF!"}},{"$f":"IF(Schema!#REF!=\"\",\"\",Schema!#REF!)","v":{"$error":"#REF!"}},{"$f":"IF(Schema!#REF!=\"\",\"\",Schema!#REF!)","v":{"$error":"#REF!"}},{"$f":"IF(Schema!#REF!=\"\",\"\",Schema!#REF!)","v":{"$error":"#REF!"}},{"$f":"IF(Schema!#REF!=\"\",\"\",Schema!#REF!)","v":{"$error":"#REF!"}},{"$f":"IF(Schema!#REF!=\"\",\"\",Schema!#REF!)","v":{"$error":"#REF!"}}]
[{"$f":"Schema!#REF!&Schema!#REF!&Schema!#REF!&Schema!#REF!","v":{"$error":"#REF!"}},{"$error":"#REF!"},{"$f":"IF(A534=\"\",\"\",IF(LEN(Schema!#REF!)=2,1,IF(LEN(Schema!#REF!)=2,10,IF(LEN(Schema!#REF!)=2,100,0))))","v":{"$error":"#REF!"}},{"$error":"#REF!"},{"$f":"IF(A534=\"\",\"\",SUM(Tabel2[[#This Row],[I1]:[I2]]))","v":{"$error":"#REF!"}},{"$error":"#REF!"},{"$error":"#REF!"},{"$error":"#REF!"},{"$error":"#REF!"},{"$f":"IF(C534=\"\",\"\",IF(LEN(Tabel2[[#This Row],[Entiteit of attribuut]])=2,\"\",Tabel2[[#This Row],[Entiteit]]&\"_\"&Tabel2[[#This Row],[Entiteit of attribuut]]))","v":{"$error":"#REF!"}},{"$f":"IF(Schema!#REF!=\"\",\"\",Schema!#REF!)","v":{"$error":"#REF!"}},{"$f":"IF(Schema!#REF!=\"\",\"\",Schema!#REF!)","v":{"$error":"#REF!"}},{"$f":"IF(Schema!#REF!=\"\",\"\",Schema!#REF!)","v":{"$error":"#REF!"}},{"$f":"IF(Schema!#REF!=\"\",\"\",Schema!#REF!)","v":{"$error":"#REF!"}},{"$f":"IF(Schema!#REF!=\"\",\"\",Schema!#REF!)","v":{"$error":"#REF!"}}]
[{"$f":"Schema!#REF!&Schema!#REF!&Schema!#REF!&Schema!#REF!","v":{"$error":"#REF!"}},{"$error":"#REF!"},{"$f":"IF(A535=\"\",\"\",IF(LEN(Schema!#REF!)=2,1,IF(LEN(Schema!#REF!)=2,10,IF(LEN(Schema!#REF!)=2,100,0))))","v":{"$error":"#REF!"}},{"$error":"#REF!"},{"$f":"IF(A535=\"\",\"\",SUM(Tabel2[[#This Row],[I1]:[I2]]))","v":{"$error":"#REF!"}},{"$error":"#REF!"},{"$error":"#REF!"},{"$error":"#REF!"},{"$error":"#REF!"},{"$f":"IF(C535=\"\",\"\",IF(LEN(Tabel2[[#This Row],[Entiteit of attribuut]])=2,\"\",Tabel2[[#This Row],[Entiteit]]&\"_\"&Tabel2[[#This Row],[Entiteit of attribuut]]))","v":{"$error":"#REF!"}},{"$f":"IF(Schema!#REF!=\"\",\"\",Schema!#REF!)","v":{"$error":"#REF!"}},{"$f":"IF(Schema!#REF!=\"\",\"\",Schema!#REF!)","v":{"$error":"#REF!"}},{"$f":"IF(Schema!#REF!=\"\",\"\",Schema!#REF!)","v":{"$error":"#REF!"}},{"$f":"IF(Schema!#REF!=\"\",\"\",Schema!#REF!)","v":{"$error":"#REF!"}},{"$f":"IF(Schema!#REF!=\"\",\"\",Schema!#REF!)","v":{"$error":"#REF!"}}]
[{"$f":"Schema!#REF!&Schema!#REF!&Schema!#REF!&Schema!#REF!","v":{"$error":"#REF!"}},{"$error":"#REF!"},{"$f":"IF(A536=\"\",\"\",IF(LEN(Schema!#REF!)=2,1,IF(LEN(Schema!#REF!)=2,10,IF(LEN(Schema!#REF!)=2,100,0))))","v":{"$error":"#REF!"}},{"$error":"#REF!"},{"$f":"IF(A536=\"\",\"\",SUM(Tabel2[[#This Row],[I1]:[I2]]))","v":{"$error":"#REF!"}},{"$error":"#REF!"},{"$error":"#REF!"},{"$error":"#REF!"},{"$error":"#REF!"},{"$f":"IF(C536=\"\",\"\",IF(LEN(Tabel2[[#This Row],[Entiteit of attribuut]])=2,\"\",Tabel2[[#This Row],[Entiteit]]&\"_\"&Tabel2[[#This Row],[Entiteit of attribuut]]))","v":{"$error":"#REF!"}},{"$f":"IF(Schema!#REF!=\"\",\"\",Schema!#REF!)","v":{"$error":"#REF!"}},{"$f":"IF(Schema!#REF!=\"\",\"\",Schema!#REF!)","v":{"$error":"#REF!"}},{"$f":"IF(Schema!#REF!=\"\",\"\",Schema!#REF!)","v":{"$error":"#REF!"}},{"$f":"IF(Schema!#REF!=\"\",\"\",Schema!#REF!)","v":{"$error":"#REF!"}},{"$f":"IF(Schema!#REF!=\"\",\"\",Schema!#REF!)","v":{"$error":"#REF!"}}]
[{"$f":"Schema!#REF!&Schema!#REF!&Schema!#REF!&Schema!#REF!","v":{"$error":"#REF!"}},{"$error":"#REF!"},{"$f":"IF(A537=\"\",\"\",IF(LEN(Schema!#REF!)=2,1,IF(LEN(Schema!#REF!)=2,10,IF(LEN(Schema!#REF!)=2,100,0))))","v":{"$error":"#REF!"}},{"$error":"#REF!"},{"$f":"IF(A537=\"\",\"\",SUM(Tabel2[[#This Row],[I1]:[I2]]))","v":{"$error":"#REF!"}},{"$error":"#REF!"},{"$error":"#REF!"},{"$error":"#REF!"},{"$error":"#REF!"},{"$f":"IF(C537=\"\",\"\",IF(LEN(Tabel2[[#This Row],[Entiteit of attribuut]])=2,\"\",Tabel2[[#This Row],[Entiteit]]&\"_\"&Tabel2[[#This Row],[Entiteit of attribuut]]))","v":{"$error":"#REF!"}},{"$f":"IF(Schema!#REF!=\"\",\"\",Schema!#REF!)","v":{"$error":"#REF!"}},{"$f":"IF(Schema!#REF!=\"\",\"\",Schema!#REF!)","v":{"$error":"#REF!"}},{"$f":"IF(Schema!#REF!=\"\",\"\",Schema!#REF!)","v":{"$error":"#REF!"}},{"$f":"IF(Schema!#REF!=\"\",\"\",Schema!#REF!)","v":{"$error":"#REF!"}},{"$f":"IF(Schema!#REF!=\"\",\"\",Schema!#REF!)","v":{"$error":"#REF!"}}]
[{"$f":"Schema!#REF!&Schema!#REF!&Schema!#REF!&Schema!#REF!","v":{"$error":"#REF!"}},{"$error":"#REF!"},{"$f":"IF(A538=\"\",\"\",IF(LEN(Schema!#REF!)=2,1,IF(LEN(Schema!#REF!)=2,10,IF(LEN(Schema!#REF!)=2,100,0))))","v":{"$error":"#REF!"}},{"$error":"#REF!"},{"$f":"IF(A538=\"\",\"\",SUM(Tabel2[[#This Row],[I1]:[I2]]))","v":{"$error":"#REF!"}},{"$error":"#REF!"},{"$error":"#REF!"},{"$error":"#REF!"},{"$error":"#REF!"},{"$f":"IF(C538=\"\",\"\",IF(LEN(Tabel2[[#This Row],[Entiteit of attribuut]])=2,\"\",Tabel2[[#This Row],[Entiteit]]&\"_\"&Tabel2[[#This Row],[Entiteit of attribuut]]))","v":{"$error":"#REF!"}},{"$f":"IF(Schema!#REF!=\"\",\"\",Schema!#REF!)","v":{"$error":"#REF!"}},{"$f":"IF(Schema!#REF!=\"\",\"\",Schema!#REF!)","v":{"$error":"#REF!"}},{"$f":"IF(Schema!#REF!=\"\",\"\",Schema!#REF!)","v":{"$error":"#REF!"}},{"$f":"IF(Schema!#REF!=\"\",\"\",Schema!#REF!)","v":{"$error":"#REF!"}},{"$f":"IF(Schema!#REF!=\"\",\"\",Schema!#REF!)","v":{"$error":"#REF!"}}]
[{"$f":"Schema!#REF!&Schema!#REF!&Schema!#REF!&Schema!#REF!","v":{"$error":"#REF!"}},{"$error":"#REF!"},{"$f":"IF(A539=\"\",\"\",IF(LEN(Schema!#REF!)=2,1,IF(LEN(Schema!#REF!)=2,10,IF(LEN(Schema!#REF!)=2,100,0))))","v":{"$error":"#REF!"}},{"$error":"#REF!"},{"$f":"IF(A539=\"\",\"\",SUM(Tabel2[[#This Row],[I1]:[I2]]))","v":{"$error":"#REF!"}},{"$error":"#REF!"},{"$error":"#REF!"},{"$error":"#REF!"},{"$error":"#REF!"},{"$f":"IF(C539=\"\",\"\",IF(LEN(Tabel2[[#This Row],[Entiteit of attribuut]])=2,\"\",Tabel2[[#This Row],[Entiteit]]&\"_\"&Tabel2[[#This Row],[Entiteit of attribuut]]))","v":{"$error":"#REF!"}},{"$f":"IF(Schema!#REF!=\"\",\"\",Schema!#REF!)","v":{"$error":"#REF!"}},{"$f":"IF(Schema!#REF!=\"\",\"\",Schema!#REF!)","v":{"$error":"#REF!"}},{"$f":"IF(Schema!#REF!=\"\",\"\",Schema!#REF!)","v":{"$error":"#REF!"}},{"$f":"IF(Schema!#REF!=\"\",\"\",Schema!#REF!)","v":{"$error":"#REF!"}},{"$f":"IF(Schema!#REF!=\"\",\"\",Schema!#REF!)","v":{"$error":"#REF!"}}]
[{"$f":"Schema!#REF!&Schema!#REF!&Schema!#REF!&Schema!#REF!","v":{"$error":"#REF!"}},{"$error":"#REF!"},{"$f":"IF(A540=\"\",\"\",IF(LEN(Schema!#REF!)=2,1,IF(LEN(Schema!#REF!)=2,10,IF(LEN(Schema!#REF!)=2,100,0))))","v":{"$error":"#REF!"}},{"$error":"#REF!"},{"$f":"IF(A540=\"\",\"\",SUM(Tabel2[[#This Row],[I1]:[I2]]))","v":{"$error":"#REF!"}},{"$error":"#REF!"},{"$error":"#REF!"},{"$error":"#REF!"},{"$error":"#REF!"},{"$f":"IF(C540=\"\",\"\",IF(LEN(Tabel2[[#This Row],[Entiteit of attribuut]])=2,\"\",Tabel2[[#This Row],[Entiteit]]&\"_\"&Tabel2[[#This Row],[Entiteit of attribuut]]))","v":{"$error":"#REF!"}},{"$f":"IF(Schema!#REF!=\"\",\"\",Schema!#REF!)","v":{"$error":"#REF!"}},{"$f":"IF(Schema!#REF!=\"\",\"\",Schema!#REF!)","v":{"$error":"#REF!"}},{"$f":"IF(Schema!#REF!=\"\",\"\",Schema!#REF!)","v":{"$error":"#REF!"}},{"$f":"IF(Schema!#REF!=\"\",\"\",Schema!#REF!)","v":{"$error":"#REF!"}},{"$f":"IF(Schema!#REF!=\"\",\"\",Schema!#REF!)","v":{"$error":"#REF!"}}]
[{"$f":"Schema!#REF!&Schema!#REF!&Schema!#REF!&Schema!#REF!","v":{"$error":"#REF!"}},{"$error":"#REF!"},{"$f":"IF(A541=\"\",\"\",IF(LEN(Schema!#REF!)=2,1,IF(LEN(Schema!#REF!)=2,10,IF(LEN(Schema!#REF!)=2,100,0))))","v":{"$error":"#REF!"}},{"$error":"#REF!"},{"$f":"IF(A541=\"\",\"\",SUM(Tabel2[[#This Row],[I1]:[I2]]))","v":{"$error":"#REF!"}},{"$error":"#REF!"},{"$error":"#REF!"},{"$error":"#REF!"},{"$error":"#REF!"},{"$f":"IF(C541=\"\",\"\",IF(LEN(Tabel2[[#This Row],[Entiteit of attribuut]])=2,\"\",Tabel2[[#This Row],[Entiteit]]&\"_\"&Tabel2[[#This Row],[Entiteit of attribuut]]))","v":{"$error":"#REF!"}},{"$f":"IF(Schema!#REF!=\"\",\"\",Schema!#REF!)","v":{"$error":"#REF!"}},{"$f":"IF(Schema!#REF!=\"\",\"\",Schema!#REF!)","v":{"$error":"#REF!"}},{"$f":"IF(Schema!#REF!=\"\",\"\",Schema!#REF!)","v":{"$error":"#REF!"}},{"$f":"IF(Schema!#REF!=\"\",\"\",Schema!#REF!)","v":{"$error":"#REF!"}},{"$f":"IF(Schema!#REF!=\"\",\"\",Schema!#REF!)","v":{"$error":"#REF!"}}]

{"sheet":"Functielijst","index":6,"n_rows":7,"n_cols":1,"rows_kept":7,"cut":false,"hidden":true,"merged":[]}
["Kolom1"]
["Functielijst"]
["premieBerekening_aanroep"]
["premieBerekening_resultaat"]
["Acceptatie_aanroep"]
["Acceptatie_resultaat"]
["kunnenAanleveren"]